Simulation Results: chip

 
23/07/2026 19:40:32 DVSim: v1.50.0 sha: 40dffb6 json Branch: master Tool: vcs [unknown]
Coverage statistics
  • Total
  • 67.53 %
  • code
  • 62.12 %
  • assert
  • 76.58 %
  • func
  • 63.88 %
  • line
  • 67.14 %
  • branch
  • 74.84 %
  • cond
  • 66.13 %
  • toggle
  • 45.37 %
  • FSM
  • 57.14 %
Validation stages
V1
27.27%
V2
31.16%
V2S
100.00%
V3
0.00%
unmapped
40.00%
Testpoint Test Max Runtime Sim Time Pass Total %
chip_sw_uart_tx_rx 0 1 0.00
chip_sw_uart_tx_rx 13.169s 0.000us 0 1 0.00
chip_sw_uart_rx_overflow 0 1 0.00
chip_sw_uart_tx_rx 13.169s 0.000us 0 1 0.00
chip_sw_uart_rand_baudrate 0 1 0.00
chip_sw_uart_rand_baudrate 28.405s 0.000us 0 1 0.00
chip_sw_uart_tx_rx_alt_clk_freq 0 1 0.00
chip_sw_uart_tx_rx_alt_clk_freq 25.788s 0.000us 0 1 0.00
chip_sw_gpio_out 1 1 100.00
chip_sw_gpio 359.160s 286.763us 1 1 100.00
chip_sw_gpio_in 1 1 100.00
chip_sw_gpio 359.160s 286.763us 1 1 100.00
chip_sw_gpio_irq 1 1 100.00
chip_sw_gpio 359.160s 286.763us 1 1 100.00
chip_sw_example_tests 1 4 25.00
chip_sw_example_rom 37.170s 10.400us 0 1 0.00
chip_sw_example_manufacturer 12.364s 0.000us 0 1 0.00
chip_sw_example_concurrency 194.210s 168.851us 1 1 100.00
chip_sw_uart_smoketest_signed 24.321s 0.000us 0 1 0.00
csr_bit_bash 0 1 0.00
chip_csr_bit_bash 8.030s 0.000us 0 1 0.00
csr_aliasing 0 1 0.00
chip_csr_aliasing 8.570s 0.000us 0 1 0.00
regwen_csr_and_corresponding_lockable_csr 0 1 0.00
chip_csr_aliasing 8.570s 0.000us 0 1 0.00
xbar_smoke 1 1 100.00
xbar_smoke 24.980s 62.079us 1 1 100.00
Testpoint Test Max Runtime Sim Time Pass Total %
chip_sw_spi_device_flash_mode 0 1 0.00
chip_sw_uart_tx_rx_bootstrap 79.954s 0.000us 0 1 0.00
chip_sw_spi_device_pass_through 1 1 100.00
chip_sw_spi_device_pass_through 2684.460s 4411.014us 1 1 100.00
chip_sw_spi_device_pass_through_collision 0 1 0.00
chip_sw_spi_device_pass_through_collision 264.410s 213.058us 0 1 0.00
chip_sw_spi_device_tpm 0 1 0.00
chip_sw_spi_device_tpm 14.636s 0.000us 0 1 0.00
chip_sw_spi_host_tx_rx 0 1 0.00
chip_sw_spi_host_tx_rx 18.104s 0.000us 0 1 0.00
chip_sw_i2c_host_tx_rx 0 1 0.00
chip_sw_i2c_host_tx_rx 13.620s 0.000us 0 1 0.00
chip_sw_i2c_device_tx_rx 0 1 0.00
chip_sw_i2c_device_tx_rx 16.184s 0.000us 0 1 0.00
chip_pin_mux 0 1 0.00
chip_padctrl_attributes 2.570s 0.000us 0 1 0.00
chip_padctrl_attributes 0 1 0.00
chip_padctrl_attributes 2.570s 0.000us 0 1 0.00
chip_sw_sleep_pin_wake 0 1 0.00
chip_sw_sleep_pin_wake 12.049s 0.000us 0 1 0.00
chip_sw_sleep_pin_retention 0 1 0.00
chip_sw_sleep_pin_retention 22.207s 0.000us 0 1 0.00
chip_sw_data_integrity 0 1 0.00
chip_sw_data_integrity_escalation 9.250s 0.000us 0 1 0.00
chip_sw_instruction_integrity 0 1 0.00
chip_sw_data_integrity_escalation 9.250s 0.000us 0 1 0.00
chip_jtag_csr_rw 0 1 0.00
chip_jtag_csr_rw 127.830s 132.376us 0 1 0.00
chip_jtag_mem_access 0 1 0.00
chip_jtag_mem_access 123.270s 131.488us 0 1 0.00
chip_rv_dm_ndm_reset_req 1 1 100.00
chip_rv_dm_ndm_reset_req 353.550s 310.463us 1 1 100.00
chip_sw_rv_dm_ndm_reset_req_when_cpu_halted 0 1 0.00
chip_sw_rv_dm_ndm_reset_req_when_cpu_halted 9.277s 0.000us 0 1 0.00
chip_rv_dm_access_after_wakeup 0 1 0.00
chip_sw_rv_dm_access_after_wakeup 10.411s 0.000us 0 1 0.00
chip_rv_dm_lc_disabled 0 1 0.00
chip_rv_dm_lc_disabled 83.640s 128.152us 0 1 0.00
chip_sw_timer 1 1 100.00
chip_sw_rv_timer_irq 249.460s 266.947us 1 1 100.00
chip_sw_aon_timer_wakeup_irq 0 1 0.00
chip_sw_aon_timer_irq 449.430s 522.248us 0 1 0.00
chip_sw_aon_timer_wdog_bark_irq 0 1 0.00
chip_sw_aon_timer_irq 449.430s 522.248us 0 1 0.00
chip_sw_aon_timer_wdog_lc_escalate 1 1 100.00
chip_sw_aon_timer_wdog_lc_escalate 453.400s 386.426us 1 1 100.00
chip_sw_aon_timer_wdog_bite_reset 0 1 0.00
chip_sw_aon_timer_wdog_bite_reset 250.100s 182.643us 0 1 0.00
chip_sw_aon_timer_sleep_wdog_bite_reset 0 1 0.00
chip_sw_aon_timer_wdog_bite_reset 250.100s 182.643us 0 1 0.00
chip_sw_aon_timer_sleep_wdog_sleep_pause 1 1 100.00
chip_sw_aon_timer_sleep_wdog_sleep_pause 390.580s 2310.124us 1 1 100.00
chip_sw_plic_sw_irq 1 1 100.00
chip_sw_plic_sw_irq 190.760s 164.268us 1 1 100.00
chip_sw_clkmgr_idle_trans 4 4 100.00
chip_sw_otbn_randomness 327.820s 244.963us 1 1 100.00
chip_sw_aes_idle 197.420s 165.804us 1 1 100.00
chip_sw_hmac_enc_idle 196.660s 178.165us 1 1 100.00
chip_sw_kmac_idle 198.670s 164.105us 1 1 100.00
chip_sw_clkmgr_off_trans 0 4 0.00
chip_sw_clkmgr_off_aes_trans 216.120s 185.264us 0 1 0.00
chip_sw_clkmgr_off_hmac_trans 211.240s 185.280us 0 1 0.00
chip_sw_clkmgr_off_kmac_trans 228.830s 185.232us 0 1 0.00
chip_sw_clkmgr_off_otbn_trans 214.990s 185.248us 0 1 0.00
chip_sw_clkmgr_jitter 1 7 14.29
chip_sw_otbn_ecdsa_op_irq_jitter_en 40.050s 10.380us 0 1 0.00
chip_sw_aes_enc_jitter_en 40.480s 10.180us 0 1 0.00
chip_sw_hmac_enc_jitter_en 43.240s 10.400us 0 1 0.00
chip_sw_keymgr_dpe_key_derivation_jitter_en 40.050s 10.220us 0 1 0.00
chip_sw_kmac_mode_kmac_jitter_en 41.100s 10.220us 0 1 0.00
chip_sw_sram_ctrl_scrambled_access_jitter_en 12.788s 0.000us 0 1 0.00
chip_sw_clkmgr_jitter 193.330s 161.221us 1 1 100.00
chip_sw_clkmgr_extended_range 1 8 12.50
chip_sw_clkmgr_jitter_reduced_freq 434.000s 1963.039us 1 1 100.00
chip_sw_otbn_ecdsa_op_irq_jitter_en_reduced_freq 41.750s 10.200us 0 1 0.00
chip_sw_aes_enc_jitter_en_reduced_freq 45.020s 10.260us 0 1 0.00
chip_sw_hmac_enc_jitter_en_reduced_freq 42.550s 10.380us 0 1 0.00
chip_sw_keymgr_dpe_key_derivation_jitter_en_reduced_freq 42.420s 10.140us 0 1 0.00
chip_sw_kmac_mode_kmac_jitter_en_reduced_freq 43.040s 10.200us 0 1 0.00
chip_sw_sram_ctrl_scrambled_access_jitter_en_reduced_freq 40.290s 10.400us 0 1 0.00
chip_sw_csrng_edn_concurrency_reduced_freq 39.240s 10.320us 0 1 0.00
chip_sw_clkmgr_deep_sleep_frequency 0 1 0.00
chip_sw_ast_clk_outputs 20.084s 0.000us 0 1 0.00
chip_sw_clkmgr_sleep_frequency 0 1 0.00
chip_sw_clkmgr_sleep_frequency 8.791s 0.000us 0 1 0.00
chip_sw_clkmgr_reset_frequency 0 1 0.00
chip_sw_clkmgr_reset_frequency 8.880s 0.000us 0 1 0.00
chip_sw_clkmgr_escalation_reset 0 1 0.00
chip_sw_all_escalation_resets 1076.850s 943.642us 0 1 0.00
chip_sw_pwrmgr_external_full_reset 0 1 0.00
chip_sw_pwrmgr_full_aon_reset 128.190s 118.440us 0 1 0.00
chip_sw_pwrmgr_sleep_all_reset_reqs 0 1 0.00
chip_sw_aon_timer_wdog_bite_reset 250.100s 182.643us 0 1 0.00
chip_sw_pwrmgr_wdog_reset 0 1 0.00
chip_sw_pwrmgr_wdog_reset 9.214s 0.000us 0 1 0.00
chip_sw_pwrmgr_aon_power_glitch_reset 0 1 0.00
chip_sw_pwrmgr_full_aon_reset 128.190s 118.440us 0 1 0.00
chip_sw_pwrmgr_main_power_glitch_reset 0 1 0.00
chip_sw_pwrmgr_main_power_glitch_reset 10.739s 0.000us 0 1 0.00
chip_sw_pwrmgr_random_sleep_power_glitch_reset 0 1 0.00
chip_sw_pwrmgr_random_sleep_power_glitch_reset 46.085s 0.000us 0 1 0.00
chip_sw_pwrmgr_deep_sleep_power_glitch_reset 0 1 0.00
chip_sw_pwrmgr_deep_sleep_power_glitch_reset 10.778s 0.000us 0 1 0.00
chip_sw_pwrmgr_sleep_power_glitch_reset 0 1 0.00
chip_sw_pwrmgr_sleep_power_glitch_reset 9.110s 0.000us 0 1 0.00
chip_sw_pwrmgr_sleep_disabled 0 1 0.00
chip_sw_pwrmgr_sleep_disabled 9.570s 0.000us 0 1 0.00
chip_sw_pwrmgr_escalation_reset 0 1 0.00
chip_sw_all_escalation_resets 1076.850s 943.642us 0 1 0.00
chip_sw_rstmgr_sys_reset_info 1 1 100.00
chip_rv_dm_ndm_reset_req 353.550s 310.463us 1 1 100.00
chip_sw_rstmgr_cpu_info 0 1 0.00
chip_sw_rstmgr_cpu_info 407.960s 412.064us 0 1 0.00
chip_sw_rstmgr_sw_req_reset 1 1 100.00
chip_sw_rstmgr_sw_req 334.010s 305.368us 1 1 100.00
chip_sw_rstmgr_alert_info 0 1 0.00
chip_sw_rstmgr_alert_info 384.380s 331.075us 0 1 0.00
chip_sw_rstmgr_sw_rst 1 1 100.00
chip_sw_rstmgr_sw_rst 208.600s 163.740us 1 1 100.00
chip_sw_rstmgr_escalation_reset 0 1 0.00
chip_sw_all_escalation_resets 1076.850s 943.642us 0 1 0.00
chip_sw_alert_handler_alerts 0 1 0.00
chip_sw_alert_test 24.624s 0.000us 0 1 0.00
chip_sw_alert_handler_escalations 0 1 0.00
chip_sw_alert_handler_escalation 57.335s 0.000us 0 1 0.00
chip_sw_all_escalation_resets 0 1 0.00
chip_sw_all_escalation_resets 1076.850s 943.642us 0 1 0.00
chip_sw_alert_handler_entropy 0 1 0.00
chip_sw_alert_handler_entropy 21.572s 0.000us 0 1 0.00
chip_sw_alert_handler_crashdump 0 1 0.00
chip_sw_rstmgr_alert_info 384.380s 331.075us 0 1 0.00
chip_sw_alert_handler_ping_timeout 1 1 100.00
chip_sw_alert_handler_ping_timeout 269.590s 224.026us 1 1 100.00
chip_sw_alert_handler_lpg_sleep_mode_alerts 0 1 0.00
chip_sw_alert_handler_lpg_sleep_mode_alerts 68.802s 0.000us 0 1 0.00
chip_sw_alert_handler_lpg_sleep_mode_pings 0 1 0.00
chip_sw_alert_handler_lpg_sleep_mode_pings 67.900s 0.000us 0 1 0.00
chip_sw_alert_handler_lpg_clock_off 0 1 0.00
chip_sw_alert_handler_lpg_clkoff 82.099s 0.000us 0 1 0.00
chip_sw_alert_handler_lpg_reset_toggle 0 1 0.00
chip_sw_alert_handler_lpg_reset_toggle 95.481s 0.000us 0 1 0.00
chip_sw_alert_handler_reverse_ping_in_deep_sleep 0 1 0.00
chip_sw_alert_handler_reverse_ping_in_deep_sleep 83.105s 0.000us 0 1 0.00
chip_sw_lc_ctrl_alert_handler_escalation 0 1 0.00
chip_sw_alert_handler_escalation 57.335s 0.000us 0 1 0.00
chip_sw_lc_ctrl_jtag_access 0 1 0.00
chip_sw_lc_ctrl_transition 11.371s 0.000us 0 1 0.00
chip_sw_lc_ctrl_otp_hw_cfg 0 1 0.00
chip_sw_lc_ctrl_otp_hw_cfg 11.852s 0.000us 0 1 0.00
chip_sw_lc_ctrl_init 0 1 0.00
chip_sw_lc_ctrl_transition 11.371s 0.000us 0 1 0.00
chip_sw_lc_ctrl_transitions 0 1 0.00
chip_sw_lc_ctrl_transition 11.371s 0.000us 0 1 0.00
chip_sw_lc_ctrl_kmac_req 0 1 0.00
chip_sw_lc_ctrl_transition 11.371s 0.000us 0 1 0.00
chip_sw_lc_ctrl_key_div 0 1 0.00
chip_sw_keymgr_dpe_key_derivation_prod 342.640s 304.738us 0 1 0.00
chip_sw_lc_ctrl_broadcast 0 10 0.00
chip_sw_otp_ctrl_lc_signals_test_unlocked0 10.050s 0.000us 0 1 0.00
chip_sw_otp_ctrl_lc_signals_dev 9.573s 0.000us 0 1 0.00
chip_sw_otp_ctrl_lc_signals_prod 9.669s 0.000us 0 1 0.00
chip_sw_otp_ctrl_lc_signals_rma 9.797s 0.000us 0 1 0.00
chip_sw_lc_ctrl_transition 11.371s 0.000us 0 1 0.00
chip_sw_keymgr_dpe_key_derivation 328.830s 304.818us 0 1 0.00
chip_sw_rom_ctrl_integrity_check 212.190s 157.272us 0 1 0.00
chip_sw_sram_ctrl_execution_main 17.491s 0.000us 0 1 0.00
chip_prim_tl_access 85.960s 117.992us 0 1 0.00
chip_rv_dm_lc_disabled 83.640s 128.152us 0 1 0.00
chip_sw_aes_enc 1 2 50.00
chip_sw_aes_enc 204.760s 173.137us 1 1 100.00
chip_sw_aes_enc_jitter_en 40.480s 10.180us 0 1 0.00
chip_sw_aes_gcm 1 2 50.00
chip_sw_aes_enc 204.760s 173.137us 1 1 100.00
chip_sw_aes_enc_jitter_en 40.480s 10.180us 0 1 0.00
chip_sw_aes_entropy 1 1 100.00
chip_sw_aes_entropy 216.430s 164.542us 1 1 100.00
chip_sw_aes_idle 1 1 100.00
chip_sw_aes_idle 197.420s 165.804us 1 1 100.00
chip_sw_hmac_enc 1 2 50.00
chip_sw_hmac_enc 211.190s 173.801us 1 1 100.00
chip_sw_hmac_enc_jitter_en 43.240s 10.400us 0 1 0.00
chip_sw_hmac_idle 1 1 100.00
chip_sw_hmac_enc_idle 196.660s 178.165us 1 1 100.00
chip_sw_kmac_enc 2 3 66.67
chip_sw_kmac_mode_cshake 193.540s 167.252us 1 1 100.00
chip_sw_kmac_mode_kmac 232.600s 188.874us 1 1 100.00
chip_sw_kmac_mode_kmac_jitter_en 41.100s 10.220us 0 1 0.00
chip_sw_kmac_app_keymgr 0 1 0.00
chip_sw_keymgr_dpe_key_derivation 328.830s 304.818us 0 1 0.00
chip_sw_kmac_app_lc 0 1 0.00
chip_sw_lc_ctrl_transition 11.371s 0.000us 0 1 0.00
chip_sw_kmac_app_rom 0 1 0.00
chip_sw_kmac_app_rom 14.929s 0.000us 0 1 0.00
chip_sw_kmac_entropy 1 1 100.00
chip_sw_kmac_entropy 248.540s 195.116us 1 1 100.00
chip_sw_kmac_idle 1 1 100.00
chip_sw_kmac_idle 198.670s 164.105us 1 1 100.00
chip_sw_entropy_src_csrng 1 1 100.00
chip_sw_entropy_src_csrng 1748.880s 2224.184us 1 1 100.00
chip_sw_csrng_edn_cmd 1 1 100.00
chip_sw_entropy_src_csrng 1748.880s 2224.184us 1 1 100.00
chip_sw_csrng_fuse_en_sw_app_read 0 1 0.00
chip_sw_csrng_fuse_en_sw_app_read_test 10.372s 0.000us 0 1 0.00
chip_sw_csrng_known_answer_tests 1 1 100.00
chip_sw_csrng_kat_test 212.920s 175.883us 1 1 100.00
chip_sw_edn_entropy_reqs 1 1 100.00
chip_sw_csrng_edn_concurrency 2861.780s 2230.046us 1 1 100.00
chip_sw_keymgr_dpe_key_derivation 0 2 0.00
chip_sw_keymgr_dpe_key_derivation 328.830s 304.818us 0 1 0.00
chip_sw_keymgr_dpe_key_derivation_jitter_en 40.050s 10.220us 0 1 0.00
chip_sw_otbn_op 1 2 50.00
chip_sw_otbn_ecdsa_op_irq 3001.380s 1506.525us 1 1 100.00
chip_sw_otbn_ecdsa_op_irq_jitter_en 40.050s 10.380us 0 1 0.00
chip_sw_otbn_rnd_entropy 1 1 100.00
chip_sw_otbn_randomness 327.820s 244.963us 1 1 100.00
chip_sw_otbn_urnd_entropy 1 1 100.00
chip_sw_otbn_randomness 327.820s 244.963us 1 1 100.00
chip_sw_otbn_idle 1 1 100.00
chip_sw_otbn_randomness 327.820s 244.963us 1 1 100.00
chip_sw_otbn_mem_scramble 1 1 100.00
chip_sw_otbn_mem_scramble 403.560s 280.178us 1 1 100.00
chip_sw_rom_access 0 1 0.00
chip_sw_rom_ctrl_integrity_check 212.190s 157.272us 0 1 0.00
chip_sw_rom_ctrl_integrity_check 0 1 0.00
chip_sw_rom_ctrl_integrity_check 212.190s 157.272us 0 1 0.00
chip_sw_sram_scrambled_access 1 2 50.00
chip_sw_sram_ctrl_scrambled_access 411.690s 350.002us 1 1 100.00
chip_sw_sram_ctrl_scrambled_access_jitter_en 12.788s 0.000us 0 1 0.00
chip_sw_sram_execution 0 1 0.00
chip_sw_sram_ctrl_execution_main 17.491s 0.000us 0 1 0.00
chip_sw_sram_lc_escalation 0 2 0.00
chip_sw_all_escalation_resets 1076.850s 943.642us 0 1 0.00
chip_sw_data_integrity_escalation 9.250s 0.000us 0 1 0.00
chip_otp_ctrl_init 0 1 0.00
chip_sw_lc_ctrl_transition 11.371s 0.000us 0 1 0.00
chip_sw_otp_ctrl_keys 3 4 75.00
chip_sw_otbn_mem_scramble 403.560s 280.178us 1 1 100.00
chip_sw_keymgr_dpe_key_derivation 328.830s 304.818us 0 1 0.00
chip_sw_sram_ctrl_scrambled_access 411.690s 350.002us 1 1 100.00
chip_sw_rv_core_ibex_icache_invalidate 204.960s 176.854us 1 1 100.00
chip_sw_otp_ctrl_entropy 3 4 75.00
chip_sw_otbn_mem_scramble 403.560s 280.178us 1 1 100.00
chip_sw_keymgr_dpe_key_derivation 328.830s 304.818us 0 1 0.00
chip_sw_sram_ctrl_scrambled_access 411.690s 350.002us 1 1 100.00
chip_sw_rv_core_ibex_icache_invalidate 204.960s 176.854us 1 1 100.00
chip_sw_otp_ctrl_program 0 1 0.00
chip_sw_lc_ctrl_transition 11.371s 0.000us 0 1 0.00
chip_sw_otp_ctrl_program_error 0 1 0.00
chip_sw_lc_ctrl_program_error 24.773s 0.000us 0 1 0.00
chip_sw_otp_ctrl_hw_cfg 0 1 0.00
chip_sw_lc_ctrl_otp_hw_cfg 11.852s 0.000us 0 1 0.00
chip_sw_otp_ctrl_lc_signals 0 6 0.00
chip_sw_otp_ctrl_lc_signals_test_unlocked0 10.050s 0.000us 0 1 0.00
chip_sw_otp_ctrl_lc_signals_dev 9.573s 0.000us 0 1 0.00
chip_sw_otp_ctrl_lc_signals_prod 9.669s 0.000us 0 1 0.00
chip_sw_otp_ctrl_lc_signals_rma 9.797s 0.000us 0 1 0.00
chip_sw_lc_ctrl_transition 11.371s 0.000us 0 1 0.00
chip_prim_tl_access 85.960s 117.992us 0 1 0.00
chip_sw_otp_prim_tl_access 0 1 0.00
chip_prim_tl_access 85.960s 117.992us 0 1 0.00
chip_sw_otp_ctrl_nvm_cnt 0 1 0.00
chip_sw_otp_ctrl_nvm_cnt 17.758s 0.000us 0 1 0.00
chip_sw_otp_ctrl_sw_parts 0 1 0.00
chip_sw_otp_ctrl_sw_parts 13.837s 0.000us 0 1 0.00
chip_sw_ast_clk_outputs 0 1 0.00
chip_sw_ast_clk_outputs 20.084s 0.000us 0 1 0.00
chip_sw_ast_sys_clk_jitter 1 7 14.29
chip_sw_otbn_ecdsa_op_irq_jitter_en 40.050s 10.380us 0 1 0.00
chip_sw_aes_enc_jitter_en 40.480s 10.180us 0 1 0.00
chip_sw_hmac_enc_jitter_en 43.240s 10.400us 0 1 0.00
chip_sw_keymgr_dpe_key_derivation_jitter_en 40.050s 10.220us 0 1 0.00
chip_sw_kmac_mode_kmac_jitter_en 41.100s 10.220us 0 1 0.00
chip_sw_sram_ctrl_scrambled_access_jitter_en 12.788s 0.000us 0 1 0.00
chip_sw_clkmgr_jitter 193.330s 161.221us 1 1 100.00
chip_sw_soc_proxy_external_reset_requests 0 1 0.00
chip_sw_soc_proxy_smoketest 179.680s 156.176us 0 1 0.00
chip_sw_soc_proxy_external_irqs 0 1 0.00
chip_sw_soc_proxy_smoketest 179.680s 156.176us 0 1 0.00
chip_sw_soc_proxy_external_wakeup_requests 0 1 0.00
chip_sw_soc_proxy_external_wakeup 174.600s 157.926us 0 1 0.00
chip_sw_soc_proxy_gpios 1 1 100.00
chip_sw_soc_proxy_gpios 199.040s 180.550us 1 1 100.00
chip_sw_nmi_irq 0 1 0.00
chip_sw_rv_core_ibex_nmi_irq 386.660s 269.292us 0 1 0.00
chip_sw_rv_core_ibex_rnd 1 1 100.00
chip_sw_rv_core_ibex_rnd 256.280s 215.528us 1 1 100.00
chip_sw_rv_core_ibex_address_translation 1 1 100.00
chip_sw_rv_core_ibex_address_translation 223.590s 179.891us 1 1 100.00
chip_sw_rv_core_ibex_icache_scrambled_access 1 1 100.00
chip_sw_rv_core_ibex_icache_invalidate 204.960s 176.854us 1 1 100.00
chip_sw_rv_core_ibex_fault_dump 0 1 0.00
chip_sw_rstmgr_cpu_info 407.960s 412.064us 0 1 0.00
chip_sw_rv_core_ibex_double_fault 0 1 0.00
chip_sw_rstmgr_cpu_info 407.960s 412.064us 0 1 0.00
chip_sw_smoketest 14 14 100.00
chip_sw_aes_smoketest 203.470s 173.140us 1 1 100.00
chip_sw_aon_timer_smoketest 219.350s 182.267us 1 1 100.00
chip_sw_clkmgr_smoketest 218.360s 162.097us 1 1 100.00
chip_sw_csrng_smoketest 196.460s 164.229us 1 1 100.00
chip_sw_gpio_smoketest 223.240s 184.618us 1 1 100.00
chip_sw_hmac_smoketest 254.400s 194.861us 1 1 100.00
chip_sw_kmac_smoketest 216.680s 185.529us 1 1 100.00
chip_sw_otbn_smoketest 272.400s 202.528us 1 1 100.00
chip_sw_otp_ctrl_smoketest 208.990s 165.833us 1 1 100.00
chip_sw_rv_plic_smoketest 196.580s 163.948us 1 1 100.00
chip_sw_rv_timer_smoketest 285.750s 266.934us 1 1 100.00
chip_sw_rstmgr_smoketest 194.550s 160.917us 1 1 100.00
chip_sw_sram_ctrl_smoketest 190.500s 164.465us 1 1 100.00
chip_sw_uart_smoketest 200.650s 175.152us 1 1 100.00
chip_sw_rom_functests 0 1 0.00
rom_keymgr_functest 9.803s 0.000us 0 1 0.00
chip_sw_signed 0 1 0.00
chip_sw_uart_smoketest_signed 24.321s 0.000us 0 1 0.00
chip_sw_boot 0 1 0.00
chip_sw_uart_tx_rx_bootstrap 79.954s 0.000us 0 1 0.00
chip_sw_secure_boot 0 1 0.00
base_rom_e2e_smoke 7.791s 0.000us 0 1 0.00
chip_lc_scrap 0 4 0.00
chip_sw_lc_ctrl_rma_to_scrap 201.300s 162.296us 0 1 0.00
chip_sw_lc_ctrl_raw_to_scrap 178.730s 175.224us 0 1 0.00
chip_sw_lc_ctrl_test_locked0_to_scrap 169.700s 170.616us 0 1 0.00
chip_sw_lc_ctrl_rand_to_scrap 198.120s 171.464us 0 1 0.00
chip_lc_test_locked 0 2 0.00
chip_sw_lc_walkthrough_testunlocks 9.110s 0.000us 0 1 0.00
chip_rv_dm_lc_disabled 83.640s 128.152us 0 1 0.00
chip_sw_lc_walkthrough 0 5 0.00
chip_sw_lc_walkthrough_dev 82.429s 0.000us 0 1 0.00
chip_sw_lc_walkthrough_prod 106.588s 0.000us 0 1 0.00
chip_sw_lc_walkthrough_prodend 11.610s 0.000us 0 1 0.00
chip_sw_lc_walkthrough_rma 72.969s 0.000us 0 1 0.00
chip_sw_lc_walkthrough_testunlocks 9.110s 0.000us 0 1 0.00
chip_sw_lc_ctrl_volatile_raw_unlock 0 3 0.00
chip_sw_lc_ctrl_volatile_raw_unlock 304.200s 392.072us 0 1 0.00
chip_sw_lc_ctrl_volatile_raw_unlock_ext_clk_48mhz 327.960s 382.760us 0 1 0.00
rom_volatile_raw_unlock 15.019s 0.000us 0 1 0.00
chip_sw_rom_raw_unlock 0 1 0.00
rom_raw_unlock 17.139s 0.000us 0 1 0.00
chip_sw_exit_test_unlocked_bootstrap 0 1 0.00
chip_sw_exit_test_unlocked_bootstrap 69.946s 0.000us 0 1 0.00
chip_sw_inject_scramble_seed 0 1 0.00
chip_sw_inject_scramble_seed 12.224s 0.000us 0 1 0.00
tl_d_oob_addr_access 0 1 0.00
chip_tl_errors 105.850s 117.756us 0 1 0.00
tl_d_illegal_access 0 1 0.00
chip_tl_errors 105.850s 117.756us 0 1 0.00
tl_d_outstanding_access 0 2 0.00
chip_csr_aliasing 8.570s 0.000us 0 1 0.00
chip_same_csr_outstanding 9.060s 0.000us 0 1 0.00
tl_d_partial_access 0 2 0.00
chip_csr_aliasing 8.570s 0.000us 0 1 0.00
chip_same_csr_outstanding 9.060s 0.000us 0 1 0.00
xbar_base_random_sequence 1 1 100.00
xbar_random 95.740s 215.892us 1 1 100.00
xbar_random_delay 6 6 100.00
xbar_smoke_zero_delays 9.350s 12.612us 1 1 100.00
xbar_smoke_large_delays 199.620s 1896.439us 1 1 100.00
xbar_smoke_slow_rsp 328.820s 2090.467us 1 1 100.00
xbar_random_zero_delays 76.800s 59.436us 1 1 100.00
xbar_random_large_delays 485.590s 4479.320us 1 1 100.00
xbar_random_slow_rsp 1836.060s 11582.610us 1 1 100.00
xbar_unmapped_address 2 2 100.00
xbar_unmapped_addr 82.470s 43.290us 1 1 100.00
xbar_error_and_unmapped_addr 65.440s 124.222us 1 1 100.00
xbar_error_cases 2 2 100.00
xbar_error_random 17.490s 32.550us 1 1 100.00
xbar_error_and_unmapped_addr 65.440s 124.222us 1 1 100.00
xbar_all_access_same_device 2 2 100.00
xbar_access_same_device 27.640s 18.622us 1 1 100.00
xbar_access_same_device_slow_rsp 2312.950s 15131.920us 1 1 100.00
xbar_all_hosts_use_same_source_id 1 1 100.00
xbar_same_source 74.490s 161.816us 1 1 100.00
xbar_stress_all 2 2 100.00
xbar_stress_all 834.180s 1841.441us 1 1 100.00
xbar_stress_all_with_error 813.710s 2047.500us 1 1 100.00
xbar_stress_with_reset 2 2 100.00
xbar_stress_all_with_rand_reset 1774.050s 3805.738us 1 1 100.00
xbar_stress_all_with_reset_error 356.150s 334.041us 1 1 100.00
rom_e2e_smoke 0 1 0.00
rom_e2e_smoke 13.569s 0.000us 0 1 0.00
rom_e2e_shutdown_output 0 1 0.00
rom_e2e_shutdown_output 19.709s 0.000us 0 1 0.00
rom_e2e_shutdown_exception_c 0 1 0.00
rom_e2e_shutdown_exception_c 26.526s 0.000us 0 1 0.00
rom_e2e_boot_policy_valid 0 15 0.00
rom_e2e_boot_policy_valid_a_good_b_good_test_unlocked0 43.705s 0.000us 0 1 0.00
rom_e2e_boot_policy_valid_a_good_b_good_dev 10.473s 0.000us 0 1 0.00
rom_e2e_boot_policy_valid_a_good_b_good_prod 10.206s 0.000us 0 1 0.00
rom_e2e_boot_policy_valid_a_good_b_good_prod_end 11.915s 0.000us 0 1 0.00
rom_e2e_boot_policy_valid_a_good_b_good_rma 26.835s 0.000us 0 1 0.00
rom_e2e_boot_policy_valid_a_good_b_bad_test_unlocked0 44.197s 0.000us 0 1 0.00
rom_e2e_boot_policy_valid_a_good_b_bad_dev 8.414s 0.000us 0 1 0.00
rom_e2e_boot_policy_valid_a_good_b_bad_prod 10.541s 0.000us 0 1 0.00
rom_e2e_boot_policy_valid_a_good_b_bad_prod_end 8.964s 0.000us 0 1 0.00
rom_e2e_boot_policy_valid_a_good_b_bad_rma 11.431s 0.000us 0 1 0.00
rom_e2e_boot_policy_valid_a_bad_b_good_test_unlocked0 50.608s 0.000us 0 1 0.00
rom_e2e_boot_policy_valid_a_bad_b_good_dev 16.947s 0.000us 0 1 0.00
rom_e2e_boot_policy_valid_a_bad_b_good_prod 19.585s 0.000us 0 1 0.00
rom_e2e_boot_policy_valid_a_bad_b_good_prod_end 20.804s 0.000us 0 1 0.00
rom_e2e_boot_policy_valid_a_bad_b_good_rma 14.944s 0.000us 0 1 0.00
rom_e2e_sigverify_always 0 15 0.00
rom_e2e_sigverify_always_a_bad_b_bad_test_unlocked0 64.026s 0.000us 0 1 0.00
rom_e2e_sigverify_always_a_bad_b_bad_dev 27.174s 0.000us 0 1 0.00
rom_e2e_sigverify_always_a_bad_b_bad_prod 19.994s 0.000us 0 1 0.00
rom_e2e_sigverify_always_a_bad_b_bad_prod_end 22.296s 0.000us 0 1 0.00
rom_e2e_sigverify_always_a_bad_b_bad_rma 28.578s 0.000us 0 1 0.00
rom_e2e_sigverify_always_a_bad_b_nothing_test_unlocked0 36.590s 0.000us 0 1 0.00
rom_e2e_sigverify_always_a_bad_b_nothing_dev 26.841s 0.000us 0 1 0.00
rom_e2e_sigverify_always_a_bad_b_nothing_prod 17.210s 0.000us 0 1 0.00
rom_e2e_sigverify_always_a_bad_b_nothing_prod_end 14.773s 0.000us 0 1 0.00
rom_e2e_sigverify_always_a_bad_b_nothing_rma 24.275s 0.000us 0 1 0.00
rom_e2e_sigverify_always_a_nothing_b_bad_test_unlocked0 27.867s 0.000us 0 1 0.00
rom_e2e_sigverify_always_a_nothing_b_bad_dev 17.196s 0.000us 0 1 0.00
rom_e2e_sigverify_always_a_nothing_b_bad_prod 9.721s 0.000us 0 1 0.00
rom_e2e_sigverify_always_a_nothing_b_bad_prod_end 15.420s 0.000us 0 1 0.00
rom_e2e_sigverify_always_a_nothing_b_bad_rma 10.824s 0.000us 0 1 0.00
rom_e2e_asm_init 0 5 0.00
rom_e2e_asm_init_test_unlocked0 51.137s 0.000us 0 1 0.00
rom_e2e_asm_init_dev 30.279s 0.000us 0 1 0.00
rom_e2e_asm_init_prod 19.803s 0.000us 0 1 0.00
rom_e2e_asm_init_prod_end 12.288s 0.000us 0 1 0.00
rom_e2e_asm_init_rma 18.444s 0.000us 0 1 0.00
rom_e2e_keymgr_init 0 3 0.00
rom_e2e_keymgr_init_rom_ext_meas 11.934s 0.000us 0 1 0.00
rom_e2e_keymgr_init_rom_ext_no_meas 9.861s 0.000us 0 1 0.00
rom_e2e_keymgr_init_rom_ext_invalid_meas 10.889s 0.000us 0 1 0.00
rom_e2e_static_critical 0 1 0.00
rom_e2e_static_critical 9.386s 0.000us 0 1 0.00
Testpoint Test Max Runtime Sim Time Pass Total %
chip_sw_aes_masking_off 1 1 100.00
chip_sw_aes_masking_off 249.280s 187.852us 1 1 100.00
chip_sw_rv_core_ibex_lockstep_glitch 1 1 100.00
chip_sw_rv_core_ibex_lockstep_glitch 182.030s 136.981us 1 1 100.00
Testpoint Test Max Runtime Sim Time Pass Total %
chip_rv_dm_perform_debug 0 3 0.00
rom_e2e_jtag_debug_test_unlocked0 23.804s 0.000us 0 1 0.00
rom_e2e_jtag_debug_dev 11.326s 0.000us 0 1 0.00
rom_e2e_jtag_debug_rma 8.655s 0.000us 0 1 0.00
chip_sw_rv_dm_access_after_hw_reset 0 1 0.00
chip_sw_rv_dm_access_after_escalation_reset 16.376s 0.000us 0 1 0.00
chip_sw_plic_alerts 0 1 0.00
chip_sw_all_escalation_resets 1076.850s 943.642us 0 1 0.00
chip_sw_otp_ctrl_vendor_test_csr_access 0 1 0.00
chip_sw_otp_ctrl_vendor_test_csr_access 17.208s 0.000us 0 1 0.00
chip_sw_otp_ctrl_escalation 0 1 0.00
chip_sw_otp_ctrl_escalation 221.650s 177.120us 0 1 0.00
chip_sw_coremark 0 1 0.00
chip_sw_coremark 28.373s 0.000us 0 1 0.00
chip_sw_power_max_load 0 1 0.00
chip_sw_power_virus 104.832s 0.000us 0 1 0.00
rom_e2e_debug 0 3 0.00
rom_e2e_jtag_debug_test_unlocked0 23.804s 0.000us 0 1 0.00
rom_e2e_jtag_debug_dev 11.326s 0.000us 0 1 0.00
rom_e2e_jtag_debug_rma 8.655s 0.000us 0 1 0.00
rom_e2e_jtag_inject 0 3 0.00
rom_e2e_jtag_inject_test_unlocked0 28.467s 0.000us 0 1 0.00
rom_e2e_jtag_inject_dev 52.905s 0.000us 0 1 0.00
rom_e2e_jtag_inject_rma 35.840s 0.000us 0 1 0.00
rom_e2e_self_hash 0 1 0.00
rom_e2e_self_hash 42.236s 0.000us 0 1 0.00
Testpoint Test Max Runtime Sim Time Pass Total %
Unmapped 8 20 40.00
chip_sw_rstmgr_rst_cnsty_escalation 42.990s 10.180us 0 1 0.00
chip_sw_aes_gcm 247.050s 203.635us 1 1 100.00
chip_sw_entropy_src_kat_test 205.250s 163.591us 1 1 100.00
chip_sw_entropy_src_ast_rng_req 191.940s 161.301us 1 1 100.00
chip_plic_all_irqs_0 485.440s 327.604us 1 1 100.00
chip_plic_all_irqs_10 384.770s 300.462us 1 1 100.00
chip_sw_dma_inline_hashing 255.630s 208.570us 1 1 100.00
chip_sw_dma_abort 280.250s 211.741us 0 1 0.00
rom_e2e_sigverify_mod_exp_test_unlocked0_otbn 22.963s 0.000us 0 1 0.00
rom_e2e_sigverify_mod_exp_test_unlocked0_sw 20.520s 0.000us 0 1 0.00
rom_e2e_sigverify_mod_exp_dev_otbn 8.128s 0.000us 0 1 0.00
rom_e2e_sigverify_mod_exp_dev_sw 11.292s 0.000us 0 1 0.00
rom_e2e_sigverify_mod_exp_prod_otbn 8.234s 0.000us 0 1 0.00
rom_e2e_sigverify_mod_exp_prod_sw 8.283s 0.000us 0 1 0.00
rom_e2e_sigverify_mod_exp_prod_end_otbn 8.459s 0.000us 0 1 0.00
rom_e2e_sigverify_mod_exp_prod_end_sw 11.446s 0.000us 0 1 0.00
rom_e2e_sigverify_mod_exp_rma_otbn 11.020s 0.000us 0 1 0.00
rom_e2e_sigverify_mod_exp_rma_sw 9.030s 0.000us 0 1 0.00
chip_sw_entropy_src_smoketest 244.390s 191.726us 1 1 100.00
chip_sw_mbx_smoketest 380.520s 330.976us 1 1 100.00

Error Messages

   Test seed line log context
Some pass patterns missing: ['^TEST PASSED (UVM_)?CHECKS$'] 119 test runs
chip_sw_example_manufacturer 87960054611240360182818737310082746247903052769243526265262184376590171923365 None
Use --verbose_failures to see the command lines of failed build steps.
ERROR: Analysis of target '@@+hooks+manufacturer_test_hooks//:example_test_sim_dv' failed; build aborted: Target @@+hooks+manufacturer_test_hooks//:example_test_sim_dv is incompatible and cannot be built, but was explicitly requested.
Dependency chain:
@@+hooks+manufacturer_test_hooks//:example_test_sim_dv (f2055d) <-- target platform (//toolchain:opentitan_platform) didn't satisfy constraint @@platforms//:incompatible
INFO: Elapsed time: 0.663s, Critical Path: 0.02s
INFO: 1 process: 1 internal.
ERROR: Build did NOT complete successfully
_run_cmd -> had a non-zero return code of 1.
make: *** [/nightly/current_run/opentitan/hw/dv/tools/dvsim/sim.mk:58: sw_build] Error 1
chip_sw_data_integrity_escalation 64885007635253709181637417120047621084944259316654201417941654548423496645909 None
Use --verbose_failures to see the command lines of failed build steps.
ERROR: Analysis of target '//sw/device/tests/sim_dv:data_integrity_escalation_reset_test_sim_dv' failed; build aborted: Target //sw/device/tests/sim_dv:data_integrity_escalation_reset_test_sim_dv is incompatible and cannot be built, but was explicitly requested.
Dependency chain:
//sw/device/tests/sim_dv:data_integrity_escalation_reset_test_sim_dv (f2055d) <-- target platform (//toolchain:opentitan_platform) didn't satisfy constraint @@platforms//:incompatible
INFO: Elapsed time: 0.263s, Critical Path: 0.02s
INFO: 1 process: 1 internal.
ERROR: Build did NOT complete successfully
_run_cmd -> had a non-zero return code of 1.
make: *** [/nightly/current_run/opentitan/hw/dv/tools/dvsim/sim.mk:58: sw_build] Error 1
chip_sw_sleep_pin_wake 65110865348863826815076725764062388114846093696177436990038963781914900379600 None
Use --verbose_failures to see the command lines of failed build steps.
ERROR: Analysis of target '//sw/device/tests:sleep_pin_wake_test_sim_dv' failed; build aborted: Target //sw/device/tests:sleep_pin_wake_test_sim_dv is incompatible and cannot be built, but was explicitly requested.
Dependency chain:
//sw/device/tests:sleep_pin_wake_test_sim_dv (f2055d) <-- target platform (//toolchain:opentitan_platform) didn't satisfy constraint @@platforms//:incompatible
INFO: Elapsed time: 0.766s, Critical Path: 0.02s
INFO: 1 process: 1 internal.
ERROR: Build did NOT complete successfully
_run_cmd -> had a non-zero return code of 1.
make: *** [/nightly/current_run/opentitan/hw/dv/tools/dvsim/sim.mk:58: sw_build] Error 1
chip_sw_sleep_pin_retention 35513481120284455387737477076402089973088199113730518983330045587274538609216 None
Use --verbose_failures to see the command lines of failed build steps.
ERROR: Analysis of target '//sw/device/tests:sleep_pin_retention_test_sim_dv' failed; build aborted: Target //sw/device/tests:sleep_pin_retention_test_sim_dv is incompatible and cannot be built, but was explicitly requested.
Dependency chain:
//sw/device/tests:sleep_pin_retention_test_sim_dv (f2055d) <-- target platform (//toolchain:opentitan_platform) didn't satisfy constraint @@platforms//:incompatible
INFO: Elapsed time: 4.765s, Critical Path: 0.02s
INFO: 1 process: 1 internal.
ERROR: Build did NOT complete successfully
_run_cmd -> had a non-zero return code of 1.
make: *** [/nightly/current_run/opentitan/hw/dv/tools/dvsim/sim.mk:58: sw_build] Error 1
chip_sw_uart_tx_rx 109843475514843152077199014444111997957673161237401142707002986708502940352002 None
Use --verbose_failures to see the command lines of failed build steps.
ERROR: Analysis of target '//sw/device/tests:uart_tx_rx_test_sim_dv' failed; build aborted: Target //sw/device/tests:uart_tx_rx_test_sim_dv is incompatible and cannot be built, but was explicitly requested.
Dependency chain:
//sw/device/tests:uart_tx_rx_test_sim_dv (f2055d) <-- target platform (//toolchain:opentitan_platform) didn't satisfy constraint @@platforms//:incompatible
INFO: Elapsed time: 4.048s, Critical Path: 0.03s
INFO: 1 process: 1 internal.
ERROR: Build did NOT complete successfully
_run_cmd -> had a non-zero return code of 1.
make: *** [/nightly/current_run/opentitan/hw/dv/tools/dvsim/sim.mk:58: sw_build] Error 1
chip_sw_uart_tx_rx_bootstrap 82245469836585424385749047652818141918701697674494893915172111853158667972072 None
Use --verbose_failures to see the command lines of failed build steps.
ERROR: Analysis of target '//sw/device/tests:uart_tx_rx_test_sim_dv' failed; build aborted: Target //sw/device/tests:uart_tx_rx_test_sim_dv is incompatible and cannot be built, but was explicitly requested.
Dependency chain:
//sw/device/tests:uart_tx_rx_test_sim_dv (f2055d) <-- target platform (//toolchain:opentitan_platform) didn't satisfy constraint @@platforms//:incompatible
INFO: Elapsed time: 12.740s, Critical Path: 0.02s
INFO: 1 process: 1 internal.
ERROR: Build did NOT complete successfully
_run_cmd -> had a non-zero return code of 1.
make: *** [/nightly/current_run/opentitan/hw/dv/tools/dvsim/sim.mk:58: sw_build] Error 1
chip_sw_inject_scramble_seed 93138867923394406840545519521849796324346055185236292902366914266674989391306 None
Use --verbose_failures to see the command lines of failed build steps.
ERROR: Analysis of target '//sw/device/tests/sim_dv:inject_scramble_seed_sim_dv' failed; build aborted: Target //sw/device/tests/sim_dv:inject_scramble_seed_sim_dv is incompatible and cannot be built, but was explicitly requested.
Dependency chain:
//sw/device/tests/sim_dv:inject_scramble_seed_sim_dv (f2055d) <-- target platform (//toolchain:opentitan_platform) didn't satisfy constraint @@platforms//:incompatible
INFO: Elapsed time: 0.961s, Critical Path: 0.04s
INFO: 1 process: 1 internal.
ERROR: Build did NOT complete successfully
_run_cmd -> had a non-zero return code of 1.
make: *** [/nightly/current_run/opentitan/hw/dv/tools/dvsim/sim.mk:58: sw_build] Error 1
chip_sw_exit_test_unlocked_bootstrap 60190108884949611077355936414820060742816129429355553944127517016957761999712 None
Use --verbose_failures to see the command lines of failed build steps.
ERROR: Analysis of target '//sw/device/tests/sim_dv:exit_test_unlocked_bootstrap_sim_dv' failed; build aborted: Target //sw/device/tests/sim_dv:exit_test_unlocked_bootstrap_sim_dv is incompatible and cannot be built, but was explicitly requested.
Dependency chain:
//sw/device/tests/sim_dv:exit_test_unlocked_bootstrap_sim_dv (f2055d) <-- target platform (//toolchain:opentitan_platform) didn't satisfy constraint @@platforms//:incompatible
INFO: Elapsed time: 1.165s, Critical Path: 0.02s
INFO: 1 process: 1 internal.
ERROR: Build did NOT complete successfully
_run_cmd -> had a non-zero return code of 1.
make: *** [/nightly/current_run/opentitan/hw/dv/tools/dvsim/sim.mk:58: sw_build] Error 1
chip_sw_uart_rand_baudrate 15008751531471107286469498265415635714430533176198820474718058192147771077783 None
Use --verbose_failures to see the command lines of failed build steps.
ERROR: Analysis of target '//sw/device/tests:uart_tx_rx_test_sim_dv' failed; build aborted: Target //sw/device/tests:uart_tx_rx_test_sim_dv is incompatible and cannot be built, but was explicitly requested.
Dependency chain:
//sw/device/tests:uart_tx_rx_test_sim_dv (f2055d) <-- target platform (//toolchain:opentitan_platform) didn't satisfy constraint @@platforms//:incompatible
INFO: Elapsed time: 3.778s, Critical Path: 0.01s
INFO: 1 process: 1 internal.
ERROR: Build did NOT complete successfully
_run_cmd -> had a non-zero return code of 1.
make: *** [/nightly/current_run/opentitan/hw/dv/tools/dvsim/sim.mk:58: sw_build] Error 1
chip_sw_uart_tx_rx_alt_clk_freq 41620193447930829237037843144582441788017676294964898783059217722755443131101 None
Use --verbose_failures to see the command lines of failed build steps.
ERROR: Analysis of target '//sw/device/tests:uart_tx_rx_test_sim_dv' failed; build aborted: Target //sw/device/tests:uart_tx_rx_test_sim_dv is incompatible and cannot be built, but was explicitly requested.
Dependency chain:
//sw/device/tests:uart_tx_rx_test_sim_dv (f2055d) <-- target platform (//toolchain:opentitan_platform) didn't satisfy constraint @@platforms//:incompatible
INFO: Elapsed time: 5.644s, Critical Path: 0.02s
INFO: 1 process: 1 internal.
ERROR: Build did NOT complete successfully
_run_cmd -> had a non-zero return code of 1.
make: *** [/nightly/current_run/opentitan/hw/dv/tools/dvsim/sim.mk:58: sw_build] Error 1
chip_sw_i2c_host_tx_rx 45735431485553329926437170957307499487145689355597537250310109599537226212626 None
Use --verbose_failures to see the command lines of failed build steps.
ERROR: Analysis of target '//sw/device/tests/sim_dv:i2c_host_tx_rx_test_sim_dv' failed; build aborted: Target //sw/device/tests/sim_dv:i2c_host_tx_rx_test_sim_dv is incompatible and cannot be built, but was explicitly requested.
Dependency chain:
//sw/device/tests/sim_dv:i2c_host_tx_rx_test_sim_dv (f2055d) <-- target platform (//toolchain:opentitan_platform) didn't satisfy constraint @@platforms//:incompatible
INFO: Elapsed time: 2.824s, Critical Path: 0.02s
INFO: 1 process: 1 internal.
ERROR: Build did NOT complete successfully
_run_cmd -> had a non-zero return code of 1.
make: *** [/nightly/current_run/opentitan/hw/dv/tools/dvsim/sim.mk:58: sw_build] Error 1
chip_sw_i2c_device_tx_rx 52786834793468718531088253493763041206425441104757780114247504872495166020004 None
Use --verbose_failures to see the command lines of failed build steps.
ERROR: Analysis of target '//sw/device/tests/sim_dv:i2c_device_tx_rx_test_sim_dv' failed; build aborted: Target //sw/device/tests/sim_dv:i2c_device_tx_rx_test_sim_dv is incompatible and cannot be built, but was explicitly requested.
Dependency chain:
//sw/device/tests/sim_dv:i2c_device_tx_rx_test_sim_dv (f2055d) <-- target platform (//toolchain:opentitan_platform) didn't satisfy constraint @@platforms//:incompatible
INFO: Elapsed time: 5.189s, Critical Path: 0.02s
INFO: 1 process: 1 internal.
ERROR: Build did NOT complete successfully
_run_cmd -> had a non-zero return code of 1.
make: *** [/nightly/current_run/opentitan/hw/dv/tools/dvsim/sim.mk:58: sw_build] Error 1
chip_sw_spi_device_tpm 14503959403571427097333536436909551373879387393120611369874608664875963898958 None
Use --verbose_failures to see the command lines of failed build steps.
ERROR: Analysis of target '//sw/device/tests:spi_device_tpm_tx_rx_test_sim_dv' failed; build aborted: Target //sw/device/tests:spi_device_tpm_tx_rx_test_sim_dv is incompatible and cannot be built, but was explicitly requested.
Dependency chain:
//sw/device/tests:spi_device_tpm_tx_rx_test_sim_dv (f2055d) <-- target platform (//toolchain:opentitan_platform) didn't satisfy constraint @@platforms//:incompatible
INFO: Elapsed time: 1.815s, Critical Path: 0.02s
INFO: 1 process: 1 internal.
ERROR: Build did NOT complete successfully
_run_cmd -> had a non-zero return code of 1.
make: *** [/nightly/current_run/opentitan/hw/dv/tools/dvsim/sim.mk:58: sw_build] Error 1
chip_sw_spi_host_tx_rx 62044522520831934247404139121626205362113229287611810914528941679312228240962 None
Use --verbose_failures to see the command lines of failed build steps.
ERROR: Analysis of target '//sw/device/tests/sim_dv:spi_host_tx_rx_test_sim_dv' failed; build aborted: Target //sw/device/tests/sim_dv:spi_host_tx_rx_test_sim_dv is incompatible and cannot be built, but was explicitly requested.
Dependency chain:
//sw/device/tests/sim_dv:spi_host_tx_rx_test_sim_dv (f2055d) <-- target platform (//toolchain:opentitan_platform) didn't satisfy constraint @@platforms//:incompatible
INFO: Elapsed time: 0.668s, Critical Path: 0.03s
INFO: 1 process: 1 internal.
ERROR: Build did NOT complete successfully
_run_cmd -> had a non-zero return code of 1.
make: *** [/nightly/current_run/opentitan/hw/dv/tools/dvsim/sim.mk:58: sw_build] Error 1
chip_sw_lc_ctrl_otp_hw_cfg 81553467480623813228558281664529739599213839250002160001665743729075664767447 None
Another command (pid=1165837) is running. Waiting for it to complete on the server (server_pid=191100)...
Another command (pid=1169237) is running. Waiting for it to complete on the server (server_pid=191100)...
Another command (pid=1167221) is running. Waiting for it to complete on the server (server_pid=191100)...
WARNING: Target pattern parsing failed.
ERROR: Skipping '//sw/device/tests:lc_ctrl_otp_hw_cfg_test_sim_dv': no such target '//sw/device/tests:lc_ctrl_otp_hw_cfg_test_sim_dv': target 'lc_ctrl_otp_hw_cfg_test_sim_dv' not declared in package 'sw/device/tests' defined by /nightly/current_run/opentitan/sw/device/tests/BUILD (did you mean lc_ctrl_otp_hw_cfg0_test_sim_dv?)
ERROR: no such target '//sw/device/tests:lc_ctrl_otp_hw_cfg_test_sim_dv': target 'lc_ctrl_otp_hw_cfg_test_sim_dv' not declared in package 'sw/device/tests' defined by /nightly/current_run/opentitan/sw/device/tests/BUILD (did you mean lc_ctrl_otp_hw_cfg0_test_sim_dv?)
ERROR: Build did NOT complete successfully
_run_cmd -> had a non-zero return code of 1.
make: *** [/nightly/current_run/opentitan/hw/dv/tools/dvsim/sim.mk:58: sw_build] Error 1
chip_sw_otp_ctrl_lc_signals_test_unlocked0 39527047517368787485557148008083853998262098733480354742787500685375519377005 None
Use --verbose_failures to see the command lines of failed build steps.
ERROR: Analysis of target '//sw/device/tests/sim_dv:otp_ctrl_lc_signals_test_sim_dv' failed; build aborted: Target //sw/device/tests/sim_dv:otp_ctrl_lc_signals_test_sim_dv is incompatible and cannot be built, but was explicitly requested.
Dependency chain:
//sw/device/tests/sim_dv:otp_ctrl_lc_signals_test_sim_dv (f2055d) <-- target platform (//toolchain:opentitan_platform) didn't satisfy constraint @@platforms//:incompatible
INFO: Elapsed time: 0.284s, Critical Path: 0.03s
INFO: 1 process: 1 internal.
ERROR: Build did NOT complete successfully
_run_cmd -> had a non-zero return code of 1.
make: *** [/nightly/current_run/opentitan/hw/dv/tools/dvsim/sim.mk:58: sw_build] Error 1
chip_sw_otp_ctrl_lc_signals_dev 25388685449490641204422387178635593314289372418135422918862067892735987310624 None
Use --verbose_failures to see the command lines of failed build steps.
ERROR: Analysis of target '//sw/device/tests/sim_dv:otp_ctrl_lc_signals_test_sim_dv' failed; build aborted: Target //sw/device/tests/sim_dv:otp_ctrl_lc_signals_test_sim_dv is incompatible and cannot be built, but was explicitly requested.
Dependency chain:
//sw/device/tests/sim_dv:otp_ctrl_lc_signals_test_sim_dv (f2055d) <-- target platform (//toolchain:opentitan_platform) didn't satisfy constraint @@platforms//:incompatible
INFO: Elapsed time: 0.272s, Critical Path: 0.03s
INFO: 1 process: 1 internal.
ERROR: Build did NOT complete successfully
_run_cmd -> had a non-zero return code of 1.
make: *** [/nightly/current_run/opentitan/hw/dv/tools/dvsim/sim.mk:58: sw_build] Error 1
chip_sw_otp_ctrl_lc_signals_prod 89876636065382754475608690530425083011751110418985068519402127913578584120554 None
Use --verbose_failures to see the command lines of failed build steps.
ERROR: Analysis of target '//sw/device/tests/sim_dv:otp_ctrl_lc_signals_test_sim_dv' failed; build aborted: Target //sw/device/tests/sim_dv:otp_ctrl_lc_signals_test_sim_dv is incompatible and cannot be built, but was explicitly requested.
Dependency chain:
//sw/device/tests/sim_dv:otp_ctrl_lc_signals_test_sim_dv (f2055d) <-- target platform (//toolchain:opentitan_platform) didn't satisfy constraint @@platforms//:incompatible
INFO: Elapsed time: 0.396s, Critical Path: 0.02s
INFO: 1 process: 1 internal.
ERROR: Build did NOT complete successfully
_run_cmd -> had a non-zero return code of 1.
make: *** [/nightly/current_run/opentitan/hw/dv/tools/dvsim/sim.mk:58: sw_build] Error 1
chip_sw_otp_ctrl_lc_signals_rma 64862356915404574625598852970114513665508443497151240968518608721981714683759 None
Use --verbose_failures to see the command lines of failed build steps.
ERROR: Analysis of target '//sw/device/tests/sim_dv:otp_ctrl_lc_signals_test_sim_dv' failed; build aborted: Target //sw/device/tests/sim_dv:otp_ctrl_lc_signals_test_sim_dv is incompatible and cannot be built, but was explicitly requested.
Dependency chain:
//sw/device/tests/sim_dv:otp_ctrl_lc_signals_test_sim_dv (f2055d) <-- target platform (//toolchain:opentitan_platform) didn't satisfy constraint @@platforms//:incompatible
INFO: Elapsed time: 0.379s, Critical Path: 0.03s
INFO: 1 process: 1 internal.
ERROR: Build did NOT complete successfully
_run_cmd -> had a non-zero return code of 1.
make: *** [/nightly/current_run/opentitan/hw/dv/tools/dvsim/sim.mk:58: sw_build] Error 1
chip_sw_otp_ctrl_vendor_test_csr_access 34797005752787682436113213600845066611737779636550941742809636639438579152179 None
Use --verbose_failures to see the command lines of failed build steps.
ERROR: Analysis of target '//sw/device/tests/sim_dv:otp_ctrl_vendor_test_csr_access_test_sim_dv' failed; build aborted: Target //sw/device/tests/sim_dv:otp_ctrl_vendor_test_csr_access_test_sim_dv is incompatible and cannot be built, but was explicitly requested.
Dependency chain:
//sw/device/tests/sim_dv:otp_ctrl_vendor_test_csr_access_test_sim_dv (f2055d) <-- target platform (//toolchain:opentitan_platform) didn't satisfy constraint @@platforms//:incompatible
INFO: Elapsed time: 3.555s, Critical Path: 0.02s
INFO: 1 process: 1 internal.
ERROR: Build did NOT complete successfully
_run_cmd -> had a non-zero return code of 1.
make: *** [/nightly/current_run/opentitan/hw/dv/tools/dvsim/sim.mk:58: sw_build] Error 1
chip_sw_otp_ctrl_nvm_cnt 37863019403308957068448360956662836093026293763629447377268968666561515612700 None
Another command (pid=379591) is running. Waiting for it to complete on the server (server_pid=191100)...
Another command (pid=375102) is running. Waiting for it to complete on the server (server_pid=191100)...
Another command (pid=460932) is running. Waiting for it to complete on the server (server_pid=191100)...
WARNING: Target pattern parsing failed.
ERROR: Skipping '//sw/device/tests:otp_ctrl_nvm_cnt_test_sim_dv': no such target '//sw/device/tests:otp_ctrl_nvm_cnt_test_sim_dv': target 'otp_ctrl_nvm_cnt_test_sim_dv' not declared in package 'sw/device/tests' defined by /nightly/current_run/opentitan/sw/device/tests/BUILD
ERROR: no such target '//sw/device/tests:otp_ctrl_nvm_cnt_test_sim_dv': target 'otp_ctrl_nvm_cnt_test_sim_dv' not declared in package 'sw/device/tests' defined by /nightly/current_run/opentitan/sw/device/tests/BUILD
ERROR: Build did NOT complete successfully
_run_cmd -> had a non-zero return code of 1.
make: *** [/nightly/current_run/opentitan/hw/dv/tools/dvsim/sim.mk:58: sw_build] Error 1
chip_sw_otp_ctrl_sw_parts 112499696332436478148566648289986917572654177850968161222604309877508039180061 None
---- STDERR ----
Another command (pid=361074) is running. Waiting for it to complete on the server (server_pid=191100)...
Another command (pid=379458) is running. Waiting for it to complete on the server (server_pid=191100)...
WARNING: Target pattern parsing failed.
ERROR: Skipping '//sw/device/tests:otp_ctrl_sw_parts_test_sim_dv': no such target '//sw/device/tests:otp_ctrl_sw_parts_test_sim_dv': target 'otp_ctrl_sw_parts_test_sim_dv' not declared in package 'sw/device/tests' defined by /nightly/current_run/opentitan/sw/device/tests/BUILD
ERROR: no such target '//sw/device/tests:otp_ctrl_sw_parts_test_sim_dv': target 'otp_ctrl_sw_parts_test_sim_dv' not declared in package 'sw/device/tests' defined by /nightly/current_run/opentitan/sw/device/tests/BUILD
ERROR: Build did NOT complete successfully
_run_cmd -> had a non-zero return code of 1.
make: *** [/nightly/current_run/opentitan/hw/dv/tools/dvsim/sim.mk:58: sw_build] Error 1
chip_sw_lc_ctrl_transition 3713363103334657497521919127260006946742983751249632553583659230071740187154 None
Use --verbose_failures to see the command lines of failed build steps.
ERROR: Analysis of target '//sw/device/tests/sim_dv:lc_ctrl_transition_test_sim_dv' failed; build aborted: Target //sw/device/tests/sim_dv:lc_ctrl_transition_test_sim_dv is incompatible and cannot be built, but was explicitly requested.
Dependency chain:
//sw/device/tests/sim_dv:lc_ctrl_transition_test_sim_dv (f2055d) <-- target platform (//toolchain:opentitan_platform) didn't satisfy constraint @@platforms//:incompatible
INFO: Elapsed time: 1.293s, Critical Path: 0.02s
INFO: 1 process: 1 internal.
ERROR: Build did NOT complete successfully
_run_cmd -> had a non-zero return code of 1.
make: *** [/nightly/current_run/opentitan/hw/dv/tools/dvsim/sim.mk:58: sw_build] Error 1
chip_sw_lc_walkthrough_dev 5527104838230163790365185563090822715907116191294591624348368241417848791368 None
Use --verbose_failures to see the command lines of failed build steps.
ERROR: Analysis of target '//sw/device/tests/sim_dv:lc_walkthrough_test_sim_dv' failed; build aborted: Target //sw/device/tests/sim_dv:lc_walkthrough_test_sim_dv is incompatible and cannot be built, but was explicitly requested.
Dependency chain:
//sw/device/tests/sim_dv:lc_walkthrough_test_sim_dv (f2055d) <-- target platform (//toolchain:opentitan_platform) didn't satisfy constraint @@platforms//:incompatible
INFO: Elapsed time: 7.752s, Critical Path: 0.01s
INFO: 1 process: 1 internal.
ERROR: Build did NOT complete successfully
_run_cmd -> had a non-zero return code of 1.
make: *** [/nightly/current_run/opentitan/hw/dv/tools/dvsim/sim.mk:58: sw_build] Error 1
chip_sw_lc_walkthrough_prod 5569120290321622294233723379878217676559548821545845775024863502985464797769 None
Use --verbose_failures to see the command lines of failed build steps.
ERROR: Analysis of target '//sw/device/tests/sim_dv:lc_walkthrough_test_sim_dv' failed; build aborted: Target //sw/device/tests/sim_dv:lc_walkthrough_test_sim_dv is incompatible and cannot be built, but was explicitly requested.
Dependency chain:
//sw/device/tests/sim_dv:lc_walkthrough_test_sim_dv (f2055d) <-- target platform (//toolchain:opentitan_platform) didn't satisfy constraint @@platforms//:incompatible
INFO: Elapsed time: 16.225s, Critical Path: 0.01s
INFO: 1 process: 1 internal.
ERROR: Build did NOT complete successfully
_run_cmd -> had a non-zero return code of 1.
make: *** [/nightly/current_run/opentitan/hw/dv/tools/dvsim/sim.mk:58: sw_build] Error 1
chip_sw_lc_walkthrough_prodend 76337096159125662261548898128322599663812219377015096409956500491215642949671 None
Use --verbose_failures to see the command lines of failed build steps.
ERROR: Analysis of target '//sw/device/tests/sim_dv:lc_walkthrough_test_sim_dv' failed; build aborted: Target //sw/device/tests/sim_dv:lc_walkthrough_test_sim_dv is incompatible and cannot be built, but was explicitly requested.
Dependency chain:
//sw/device/tests/sim_dv:lc_walkthrough_test_sim_dv (f2055d) <-- target platform (//toolchain:opentitan_platform) didn't satisfy constraint @@platforms//:incompatible
INFO: Elapsed time: 0.729s, Critical Path: 0.00s
INFO: 1 process: 1 internal.
ERROR: Build did NOT complete successfully
_run_cmd -> had a non-zero return code of 1.
make: *** [/nightly/current_run/opentitan/hw/dv/tools/dvsim/sim.mk:58: sw_build] Error 1
chip_sw_lc_walkthrough_rma 26549474043868698935503187829873731865376647368140966170029722422595736833966 None
Use --verbose_failures to see the command lines of failed build steps.
ERROR: Analysis of target '//sw/device/tests/sim_dv:lc_walkthrough_test_sim_dv' failed; build aborted: Target //sw/device/tests/sim_dv:lc_walkthrough_test_sim_dv is incompatible and cannot be built, but was explicitly requested.
Dependency chain:
//sw/device/tests/sim_dv:lc_walkthrough_test_sim_dv (f2055d) <-- target platform (//toolchain:opentitan_platform) didn't satisfy constraint @@platforms//:incompatible
INFO: Elapsed time: 0.730s, Critical Path: 0.02s
INFO: 1 process: 1 internal.
ERROR: Build did NOT complete successfully
_run_cmd -> had a non-zero return code of 1.
make: *** [/nightly/current_run/opentitan/hw/dv/tools/dvsim/sim.mk:58: sw_build] Error 1
chip_sw_lc_walkthrough_testunlocks 42439540270985688814699590065005507821647457892092034840672320069692338575128 None
Use --verbose_failures to see the command lines of failed build steps.
ERROR: Analysis of target '//sw/device/tests/sim_dv:lc_walkthrough_testunlocks_test_sim_dv' failed; build aborted: Target //sw/device/tests/sim_dv:lc_walkthrough_testunlocks_test_sim_dv is incompatible and cannot be built, but was explicitly requested.
Dependency chain:
//sw/device/tests/sim_dv:lc_walkthrough_testunlocks_test_sim_dv (f2055d) <-- target platform (//toolchain:opentitan_platform) didn't satisfy constraint @@platforms//:incompatible
INFO: Elapsed time: 0.189s, Critical Path: 0.02s
INFO: 1 process: 1 internal.
ERROR: Build did NOT complete successfully
_run_cmd -> had a non-zero return code of 1.
make: *** [/nightly/current_run/opentitan/hw/dv/tools/dvsim/sim.mk:58: sw_build] Error 1
chip_sw_pwrmgr_main_power_glitch_reset 108625886043934291546230510888964205349429760135700652291484781065073188348376 None
Use --verbose_failures to see the command lines of failed build steps.
ERROR: Analysis of target '//sw/device/tests/sim_dv:pwrmgr_main_power_glitch_test_sim_dv' failed; build aborted: Target //sw/device/tests/sim_dv:pwrmgr_main_power_glitch_test_sim_dv is incompatible and cannot be built, but was explicitly requested.
Dependency chain:
//sw/device/tests/sim_dv:pwrmgr_main_power_glitch_test_sim_dv (f2055d) <-- target platform (//toolchain:opentitan_platform) didn't satisfy constraint @@platforms//:incompatible
INFO: Elapsed time: 0.287s, Critical Path: 0.02s
INFO: 1 process: 1 internal.
ERROR: Build did NOT complete successfully
_run_cmd -> had a non-zero return code of 1.
make: *** [/nightly/current_run/opentitan/hw/dv/tools/dvsim/sim.mk:58: sw_build] Error 1
chip_sw_pwrmgr_sleep_power_glitch_reset 99240828775545939583883985375602609578845213179319144997683956297221636461294 None
Use --verbose_failures to see the command lines of failed build steps.
ERROR: Analysis of target '//sw/device/tests/sim_dv:pwrmgr_sleep_power_glitch_test_sim_dv' failed; build aborted: Target //sw/device/tests/sim_dv:pwrmgr_sleep_power_glitch_test_sim_dv is incompatible and cannot be built, but was explicitly requested.
Dependency chain:
//sw/device/tests/sim_dv:pwrmgr_sleep_power_glitch_test_sim_dv (f2055d) <-- target platform (//toolchain:opentitan_platform) didn't satisfy constraint @@platforms//:incompatible
INFO: Elapsed time: 0.293s, Critical Path: 0.03s
INFO: 1 process: 1 internal.
ERROR: Build did NOT complete successfully
_run_cmd -> had a non-zero return code of 1.
make: *** [/nightly/current_run/opentitan/hw/dv/tools/dvsim/sim.mk:58: sw_build] Error 1
chip_sw_pwrmgr_deep_sleep_power_glitch_reset 27276324233114997002224004966616801723911143046938023526122403695295234142349 None
Use --verbose_failures to see the command lines of failed build steps.
ERROR: Analysis of target '//sw/device/tests/sim_dv:pwrmgr_deep_sleep_power_glitch_test_sim_dv' failed; build aborted: Target //sw/device/tests/sim_dv:pwrmgr_deep_sleep_power_glitch_test_sim_dv is incompatible and cannot be built, but was explicitly requested.
Dependency chain:
//sw/device/tests/sim_dv:pwrmgr_deep_sleep_power_glitch_test_sim_dv (f2055d) <-- target platform (//toolchain:opentitan_platform) didn't satisfy constraint @@platforms//:incompatible
INFO: Elapsed time: 0.310s, Critical Path: 0.03s
INFO: 1 process: 1 internal.
ERROR: Build did NOT complete successfully
_run_cmd -> had a non-zero return code of 1.
make: *** [/nightly/current_run/opentitan/hw/dv/tools/dvsim/sim.mk:58: sw_build] Error 1
chip_sw_pwrmgr_random_sleep_power_glitch_reset 5920010940439855025868879884109035318607242049464768107387446841911204612983 None
Use --verbose_failures to see the command lines of failed build steps.
ERROR: Analysis of target '//sw/device/tests/sim_dv:pwrmgr_random_sleep_power_glitch_reset_test_sim_dv' failed; build aborted: Target //sw/device/tests/sim_dv:pwrmgr_random_sleep_power_glitch_reset_test_sim_dv is incompatible and cannot be built, but was explicitly requested.
Dependency chain:
//sw/device/tests/sim_dv:pwrmgr_random_sleep_power_glitch_reset_test_sim_dv (f2055d) <-- target platform (//toolchain:opentitan_platform) didn't satisfy constraint @@platforms//:incompatible
INFO: Elapsed time: 5.618s, Critical Path: 0.02s
INFO: 1 process: 1 internal.
ERROR: Build did NOT complete successfully
_run_cmd -> had a non-zero return code of 1.
make: *** [/nightly/current_run/opentitan/hw/dv/tools/dvsim/sim.mk:58: sw_build] Error 1
chip_sw_pwrmgr_sleep_disabled 45409517047199762650534357246000427179914106799397511086715816348098872909123 None
Use --verbose_failures to see the command lines of failed build steps.
ERROR: Analysis of target '//sw/device/tests:pwrmgr_sleep_disabled_test_sim_dv' failed; build aborted: Target //sw/device/tests:pwrmgr_sleep_disabled_test_sim_dv is incompatible and cannot be built, but was explicitly requested.
Dependency chain:
//sw/device/tests:pwrmgr_sleep_disabled_test_sim_dv (f2055d) <-- target platform (//toolchain:opentitan_platform) didn't satisfy constraint @@platforms//:incompatible
INFO: Elapsed time: 0.248s, Critical Path: 0.01s
INFO: 1 process: 1 internal.
ERROR: Build did NOT complete successfully
_run_cmd -> had a non-zero return code of 1.
make: *** [/nightly/current_run/opentitan/hw/dv/tools/dvsim/sim.mk:58: sw_build] Error 1
chip_sw_pwrmgr_wdog_reset 78849029225115187090860820406853444393389967665059484257525210539829945588860 None
Use --verbose_failures to see the command lines of failed build steps.
ERROR: Analysis of target '//sw/device/tests:pwrmgr_wdog_reset_reqs_test_sim_dv' failed; build aborted: Target //sw/device/tests:pwrmgr_wdog_reset_reqs_test_sim_dv is incompatible and cannot be built, but was explicitly requested.
Dependency chain:
//sw/device/tests:pwrmgr_wdog_reset_reqs_test_sim_dv (f2055d) <-- target platform (//toolchain:opentitan_platform) didn't satisfy constraint @@platforms//:incompatible
INFO: Elapsed time: 0.270s, Critical Path: 0.02s
INFO: 1 process: 1 internal.
ERROR: Build did NOT complete successfully
_run_cmd -> had a non-zero return code of 1.
make: *** [/nightly/current_run/opentitan/hw/dv/tools/dvsim/sim.mk:58: sw_build] Error 1
chip_sw_alert_test 47903216925818452827672461341517585938538498675487154685095924990816311915613 None
Another command (pid=684190) is running. Waiting for it to complete on the server (server_pid=191100)...
WARNING: Target pattern parsing failed.
ERROR: Skipping '//sw/device/tests/autogen/top_darjeeling:alert_test_sim_dv': no such package 'sw/device/tests/autogen/top_darjeeling': BUILD file not found in any of the following directories. Add a BUILD file to a directory to mark it as a package.
- sw/device/tests/autogen/top_darjeeling
ERROR: no such package 'sw/device/tests/autogen/top_darjeeling': BUILD file not found in any of the following directories. Add a BUILD file to a directory to mark it as a package.
- sw/device/tests/autogen/top_darjeeling
ERROR: Build did NOT complete successfully
_run_cmd -> had a non-zero return code of 1.
make: *** [/nightly/current_run/opentitan/hw/dv/tools/dvsim/sim.mk:58: sw_build] Error 1
chip_sw_alert_handler_escalation 69645597777424866996963273302553154187557292078614226258225685888962722448833 None
Use --verbose_failures to see the command lines of failed build steps.
ERROR: Analysis of target '//sw/device/tests:alert_handler_escalation_test_sim_dv' failed; build aborted: Target //sw/device/tests:alert_handler_escalation_test_sim_dv is incompatible and cannot be built, but was explicitly requested.
Dependency chain:
//sw/device/tests:alert_handler_escalation_test_sim_dv (f2055d) <-- target platform (//toolchain:opentitan_platform) didn't satisfy constraint @@platforms//:incompatible
INFO: Elapsed time: 32.933s, Critical Path: 0.02s
INFO: 1 process: 1 internal.
ERROR: Build did NOT complete successfully
_run_cmd -> had a non-zero return code of 1.
make: *** [/nightly/current_run/opentitan/hw/dv/tools/dvsim/sim.mk:58: sw_build] Error 1
chip_sw_alert_handler_reverse_ping_in_deep_sleep 112691791909189443649210062671190776241879005854194356022021843151674320260736 None
Use --verbose_failures to see the command lines of failed build steps.
ERROR: Analysis of target '//sw/device/tests:alert_handler_reverse_ping_in_deep_sleep_test_sim_dv' failed; build aborted: Target //sw/device/tests:alert_handler_reverse_ping_in_deep_sleep_test_sim_dv is incompatible and cannot be built, but was explicitly requested.
Dependency chain:
//sw/device/tests:alert_handler_reverse_ping_in_deep_sleep_test_sim_dv (f2055d) <-- target platform (//toolchain:opentitan_platform) didn't satisfy constraint @@platforms//:incompatible
INFO: Elapsed time: 0.627s, Critical Path: 0.01s
INFO: 1 process: 1 internal.
ERROR: Build did NOT complete successfully
_run_cmd -> had a non-zero return code of 1.
make: *** [/nightly/current_run/opentitan/hw/dv/tools/dvsim/sim.mk:58: sw_build] Error 1
chip_sw_alert_handler_lpg_sleep_mode_alerts 23104273181355506996176443932118872617731775054143112701031502606005482873289 None
Another command (pid=372501) is running. Waiting for it to complete on the server (server_pid=191100)...
Another command (pid=460932) is running. Waiting for it to complete on the server (server_pid=191100)...
Another command (pid=461990) is running. Waiting for it to complete on the server (server_pid=191100)...
WARNING: Target pattern parsing failed.
ERROR: Skipping '//sw/device/tests:alert_handler_lpg_sleep_mode_alerts_test_sim_dv': no such target '//sw/device/tests:alert_handler_lpg_sleep_mode_alerts_test_sim_dv': target 'alert_handler_lpg_sleep_mode_alerts_test_sim_dv' not declared in package 'sw/device/tests' defined by /nightly/current_run/opentitan/sw/device/tests/BUILD
ERROR: no such target '//sw/device/tests:alert_handler_lpg_sleep_mode_alerts_test_sim_dv': target 'alert_handler_lpg_sleep_mode_alerts_test_sim_dv' not declared in package 'sw/device/tests' defined by /nightly/current_run/opentitan/sw/device/tests/BUILD
ERROR: Build did NOT complete successfully
_run_cmd -> had a non-zero return code of 1.
make: *** [/nightly/current_run/opentitan/hw/dv/tools/dvsim/sim.mk:58: sw_build] Error 1
chip_sw_alert_handler_lpg_sleep_mode_pings 92543186944192506683438834985689199384344863320015929563334869767118165233903 None
Use --verbose_failures to see the command lines of failed build steps.
ERROR: Analysis of target '//sw/device/tests:alert_handler_lpg_sleep_mode_pings_test_sim_dv' failed; build aborted: Target //sw/device/tests:alert_handler_lpg_sleep_mode_pings_test_sim_dv is incompatible and cannot be built, but was explicitly requested.
Dependency chain:
//sw/device/tests:alert_handler_lpg_sleep_mode_pings_test_sim_dv (f2055d) <-- target platform (//toolchain:opentitan_platform) didn't satisfy constraint @@platforms//:incompatible
INFO: Elapsed time: 0.794s, Critical Path: 0.02s
INFO: 1 process: 1 internal.
ERROR: Build did NOT complete successfully
_run_cmd -> had a non-zero return code of 1.
make: *** [/nightly/current_run/opentitan/hw/dv/tools/dvsim/sim.mk:58: sw_build] Error 1
chip_sw_alert_handler_lpg_clkoff 27402271281419025124024228673101451950161347624864320469765045341566522288716 None
Use --verbose_failures to see the command lines of failed build steps.
ERROR: Analysis of target '//sw/device/tests:alert_handler_lpg_clkoff_test_sim_dv' failed; build aborted: Target //sw/device/tests:alert_handler_lpg_clkoff_test_sim_dv is incompatible and cannot be built, but was explicitly requested.
Dependency chain:
//sw/device/tests:alert_handler_lpg_clkoff_test_sim_dv (f2055d) <-- target platform (//toolchain:opentitan_platform) didn't satisfy constraint @@platforms//:incompatible
INFO: Elapsed time: 0.599s, Critical Path: 0.02s
INFO: 1 process: 1 internal.
ERROR: Build did NOT complete successfully
_run_cmd -> had a non-zero return code of 1.
make: *** [/nightly/current_run/opentitan/hw/dv/tools/dvsim/sim.mk:58: sw_build] Error 1
chip_sw_alert_handler_lpg_reset_toggle 36789223177613768816861437442866744885835215044840866065075722145089796767559 None
Use --verbose_failures to see the command lines of failed build steps.
ERROR: Analysis of target '//sw/device/tests:alert_handler_lpg_reset_toggle_test_sim_dv' failed; build aborted: Target //sw/device/tests:alert_handler_lpg_reset_toggle_test_sim_dv is incompatible and cannot be built, but was explicitly requested.
Dependency chain:
//sw/device/tests:alert_handler_lpg_reset_toggle_test_sim_dv (f2055d) <-- target platform (//toolchain:opentitan_platform) didn't satisfy constraint @@platforms//:incompatible
INFO: Elapsed time: 4.177s, Critical Path: 0.02s
INFO: 1 process: 1 internal.
ERROR: Build did NOT complete successfully
_run_cmd -> had a non-zero return code of 1.
make: *** [/nightly/current_run/opentitan/hw/dv/tools/dvsim/sim.mk:58: sw_build] Error 1
chip_sw_alert_handler_entropy 91547624287391776829816031871710683504185464166140601230379824818411094937654 None
Use --verbose_failures to see the command lines of failed build steps.
ERROR: Analysis of target '//sw/device/tests/sim_dv:alert_handler_entropy_test_sim_dv' failed; build aborted: Target //sw/device/tests/sim_dv:alert_handler_entropy_test_sim_dv is incompatible and cannot be built, but was explicitly requested.
Dependency chain:
//sw/device/tests/sim_dv:alert_handler_entropy_test_sim_dv (f2055d) <-- target platform (//toolchain:opentitan_platform) didn't satisfy constraint @@platforms//:incompatible
INFO: Elapsed time: 3.181s, Critical Path: 0.02s
INFO: 1 process: 1 internal.
ERROR: Build did NOT complete successfully
_run_cmd -> had a non-zero return code of 1.
make: *** [/nightly/current_run/opentitan/hw/dv/tools/dvsim/sim.mk:58: sw_build] Error 1
chip_sw_csrng_fuse_en_sw_app_read_test 103518956228111082769099765370242145252001163281590458305067702163563031800652 None
Use --verbose_failures to see the command lines of failed build steps.
ERROR: Analysis of target '//sw/device/tests/sim_dv:csrng_fuse_en_sw_app_read_sim_dv' failed; build aborted: Target //sw/device/tests/sim_dv:csrng_fuse_en_sw_app_read_sim_dv is incompatible and cannot be built, but was explicitly requested.
Dependency chain:
//sw/device/tests/sim_dv:csrng_fuse_en_sw_app_read_sim_dv (f2055d) <-- target platform (//toolchain:opentitan_platform) didn't satisfy constraint @@platforms//:incompatible
INFO: Elapsed time: 0.421s, Critical Path: 0.02s
INFO: 1 process: 1 internal.
ERROR: Build did NOT complete successfully
_run_cmd -> had a non-zero return code of 1.
make: *** [/nightly/current_run/opentitan/hw/dv/tools/dvsim/sim.mk:58: sw_build] Error 1
chip_sw_kmac_app_rom 28864966641042169664295733421540983774141774548377474085519731266355099799448 None
INFO: [build_sw_collateral_for_sim.py:202] cquery_cmd = ./bazelisk.sh cquery labels(data, //sw/device/tests:kmac_app_rom_test_sim_dv) union labels(srcs, //sw/device/tests:kmac_app_rom_test_sim_dv) --ui_event_filters=-info --noshow_progress --//hw/top=darjeeling --//hw/top=darjeeling --output=starlark
---- STDOUT ----
---- STDERR ----
Another command (pid=1159244) is running. Waiting for it to complete on the server (server_pid=191100)...
ERROR: Error doing post analysis query: Evaluation of subquery "labels('data', //sw/device/tests:kmac_app_rom_test_sim_dv)" failed (did you want to use --keep_going?): in 'data' of rule //sw/device/tests:kmac_app_rom_test_sim_dv: configured target of type test_suite does not have attribute 'data'
ERROR: Build did NOT complete successfully
_run_cmd -> had a non-zero return code of 1.
make: *** [/nightly/current_run/opentitan/hw/dv/tools/dvsim/sim.mk:58: sw_build] Error 1
chip_sw_sram_ctrl_scrambled_access_jitter_en 78791451301574369386548993217361655109770102895776091682553989188947425366007 None
Another command (pid=1367489) is running. Waiting for it to complete on the server (server_pid=191100)...
Another command (pid=1369102) is running. Waiting for it to complete on the server (server_pid=191100)...
Another command (pid=1367928) is running. Waiting for it to complete on the server (server_pid=191100)...
WARNING: Target pattern parsing failed.
ERROR: Skipping '//sw/device/tests/sim_dv:sram_ctrl_scrambled_access_test_sim_dv': no such target '//sw/device/tests/sim_dv:sram_ctrl_scrambled_access_test_sim_dv': target 'sram_ctrl_scrambled_access_test_sim_dv' not declared in package 'sw/device/tests/sim_dv' defined by /nightly/current_run/opentitan/sw/device/tests/sim_dv/BUILD
ERROR: no such target '//sw/device/tests/sim_dv:sram_ctrl_scrambled_access_test_sim_dv': target 'sram_ctrl_scrambled_access_test_sim_dv' not declared in package 'sw/device/tests/sim_dv' defined by /nightly/current_run/opentitan/sw/device/tests/sim_dv/BUILD
ERROR: Build did NOT complete successfully
_run_cmd -> had a non-zero return code of 1.
make: *** [/nightly/current_run/opentitan/hw/dv/tools/dvsim/sim.mk:58: sw_build] Error 1
chip_sw_sram_ctrl_execution_main 81064133625661128687589789517098447457687750284422961337115116621819857153408 None
Use --verbose_failures to see the command lines of failed build steps.
ERROR: Analysis of target '//sw/device/tests/sim_dv:sram_ctrl_execution_main_test_sim_dv' failed; build aborted: Target //sw/device/tests/sim_dv:sram_ctrl_execution_main_test_sim_dv is incompatible and cannot be built, but was explicitly requested.
Dependency chain:
//sw/device/tests/sim_dv:sram_ctrl_execution_main_test_sim_dv (f2055d) <-- target platform (//toolchain:opentitan_platform) didn't satisfy constraint @@platforms//:incompatible
INFO: Elapsed time: 5.070s, Critical Path: 0.03s
INFO: 1 process: 1 internal.
ERROR: Build did NOT complete successfully
_run_cmd -> had a non-zero return code of 1.
make: *** [/nightly/current_run/opentitan/hw/dv/tools/dvsim/sim.mk:58: sw_build] Error 1
chip_sw_coremark 71936930846649312679304457458488011960821963986868477942551296760097980768576 None
Another command (pid=476088) is running. Waiting for it to complete on the server (server_pid=191100)...
WARNING: Target pattern parsing failed.
ERROR: Skipping '//third_party/coremark/top_darjeeling:coremark_test_sim_dv': no such package 'third_party/coremark/top_darjeeling': BUILD file not found in any of the following directories. Add a BUILD file to a directory to mark it as a package.
- third_party/coremark/top_darjeeling
ERROR: no such package 'third_party/coremark/top_darjeeling': BUILD file not found in any of the following directories. Add a BUILD file to a directory to mark it as a package.
- third_party/coremark/top_darjeeling
ERROR: Build did NOT complete successfully
_run_cmd -> had a non-zero return code of 1.
make: *** [/nightly/current_run/opentitan/hw/dv/tools/dvsim/sim.mk:58: sw_build] Error 1
chip_sw_clkmgr_reset_frequency 82187553889890450008809649104410577425969620243187354625337953844612022710947 None
Use --verbose_failures to see the command lines of failed build steps.
ERROR: Analysis of target '//sw/device/tests:clkmgr_reset_frequency_test_sim_dv' failed; build aborted: Target //sw/device/tests:clkmgr_reset_frequency_test_sim_dv is incompatible and cannot be built, but was explicitly requested.
Dependency chain:
//sw/device/tests:clkmgr_reset_frequency_test_sim_dv (f2055d) <-- target platform (//toolchain:opentitan_platform) didn't satisfy constraint @@platforms//:incompatible
INFO: Elapsed time: 0.234s, Critical Path: 0.02s
INFO: 1 process: 1 internal.
ERROR: Build did NOT complete successfully
_run_cmd -> had a non-zero return code of 1.
make: *** [/nightly/current_run/opentitan/hw/dv/tools/dvsim/sim.mk:58: sw_build] Error 1
chip_sw_clkmgr_sleep_frequency 42606863968203408292209892324989578610945816400733973931148388761157725970231 None
Use --verbose_failures to see the command lines of failed build steps.
ERROR: Analysis of target '//sw/device/tests:clkmgr_sleep_frequency_test_sim_dv' failed; build aborted: Target //sw/device/tests:clkmgr_sleep_frequency_test_sim_dv is incompatible and cannot be built, but was explicitly requested.
Dependency chain:
//sw/device/tests:clkmgr_sleep_frequency_test_sim_dv (f2055d) <-- target platform (//toolchain:opentitan_platform) didn't satisfy constraint @@platforms//:incompatible
INFO: Elapsed time: 0.263s, Critical Path: 0.03s
INFO: 1 process: 1 internal.
ERROR: Build did NOT complete successfully
_run_cmd -> had a non-zero return code of 1.
make: *** [/nightly/current_run/opentitan/hw/dv/tools/dvsim/sim.mk:58: sw_build] Error 1
chip_sw_ast_clk_outputs 25452397419904200024963208172686559217616288483201399753799449508951830399359 None
Use --verbose_failures to see the command lines of failed build steps.
ERROR: Analysis of target '//sw/device/tests:ast_clk_outs_test_sim_dv' failed; build aborted: Target //sw/device/tests:ast_clk_outs_test_sim_dv is incompatible and cannot be built, but was explicitly requested.
Dependency chain:
//sw/device/tests:ast_clk_outs_test_sim_dv (f2055d) <-- target platform (//toolchain:opentitan_platform) didn't satisfy constraint @@platforms//:incompatible
INFO: Elapsed time: 1.398s, Critical Path: 0.02s
INFO: 1 process: 1 internal.
ERROR: Build did NOT complete successfully
_run_cmd -> had a non-zero return code of 1.
make: *** [/nightly/current_run/opentitan/hw/dv/tools/dvsim/sim.mk:58: sw_build] Error 1
chip_sw_lc_ctrl_program_error 29372909182887219097728639862435037607127416070199320465527537606235664394276 None
Use --verbose_failures to see the command lines of failed build steps.
ERROR: Analysis of target '//sw/device/tests/sim_dv:lc_ctrl_program_error_sim_dv' failed; build aborted: Target //sw/device/tests/sim_dv:lc_ctrl_program_error_sim_dv is incompatible and cannot be built, but was explicitly requested.
Dependency chain:
//sw/device/tests/sim_dv:lc_ctrl_program_error_sim_dv (f2055d) <-- target platform (//toolchain:opentitan_platform) didn't satisfy constraint @@platforms//:incompatible
INFO: Elapsed time: 8.261s, Critical Path: 0.02s
INFO: 1 process: 1 internal.
ERROR: Build did NOT complete successfully
_run_cmd -> had a non-zero return code of 1.
make: *** [/nightly/current_run/opentitan/hw/dv/tools/dvsim/sim.mk:58: sw_build] Error 1
chip_sw_rv_dm_ndm_reset_req_when_cpu_halted 75002023392780327788192743761682501808496230956715809466050357879775318127564 None
---- STDERR ----
Another command (pid=1323966) is running. Waiting for it to complete on the server (server_pid=191100)...
WARNING: Target pattern parsing failed.
ERROR: Skipping '//sw/device/tests:rv_dm_ndm_reset_req_when_cpu_halted_sim_dv': no such target '//sw/device/tests:rv_dm_ndm_reset_req_when_cpu_halted_sim_dv': target 'rv_dm_ndm_reset_req_when_cpu_halted_sim_dv' not declared in package 'sw/device/tests' defined by /nightly/current_run/opentitan/sw/device/tests/BUILD (did you mean rv_dm_ndm_reset_req_when_cpu_halted_dev_sim_dv, or rv_dm_ndm_reset_req_when_cpu_halted_rma_sim_dv?)
ERROR: no such target '//sw/device/tests:rv_dm_ndm_reset_req_when_cpu_halted_sim_dv': target 'rv_dm_ndm_reset_req_when_cpu_halted_sim_dv' not declared in package 'sw/device/tests' defined by /nightly/current_run/opentitan/sw/device/tests/BUILD (did you mean rv_dm_ndm_reset_req_when_cpu_halted_dev_sim_dv, or rv_dm_ndm_reset_req_when_cpu_halted_rma_sim_dv?)
ERROR: Build did NOT complete successfully
_run_cmd -> had a non-zero return code of 1.
make: *** [/nightly/current_run/opentitan/hw/dv/tools/dvsim/sim.mk:58: sw_build] Error 1
chip_sw_rv_dm_access_after_wakeup 80593443899604720906248673691823716222076432217510712830634428845942060800437 None
---- STDERR ----
Another command (pid=1324265) is running. Waiting for it to complete on the server (server_pid=191100)...
Another command (pid=1324328) is running. Waiting for it to complete on the server (server_pid=191100)...
WARNING: Target pattern parsing failed.
ERROR: Skipping '//sw/device/tests:rv_dm_access_after_wakeup_sim_dv': no such target '//sw/device/tests:rv_dm_access_after_wakeup_sim_dv': target 'rv_dm_access_after_wakeup_sim_dv' not declared in package 'sw/device/tests' defined by /nightly/current_run/opentitan/sw/device/tests/BUILD (did you mean rv_dm_access_after_wakeup_dev_sim_dv, or rv_dm_access_after_wakeup_rma_sim_dv?)
ERROR: no such target '//sw/device/tests:rv_dm_access_after_wakeup_sim_dv': target 'rv_dm_access_after_wakeup_sim_dv' not declared in package 'sw/device/tests' defined by /nightly/current_run/opentitan/sw/device/tests/BUILD (did you mean rv_dm_access_after_wakeup_dev_sim_dv, or rv_dm_access_after_wakeup_rma_sim_dv?)
ERROR: Build did NOT complete successfully
_run_cmd -> had a non-zero return code of 1.
make: *** [/nightly/current_run/opentitan/hw/dv/tools/dvsim/sim.mk:58: sw_build] Error 1
chip_sw_rv_dm_access_after_escalation_reset 84042464838013897452581009429072668236751111489805058747512369539178379574949 None
Use --verbose_failures to see the command lines of failed build steps.
ERROR: Analysis of target '//sw/device/tests:alert_handler_escalation_test_sim_dv' failed; build aborted: Target //sw/device/tests:alert_handler_escalation_test_sim_dv is incompatible and cannot be built, but was explicitly requested.
Dependency chain:
//sw/device/tests:alert_handler_escalation_test_sim_dv (f2055d) <-- target platform (//toolchain:opentitan_platform) didn't satisfy constraint @@platforms//:incompatible
INFO: Elapsed time: 0.578s, Critical Path: 0.01s
INFO: 1 process: 1 internal.
ERROR: Build did NOT complete successfully
_run_cmd -> had a non-zero return code of 1.
make: *** [/nightly/current_run/opentitan/hw/dv/tools/dvsim/sim.mk:58: sw_build] Error 1
chip_sw_power_virus 48815715081966173457052452817461821315454239676349266434137272223462965833161 None
Use --verbose_failures to see the command lines of failed build steps.
ERROR: Analysis of target '//sw/device/tests:power_virus_systemtest_sim_dv' failed; build aborted: Target //sw/device/tests:power_virus_systemtest_sim_dv is incompatible and cannot be built, but was explicitly requested.
Dependency chain:
//sw/device/tests:power_virus_systemtest_sim_dv (f2055d) <-- target platform (//toolchain:opentitan_platform) didn't satisfy constraint @@platforms//:incompatible
INFO: Elapsed time: 6.289s, Critical Path: 0.02s
INFO: 1 process: 1 internal.
ERROR: Build did NOT complete successfully
_run_cmd -> had a non-zero return code of 1.
make: *** [/nightly/current_run/opentitan/hw/dv/tools/dvsim/sim.mk:58: sw_build] Error 1
base_rom_e2e_smoke 34803274552007570455619052835428448224437185270818381593432258081689478932804 None
_deploy_software_collateral(args)
~~~~~~~~~~~~~~~~~~~~~~~~~~~^^^^^^
File "/nightly/current_run/opentitan/util/py/scripts/build_sw_collateral_for_sim.py", line 324, in _deploy_software_collateral
image_string = ImageString(image)
File "<string>", line 4, in __init__
File "/nightly/current_run/opentitan/util/py/scripts/build_sw_collateral_for_sim.py", line 256, in __post_init__
assert flag in KNOWN_FLAGS, f"Unknown flag '{flag}' used in sw_image '{self.raw}'"
^^^^^^^^^^^^^^^^^^^
AssertionError: Unknown flag 'test_in_second_rom' used in sw_image '//sw/device/silicon_creator/rom/e2e:base_rom_e2e_smoke:7:test_in_second_rom'
make: *** [/nightly/current_run/opentitan/hw/dv/tools/dvsim/sim.mk:58: sw_build] Error 1
rom_e2e_smoke 3142658166205635325861107474617245526547533435459181625491771656707367756883 None
Another command (pid=1380784) is running. Waiting for it to complete on the server (server_pid=191100)...
Another command (pid=1381253) is running. Waiting for it to complete on the server (server_pid=191100)...
Another command (pid=1382622) is running. Waiting for it to complete on the server (server_pid=191100)...
WARNING: Target pattern parsing failed.
ERROR: Skipping '//sw/device/silicon_creator/rom/e2e:empty_test_slot_a_sim_dv': no such target '//sw/device/silicon_creator/rom/e2e:empty_test_slot_a_sim_dv': target 'empty_test_slot_a_sim_dv' not declared in package 'sw/device/silicon_creator/rom/e2e' defined by /nightly/current_run/opentitan/sw/device/silicon_creator/rom/e2e/BUILD
ERROR: no such target '//sw/device/silicon_creator/rom/e2e:empty_test_slot_a_sim_dv': target 'empty_test_slot_a_sim_dv' not declared in package 'sw/device/silicon_creator/rom/e2e' defined by /nightly/current_run/opentitan/sw/device/silicon_creator/rom/e2e/BUILD
ERROR: Build did NOT complete successfully
_run_cmd -> had a non-zero return code of 1.
make: *** [/nightly/current_run/opentitan/hw/dv/tools/dvsim/sim.mk:58: sw_build] Error 1
rom_e2e_shutdown_exception_c 52215967257593064410768254513809900786595472209452018021310856723424572906065 None
Another command (pid=552996) is running. Waiting for it to complete on the server (server_pid=191100)...
Another command (pid=558929) is running. Waiting for it to complete on the server (server_pid=191100)...
Another command (pid=581654) is running. Waiting for it to complete on the server (server_pid=191100)...
WARNING: Target pattern parsing failed.
ERROR: Skipping '//sw/device/silicon_creator/rom:rom_with_fake_keys_sim_dv': no such target '//sw/device/silicon_creator/rom:rom_with_fake_keys_sim_dv': target 'rom_with_fake_keys_sim_dv' not declared in package 'sw/device/silicon_creator/rom' defined by /nightly/current_run/opentitan/sw/device/silicon_creator/rom/BUILD
ERROR: no such target '//sw/device/silicon_creator/rom:rom_with_fake_keys_sim_dv': target 'rom_with_fake_keys_sim_dv' not declared in package 'sw/device/silicon_creator/rom' defined by /nightly/current_run/opentitan/sw/device/silicon_creator/rom/BUILD
ERROR: Build did NOT complete successfully
_run_cmd -> had a non-zero return code of 1.
make: *** [/nightly/current_run/opentitan/hw/dv/tools/dvsim/sim.mk:58: sw_build] Error 1
rom_e2e_shutdown_output 58627276517699550024174131987617090504371162431636667174663210791701099369539 None
Another command (pid=554066) is running. Waiting for it to complete on the server (server_pid=191100)...
Another command (pid=514632) is running. Waiting for it to complete on the server (server_pid=191100)...
Another command (pid=542691) is running. Waiting for it to complete on the server (server_pid=191100)...
WARNING: Target pattern parsing failed.
ERROR: Skipping '//sw/device/silicon_creator/rom/e2e:empty_test_slot_a_sim_dv': no such target '//sw/device/silicon_creator/rom/e2e:empty_test_slot_a_sim_dv': target 'empty_test_slot_a_sim_dv' not declared in package 'sw/device/silicon_creator/rom/e2e' defined by /nightly/current_run/opentitan/sw/device/silicon_creator/rom/e2e/BUILD
ERROR: no such target '//sw/device/silicon_creator/rom/e2e:empty_test_slot_a_sim_dv': target 'empty_test_slot_a_sim_dv' not declared in package 'sw/device/silicon_creator/rom/e2e' defined by /nightly/current_run/opentitan/sw/device/silicon_creator/rom/e2e/BUILD
ERROR: Build did NOT complete successfully
_run_cmd -> had a non-zero return code of 1.
make: *** [/nightly/current_run/opentitan/hw/dv/tools/dvsim/sim.mk:58: sw_build] Error 1
rom_e2e_boot_policy_valid_a_good_b_good_test_unlocked0 65403483521204920172726954222115809687319300850985437480122211415216557438332 None
Another command (pid=352717) is running. Waiting for it to complete on the server (server_pid=191100)...
Another command (pid=332040) is running. Waiting for it to complete on the server (server_pid=191100)...
Another command (pid=357416) is running. Waiting for it to complete on the server (server_pid=191100)...
WARNING: Target pattern parsing failed.
ERROR: Skipping '//sw/device/silicon_creator/rom/e2e:empty_test_slot_a_sim_dv': no such target '//sw/device/silicon_creator/rom/e2e:empty_test_slot_a_sim_dv': target 'empty_test_slot_a_sim_dv' not declared in package 'sw/device/silicon_creator/rom/e2e' defined by /nightly/current_run/opentitan/sw/device/silicon_creator/rom/e2e/BUILD
ERROR: no such target '//sw/device/silicon_creator/rom/e2e:empty_test_slot_a_sim_dv': target 'empty_test_slot_a_sim_dv' not declared in package 'sw/device/silicon_creator/rom/e2e' defined by /nightly/current_run/opentitan/sw/device/silicon_creator/rom/e2e/BUILD
ERROR: Build did NOT complete successfully
_run_cmd -> had a non-zero return code of 1.
make: *** [/nightly/current_run/opentitan/hw/dv/tools/dvsim/sim.mk:58: sw_build] Error 1
rom_e2e_boot_policy_valid_a_good_b_good_dev 2544668405890169105283996203254503110146022196164604318175864027303735639585 None
Another command (pid=481450) is running. Waiting for it to complete on the server (server_pid=191100)...
Another command (pid=447589) is running. Waiting for it to complete on the server (server_pid=191100)...
Another command (pid=487539) is running. Waiting for it to complete on the server (server_pid=191100)...
WARNING: Target pattern parsing failed.
ERROR: Skipping '//sw/device/silicon_creator/rom/e2e:empty_test_slot_a_sim_dv': no such target '//sw/device/silicon_creator/rom/e2e:empty_test_slot_a_sim_dv': target 'empty_test_slot_a_sim_dv' not declared in package 'sw/device/silicon_creator/rom/e2e' defined by /nightly/current_run/opentitan/sw/device/silicon_creator/rom/e2e/BUILD
ERROR: no such target '//sw/device/silicon_creator/rom/e2e:empty_test_slot_a_sim_dv': target 'empty_test_slot_a_sim_dv' not declared in package 'sw/device/silicon_creator/rom/e2e' defined by /nightly/current_run/opentitan/sw/device/silicon_creator/rom/e2e/BUILD
ERROR: Build did NOT complete successfully
_run_cmd -> had a non-zero return code of 1.
make: *** [/nightly/current_run/opentitan/hw/dv/tools/dvsim/sim.mk:58: sw_build] Error 1
rom_e2e_boot_policy_valid_a_good_b_good_prod 154178559389519427535977853860025718622491235632976172899958904477092226383 None
Another command (pid=487539) is running. Waiting for it to complete on the server (server_pid=191100)...
Another command (pid=491214) is running. Waiting for it to complete on the server (server_pid=191100)...
Another command (pid=500324) is running. Waiting for it to complete on the server (server_pid=191100)...
WARNING: Target pattern parsing failed.
ERROR: Skipping '//sw/device/silicon_creator/rom/e2e:empty_test_slot_a_sim_dv': no such target '//sw/device/silicon_creator/rom/e2e:empty_test_slot_a_sim_dv': target 'empty_test_slot_a_sim_dv' not declared in package 'sw/device/silicon_creator/rom/e2e' defined by /nightly/current_run/opentitan/sw/device/silicon_creator/rom/e2e/BUILD
ERROR: no such target '//sw/device/silicon_creator/rom/e2e:empty_test_slot_a_sim_dv': target 'empty_test_slot_a_sim_dv' not declared in package 'sw/device/silicon_creator/rom/e2e' defined by /nightly/current_run/opentitan/sw/device/silicon_creator/rom/e2e/BUILD
ERROR: Build did NOT complete successfully
_run_cmd -> had a non-zero return code of 1.
make: *** [/nightly/current_run/opentitan/hw/dv/tools/dvsim/sim.mk:58: sw_build] Error 1
rom_e2e_boot_policy_valid_a_good_b_good_prod_end 61518621939111735268370158467167442498092650244308063069296489282912967761203 None
Another command (pid=510751) is running. Waiting for it to complete on the server (server_pid=191100)...
Another command (pid=507720) is running. Waiting for it to complete on the server (server_pid=191100)...
Another command (pid=506230) is running. Waiting for it to complete on the server (server_pid=191100)...
WARNING: Target pattern parsing failed.
ERROR: Skipping '//sw/device/silicon_creator/rom/e2e:empty_test_slot_a_sim_dv': no such target '//sw/device/silicon_creator/rom/e2e:empty_test_slot_a_sim_dv': target 'empty_test_slot_a_sim_dv' not declared in package 'sw/device/silicon_creator/rom/e2e' defined by /nightly/current_run/opentitan/sw/device/silicon_creator/rom/e2e/BUILD
ERROR: no such target '//sw/device/silicon_creator/rom/e2e:empty_test_slot_a_sim_dv': target 'empty_test_slot_a_sim_dv' not declared in package 'sw/device/silicon_creator/rom/e2e' defined by /nightly/current_run/opentitan/sw/device/silicon_creator/rom/e2e/BUILD
ERROR: Build did NOT complete successfully
_run_cmd -> had a non-zero return code of 1.
make: *** [/nightly/current_run/opentitan/hw/dv/tools/dvsim/sim.mk:58: sw_build] Error 1
rom_e2e_boot_policy_valid_a_good_b_good_rma 34824360346882443299352384639038958457694662191593551354108791835898131155414 None
Another command (pid=539289) is running. Waiting for it to complete on the server (server_pid=191100)...
Another command (pid=521527) is running. Waiting for it to complete on the server (server_pid=191100)...
Another command (pid=525758) is running. Waiting for it to complete on the server (server_pid=191100)...
WARNING: Target pattern parsing failed.
ERROR: Skipping '//sw/device/silicon_creator/rom/e2e:empty_test_slot_a_sim_dv': no such target '//sw/device/silicon_creator/rom/e2e:empty_test_slot_a_sim_dv': target 'empty_test_slot_a_sim_dv' not declared in package 'sw/device/silicon_creator/rom/e2e' defined by /nightly/current_run/opentitan/sw/device/silicon_creator/rom/e2e/BUILD
ERROR: no such target '//sw/device/silicon_creator/rom/e2e:empty_test_slot_a_sim_dv': target 'empty_test_slot_a_sim_dv' not declared in package 'sw/device/silicon_creator/rom/e2e' defined by /nightly/current_run/opentitan/sw/device/silicon_creator/rom/e2e/BUILD
ERROR: Build did NOT complete successfully
_run_cmd -> had a non-zero return code of 1.
make: *** [/nightly/current_run/opentitan/hw/dv/tools/dvsim/sim.mk:58: sw_build] Error 1
rom_e2e_boot_policy_valid_a_good_b_bad_test_unlocked0 32898048877306321454159892907377734373585814452878496195917858408336552267772 None
---- STDERR ----
Another command (pid=286192) is running. Waiting for it to complete on the server (server_pid=191100)...
WARNING: Target pattern parsing failed.
ERROR: Skipping '//sw/device/silicon_creator/rom/e2e:empty_test_slot_a_sim_dv': no such target '//sw/device/silicon_creator/rom/e2e:empty_test_slot_a_sim_dv': target 'empty_test_slot_a_sim_dv' not declared in package 'sw/device/silicon_creator/rom/e2e' defined by /nightly/current_run/opentitan/sw/device/silicon_creator/rom/e2e/BUILD
ERROR: no such target '//sw/device/silicon_creator/rom/e2e:empty_test_slot_a_sim_dv': target 'empty_test_slot_a_sim_dv' not declared in package 'sw/device/silicon_creator/rom/e2e' defined by /nightly/current_run/opentitan/sw/device/silicon_creator/rom/e2e/BUILD
ERROR: Build did NOT complete successfully
_run_cmd -> had a non-zero return code of 1.
make: *** [/nightly/current_run/opentitan/hw/dv/tools/dvsim/sim.mk:58: sw_build] Error 1
rom_e2e_boot_policy_valid_a_good_b_bad_dev 112427173177820261079610913720303668972664829546970601039460672312047495715183 None
---- STDERR ----
Another command (pid=474232) is running. Waiting for it to complete on the server (server_pid=191100)...
WARNING: Target pattern parsing failed.
ERROR: Skipping '//sw/device/silicon_creator/rom/e2e:empty_test_slot_a_sim_dv': no such target '//sw/device/silicon_creator/rom/e2e:empty_test_slot_a_sim_dv': target 'empty_test_slot_a_sim_dv' not declared in package 'sw/device/silicon_creator/rom/e2e' defined by /nightly/current_run/opentitan/sw/device/silicon_creator/rom/e2e/BUILD
ERROR: no such target '//sw/device/silicon_creator/rom/e2e:empty_test_slot_a_sim_dv': target 'empty_test_slot_a_sim_dv' not declared in package 'sw/device/silicon_creator/rom/e2e' defined by /nightly/current_run/opentitan/sw/device/silicon_creator/rom/e2e/BUILD
ERROR: Build did NOT complete successfully
_run_cmd -> had a non-zero return code of 1.
make: *** [/nightly/current_run/opentitan/hw/dv/tools/dvsim/sim.mk:58: sw_build] Error 1
rom_e2e_boot_policy_valid_a_good_b_bad_prod 104904196500446285390645873346391250055010369901167509572124270359205514105325 None
Another command (pid=474446) is running. Waiting for it to complete on the server (server_pid=191100)...
Another command (pid=485938) is running. Waiting for it to complete on the server (server_pid=191100)...
Another command (pid=465183) is running. Waiting for it to complete on the server (server_pid=191100)...
WARNING: Target pattern parsing failed.
ERROR: Skipping '//sw/device/silicon_creator/rom/e2e:empty_test_slot_a_sim_dv': no such target '//sw/device/silicon_creator/rom/e2e:empty_test_slot_a_sim_dv': target 'empty_test_slot_a_sim_dv' not declared in package 'sw/device/silicon_creator/rom/e2e' defined by /nightly/current_run/opentitan/sw/device/silicon_creator/rom/e2e/BUILD
ERROR: no such target '//sw/device/silicon_creator/rom/e2e:empty_test_slot_a_sim_dv': target 'empty_test_slot_a_sim_dv' not declared in package 'sw/device/silicon_creator/rom/e2e' defined by /nightly/current_run/opentitan/sw/device/silicon_creator/rom/e2e/BUILD
ERROR: Build did NOT complete successfully
_run_cmd -> had a non-zero return code of 1.
make: *** [/nightly/current_run/opentitan/hw/dv/tools/dvsim/sim.mk:58: sw_build] Error 1
rom_e2e_boot_policy_valid_a_good_b_bad_prod_end 27381472276088625133840352643220144391864711799487611882590666972705029544082 None
---- STDERR ----
Another command (pid=474232) is running. Waiting for it to complete on the server (server_pid=191100)...
WARNING: Target pattern parsing failed.
ERROR: Skipping '//sw/device/silicon_creator/rom/e2e:empty_test_slot_a_sim_dv': no such target '//sw/device/silicon_creator/rom/e2e:empty_test_slot_a_sim_dv': target 'empty_test_slot_a_sim_dv' not declared in package 'sw/device/silicon_creator/rom/e2e' defined by /nightly/current_run/opentitan/sw/device/silicon_creator/rom/e2e/BUILD
ERROR: no such target '//sw/device/silicon_creator/rom/e2e:empty_test_slot_a_sim_dv': target 'empty_test_slot_a_sim_dv' not declared in package 'sw/device/silicon_creator/rom/e2e' defined by /nightly/current_run/opentitan/sw/device/silicon_creator/rom/e2e/BUILD
ERROR: Build did NOT complete successfully
_run_cmd -> had a non-zero return code of 1.
make: *** [/nightly/current_run/opentitan/hw/dv/tools/dvsim/sim.mk:58: sw_build] Error 1
rom_e2e_boot_policy_valid_a_good_b_bad_rma 86039729631676074637736657303519399061808956631322671484945660831395789908001 None
Another command (pid=485835) is running. Waiting for it to complete on the server (server_pid=191100)...
Another command (pid=484348) is running. Waiting for it to complete on the server (server_pid=191100)...
Another command (pid=464776) is running. Waiting for it to complete on the server (server_pid=191100)...
WARNING: Target pattern parsing failed.
ERROR: Skipping '//sw/device/silicon_creator/rom/e2e:empty_test_slot_a_sim_dv': no such target '//sw/device/silicon_creator/rom/e2e:empty_test_slot_a_sim_dv': target 'empty_test_slot_a_sim_dv' not declared in package 'sw/device/silicon_creator/rom/e2e' defined by /nightly/current_run/opentitan/sw/device/silicon_creator/rom/e2e/BUILD
ERROR: no such target '//sw/device/silicon_creator/rom/e2e:empty_test_slot_a_sim_dv': target 'empty_test_slot_a_sim_dv' not declared in package 'sw/device/silicon_creator/rom/e2e' defined by /nightly/current_run/opentitan/sw/device/silicon_creator/rom/e2e/BUILD
ERROR: Build did NOT complete successfully
_run_cmd -> had a non-zero return code of 1.
make: *** [/nightly/current_run/opentitan/hw/dv/tools/dvsim/sim.mk:58: sw_build] Error 1
rom_e2e_boot_policy_valid_a_bad_b_good_test_unlocked0 43096614087063682678052274002498346597603680793233063433157545082347304438312 None
---- STDERR ----
Another command (pid=352717) is running. Waiting for it to complete on the server (server_pid=191100)...
Another command (pid=332040) is running. Waiting for it to complete on the server (server_pid=191100)...
WARNING: Target pattern parsing failed.
ERROR: Skipping '//sw/device/silicon_creator/rom/e2e:empty_test_slot_b_sim_dv': no such target '//sw/device/silicon_creator/rom/e2e:empty_test_slot_b_sim_dv': target 'empty_test_slot_b_sim_dv' not declared in package 'sw/device/silicon_creator/rom/e2e' defined by /nightly/current_run/opentitan/sw/device/silicon_creator/rom/e2e/BUILD
ERROR: no such target '//sw/device/silicon_creator/rom/e2e:empty_test_slot_b_sim_dv': target 'empty_test_slot_b_sim_dv' not declared in package 'sw/device/silicon_creator/rom/e2e' defined by /nightly/current_run/opentitan/sw/device/silicon_creator/rom/e2e/BUILD
ERROR: Build did NOT complete successfully
_run_cmd -> had a non-zero return code of 1.
make: *** [/nightly/current_run/opentitan/hw/dv/tools/dvsim/sim.mk:58: sw_build] Error 1
rom_e2e_boot_policy_valid_a_bad_b_good_dev 22349886895482832103901052264953367372311901096656122889484071271015807331689 None
Another command (pid=486111) is running. Waiting for it to complete on the server (server_pid=191100)...
Another command (pid=467677) is running. Waiting for it to complete on the server (server_pid=191100)...
Another command (pid=379345) is running. Waiting for it to complete on the server (server_pid=191100)...
WARNING: Target pattern parsing failed.
ERROR: Skipping '//sw/device/silicon_creator/rom/e2e:empty_test_slot_b_sim_dv': no such target '//sw/device/silicon_creator/rom/e2e:empty_test_slot_b_sim_dv': target 'empty_test_slot_b_sim_dv' not declared in package 'sw/device/silicon_creator/rom/e2e' defined by /nightly/current_run/opentitan/sw/device/silicon_creator/rom/e2e/BUILD
ERROR: no such target '//sw/device/silicon_creator/rom/e2e:empty_test_slot_b_sim_dv': target 'empty_test_slot_b_sim_dv' not declared in package 'sw/device/silicon_creator/rom/e2e' defined by /nightly/current_run/opentitan/sw/device/silicon_creator/rom/e2e/BUILD
ERROR: Build did NOT complete successfully
_run_cmd -> had a non-zero return code of 1.
make: *** [/nightly/current_run/opentitan/hw/dv/tools/dvsim/sim.mk:58: sw_build] Error 1
rom_e2e_boot_policy_valid_a_bad_b_good_prod 96498441170541515281388977506640595000445085239458079362130484881443441791827 None
Another command (pid=493146) is running. Waiting for it to complete on the server (server_pid=191100)...
Another command (pid=491214) is running. Waiting for it to complete on the server (server_pid=191100)...
Another command (pid=500324) is running. Waiting for it to complete on the server (server_pid=191100)...
WARNING: Target pattern parsing failed.
ERROR: Skipping '//sw/device/silicon_creator/rom/e2e:empty_test_slot_b_sim_dv': no such target '//sw/device/silicon_creator/rom/e2e:empty_test_slot_b_sim_dv': target 'empty_test_slot_b_sim_dv' not declared in package 'sw/device/silicon_creator/rom/e2e' defined by /nightly/current_run/opentitan/sw/device/silicon_creator/rom/e2e/BUILD
ERROR: no such target '//sw/device/silicon_creator/rom/e2e:empty_test_slot_b_sim_dv': target 'empty_test_slot_b_sim_dv' not declared in package 'sw/device/silicon_creator/rom/e2e' defined by /nightly/current_run/opentitan/sw/device/silicon_creator/rom/e2e/BUILD
ERROR: Build did NOT complete successfully
_run_cmd -> had a non-zero return code of 1.
make: *** [/nightly/current_run/opentitan/hw/dv/tools/dvsim/sim.mk:58: sw_build] Error 1
rom_e2e_boot_policy_valid_a_bad_b_good_prod_end 75278564995108578763538311665556186523277860588867728404327551263336826292122 None
Another command (pid=377303) is running. Waiting for it to complete on the server (server_pid=191100)...
Another command (pid=510751) is running. Waiting for it to complete on the server (server_pid=191100)...
Another command (pid=506230) is running. Waiting for it to complete on the server (server_pid=191100)...
WARNING: Target pattern parsing failed.
ERROR: Skipping '//sw/device/silicon_creator/rom/e2e:empty_test_slot_b_sim_dv': no such target '//sw/device/silicon_creator/rom/e2e:empty_test_slot_b_sim_dv': target 'empty_test_slot_b_sim_dv' not declared in package 'sw/device/silicon_creator/rom/e2e' defined by /nightly/current_run/opentitan/sw/device/silicon_creator/rom/e2e/BUILD
ERROR: no such target '//sw/device/silicon_creator/rom/e2e:empty_test_slot_b_sim_dv': target 'empty_test_slot_b_sim_dv' not declared in package 'sw/device/silicon_creator/rom/e2e' defined by /nightly/current_run/opentitan/sw/device/silicon_creator/rom/e2e/BUILD
ERROR: Build did NOT complete successfully
_run_cmd -> had a non-zero return code of 1.
make: *** [/nightly/current_run/opentitan/hw/dv/tools/dvsim/sim.mk:58: sw_build] Error 1
rom_e2e_boot_policy_valid_a_bad_b_good_rma 60886831549217727625572034998570888586234417764555838701846828708175471080620 None
Another command (pid=378364) is running. Waiting for it to complete on the server (server_pid=191100)...
Another command (pid=498391) is running. Waiting for it to complete on the server (server_pid=191100)...
Another command (pid=480571) is running. Waiting for it to complete on the server (server_pid=191100)...
WARNING: Target pattern parsing failed.
ERROR: Skipping '//sw/device/silicon_creator/rom/e2e:empty_test_slot_b_sim_dv': no such target '//sw/device/silicon_creator/rom/e2e:empty_test_slot_b_sim_dv': target 'empty_test_slot_b_sim_dv' not declared in package 'sw/device/silicon_creator/rom/e2e' defined by /nightly/current_run/opentitan/sw/device/silicon_creator/rom/e2e/BUILD
ERROR: no such target '//sw/device/silicon_creator/rom/e2e:empty_test_slot_b_sim_dv': target 'empty_test_slot_b_sim_dv' not declared in package 'sw/device/silicon_creator/rom/e2e' defined by /nightly/current_run/opentitan/sw/device/silicon_creator/rom/e2e/BUILD
ERROR: Build did NOT complete successfully
_run_cmd -> had a non-zero return code of 1.
make: *** [/nightly/current_run/opentitan/hw/dv/tools/dvsim/sim.mk:58: sw_build] Error 1
rom_e2e_sigverify_always_a_bad_b_bad_test_unlocked0 39157330271676818847914827262123103895772766333857612472479412672553659401571 None
---- STDERR ----
Another command (pid=361511) is running. Waiting for it to complete on the server (server_pid=191100)...
WARNING: Target pattern parsing failed.
ERROR: Skipping '//sw/device/silicon_creator/rom/e2e:otp_img_sigverify_always_test_unlocked0': no such target '//sw/device/silicon_creator/rom/e2e:otp_img_sigverify_always_test_unlocked0': target 'otp_img_sigverify_always_test_unlocked0' not declared in package 'sw/device/silicon_creator/rom/e2e' defined by /nightly/current_run/opentitan/sw/device/silicon_creator/rom/e2e/BUILD
ERROR: no such target '//sw/device/silicon_creator/rom/e2e:otp_img_sigverify_always_test_unlocked0': target 'otp_img_sigverify_always_test_unlocked0' not declared in package 'sw/device/silicon_creator/rom/e2e' defined by /nightly/current_run/opentitan/sw/device/silicon_creator/rom/e2e/BUILD
ERROR: Build did NOT complete successfully
_run_cmd -> had a non-zero return code of 1.
make: *** [/nightly/current_run/opentitan/hw/dv/tools/dvsim/sim.mk:58: sw_build] Error 1
rom_e2e_sigverify_always_a_bad_b_bad_dev 72168934846708570649416422494051269743238613251811037088751782419523794703890 None
Another command (pid=589134) is running. Waiting for it to complete on the server (server_pid=191100)...
Another command (pid=574418) is running. Waiting for it to complete on the server (server_pid=191100)...
Another command (pid=599451) is running. Waiting for it to complete on the server (server_pid=191100)...
WARNING: Target pattern parsing failed.
ERROR: Skipping '//sw/device/silicon_creator/rom/e2e:otp_img_sigverify_always_dev': no such target '//sw/device/silicon_creator/rom/e2e:otp_img_sigverify_always_dev': target 'otp_img_sigverify_always_dev' not declared in package 'sw/device/silicon_creator/rom/e2e' defined by /nightly/current_run/opentitan/sw/device/silicon_creator/rom/e2e/BUILD
ERROR: no such target '//sw/device/silicon_creator/rom/e2e:otp_img_sigverify_always_dev': target 'otp_img_sigverify_always_dev' not declared in package 'sw/device/silicon_creator/rom/e2e' defined by /nightly/current_run/opentitan/sw/device/silicon_creator/rom/e2e/BUILD
ERROR: Build did NOT complete successfully
_run_cmd -> had a non-zero return code of 1.
make: *** [/nightly/current_run/opentitan/hw/dv/tools/dvsim/sim.mk:58: sw_build] Error 1
rom_e2e_sigverify_always_a_bad_b_bad_prod 101977362769877569672304995749083529113901342736086307458115764771479338018792 None
Another command (pid=580326) is running. Waiting for it to complete on the server (server_pid=191100)...
Another command (pid=558929) is running. Waiting for it to complete on the server (server_pid=191100)...
Another command (pid=563936) is running. Waiting for it to complete on the server (server_pid=191100)...
WARNING: Target pattern parsing failed.
ERROR: Skipping '//sw/device/silicon_creator/rom/e2e:otp_img_sigverify_always_prod': no such target '//sw/device/silicon_creator/rom/e2e:otp_img_sigverify_always_prod': target 'otp_img_sigverify_always_prod' not declared in package 'sw/device/silicon_creator/rom/e2e' defined by /nightly/current_run/opentitan/sw/device/silicon_creator/rom/e2e/BUILD
ERROR: no such target '//sw/device/silicon_creator/rom/e2e:otp_img_sigverify_always_prod': target 'otp_img_sigverify_always_prod' not declared in package 'sw/device/silicon_creator/rom/e2e' defined by /nightly/current_run/opentitan/sw/device/silicon_creator/rom/e2e/BUILD
ERROR: Build did NOT complete successfully
_run_cmd -> had a non-zero return code of 1.
make: *** [/nightly/current_run/opentitan/hw/dv/tools/dvsim/sim.mk:58: sw_build] Error 1
rom_e2e_sigverify_always_a_bad_b_bad_prod_end 43460023159004052965163094530562736367803611498710553902567791252524084497385 None
Another command (pid=587116) is running. Waiting for it to complete on the server (server_pid=191100)...
Another command (pid=593357) is running. Waiting for it to complete on the server (server_pid=191100)...
Another command (pid=594964) is running. Waiting for it to complete on the server (server_pid=191100)...
WARNING: Target pattern parsing failed.
ERROR: Skipping '//sw/device/silicon_creator/rom/e2e:otp_img_sigverify_always_prod_end': no such target '//sw/device/silicon_creator/rom/e2e:otp_img_sigverify_always_prod_end': target 'otp_img_sigverify_always_prod_end' not declared in package 'sw/device/silicon_creator/rom/e2e' defined by /nightly/current_run/opentitan/sw/device/silicon_creator/rom/e2e/BUILD
ERROR: no such target '//sw/device/silicon_creator/rom/e2e:otp_img_sigverify_always_prod_end': target 'otp_img_sigverify_always_prod_end' not declared in package 'sw/device/silicon_creator/rom/e2e' defined by /nightly/current_run/opentitan/sw/device/silicon_creator/rom/e2e/BUILD
ERROR: Build did NOT complete successfully
_run_cmd -> had a non-zero return code of 1.
make: *** [/nightly/current_run/opentitan/hw/dv/tools/dvsim/sim.mk:58: sw_build] Error 1
rom_e2e_sigverify_always_a_bad_b_bad_rma 99725988300881519201392784168721116273373801057123608610767047452427587155076 None
Another command (pid=602625) is running. Waiting for it to complete on the server (server_pid=191100)...
Another command (pid=613940) is running. Waiting for it to complete on the server (server_pid=191100)...
Another command (pid=577456) is running. Waiting for it to complete on the server (server_pid=191100)...
WARNING: Target pattern parsing failed.
ERROR: Skipping '//sw/device/silicon_creator/rom/e2e:otp_img_sigverify_always_rma': no such target '//sw/device/silicon_creator/rom/e2e:otp_img_sigverify_always_rma': target 'otp_img_sigverify_always_rma' not declared in package 'sw/device/silicon_creator/rom/e2e' defined by /nightly/current_run/opentitan/sw/device/silicon_creator/rom/e2e/BUILD
ERROR: no such target '//sw/device/silicon_creator/rom/e2e:otp_img_sigverify_always_rma': target 'otp_img_sigverify_always_rma' not declared in package 'sw/device/silicon_creator/rom/e2e' defined by /nightly/current_run/opentitan/sw/device/silicon_creator/rom/e2e/BUILD
ERROR: Build did NOT complete successfully
_run_cmd -> had a non-zero return code of 1.
make: *** [/nightly/current_run/opentitan/hw/dv/tools/dvsim/sim.mk:58: sw_build] Error 1
rom_e2e_sigverify_always_a_bad_b_nothing_test_unlocked0 40281049259878538365900193092217968823984194322877950416339735235981954537175 None
---- STDERR ----
Another command (pid=337038) is running. Waiting for it to complete on the server (server_pid=191100)...
WARNING: Target pattern parsing failed.
ERROR: Skipping '//sw/device/silicon_creator/rom/e2e:otp_img_sigverify_always_test_unlocked0': no such target '//sw/device/silicon_creator/rom/e2e:otp_img_sigverify_always_test_unlocked0': target 'otp_img_sigverify_always_test_unlocked0' not declared in package 'sw/device/silicon_creator/rom/e2e' defined by /nightly/current_run/opentitan/sw/device/silicon_creator/rom/e2e/BUILD
ERROR: no such target '//sw/device/silicon_creator/rom/e2e:otp_img_sigverify_always_test_unlocked0': target 'otp_img_sigverify_always_test_unlocked0' not declared in package 'sw/device/silicon_creator/rom/e2e' defined by /nightly/current_run/opentitan/sw/device/silicon_creator/rom/e2e/BUILD
ERROR: Build did NOT complete successfully
_run_cmd -> had a non-zero return code of 1.
make: *** [/nightly/current_run/opentitan/hw/dv/tools/dvsim/sim.mk:58: sw_build] Error 1
rom_e2e_sigverify_always_a_bad_b_nothing_dev 75620399052464517524065406793814721732871199144591927196132206953702405682236 None
Another command (pid=584580) is running. Waiting for it to complete on the server (server_pid=191100)...
Another command (pid=611402) is running. Waiting for it to complete on the server (server_pid=191100)...
Another command (pid=602625) is running. Waiting for it to complete on the server (server_pid=191100)...
WARNING: Target pattern parsing failed.
ERROR: Skipping '//sw/device/silicon_creator/rom/e2e:otp_img_sigverify_always_dev': no such target '//sw/device/silicon_creator/rom/e2e:otp_img_sigverify_always_dev': target 'otp_img_sigverify_always_dev' not declared in package 'sw/device/silicon_creator/rom/e2e' defined by /nightly/current_run/opentitan/sw/device/silicon_creator/rom/e2e/BUILD
ERROR: no such target '//sw/device/silicon_creator/rom/e2e:otp_img_sigverify_always_dev': target 'otp_img_sigverify_always_dev' not declared in package 'sw/device/silicon_creator/rom/e2e' defined by /nightly/current_run/opentitan/sw/device/silicon_creator/rom/e2e/BUILD
ERROR: Build did NOT complete successfully
_run_cmd -> had a non-zero return code of 1.
make: *** [/nightly/current_run/opentitan/hw/dv/tools/dvsim/sim.mk:58: sw_build] Error 1
rom_e2e_sigverify_always_a_bad_b_nothing_prod 73701610351229807268297667583279229617682478955085145861650827929741209628557 None
---- STDERR ----
Another command (pid=581654) is running. Waiting for it to complete on the server (server_pid=191100)...
WARNING: Target pattern parsing failed.
ERROR: Skipping '//sw/device/silicon_creator/rom/e2e:otp_img_sigverify_always_prod': no such target '//sw/device/silicon_creator/rom/e2e:otp_img_sigverify_always_prod': target 'otp_img_sigverify_always_prod' not declared in package 'sw/device/silicon_creator/rom/e2e' defined by /nightly/current_run/opentitan/sw/device/silicon_creator/rom/e2e/BUILD
ERROR: no such target '//sw/device/silicon_creator/rom/e2e:otp_img_sigverify_always_prod': target 'otp_img_sigverify_always_prod' not declared in package 'sw/device/silicon_creator/rom/e2e' defined by /nightly/current_run/opentitan/sw/device/silicon_creator/rom/e2e/BUILD
ERROR: Build did NOT complete successfully
_run_cmd -> had a non-zero return code of 1.
make: *** [/nightly/current_run/opentitan/hw/dv/tools/dvsim/sim.mk:58: sw_build] Error 1
rom_e2e_sigverify_always_a_bad_b_nothing_prod_end 50601728957021056036547853783067078930463687487423448056706270445945302636245 None
Another command (pid=587116) is running. Waiting for it to complete on the server (server_pid=191100)...
Another command (pid=593357) is running. Waiting for it to complete on the server (server_pid=191100)...
Another command (pid=593571) is running. Waiting for it to complete on the server (server_pid=191100)...
WARNING: Target pattern parsing failed.
ERROR: Skipping '//sw/device/silicon_creator/rom/e2e:otp_img_sigverify_always_prod_end': no such target '//sw/device/silicon_creator/rom/e2e:otp_img_sigverify_always_prod_end': target 'otp_img_sigverify_always_prod_end' not declared in package 'sw/device/silicon_creator/rom/e2e' defined by /nightly/current_run/opentitan/sw/device/silicon_creator/rom/e2e/BUILD
ERROR: no such target '//sw/device/silicon_creator/rom/e2e:otp_img_sigverify_always_prod_end': target 'otp_img_sigverify_always_prod_end' not declared in package 'sw/device/silicon_creator/rom/e2e' defined by /nightly/current_run/opentitan/sw/device/silicon_creator/rom/e2e/BUILD
ERROR: Build did NOT complete successfully
_run_cmd -> had a non-zero return code of 1.
make: *** [/nightly/current_run/opentitan/hw/dv/tools/dvsim/sim.mk:58: sw_build] Error 1
rom_e2e_sigverify_always_a_bad_b_nothing_rma 14040051551761448553314807745843630389050791395920117110309995738949945366313 None
Another command (pid=621932) is running. Waiting for it to complete on the server (server_pid=191100)...
Another command (pid=622951) is running. Waiting for it to complete on the server (server_pid=191100)...
Another command (pid=624229) is running. Waiting for it to complete on the server (server_pid=191100)...
WARNING: Target pattern parsing failed.
ERROR: Skipping '//sw/device/silicon_creator/rom/e2e:otp_img_sigverify_always_rma': no such target '//sw/device/silicon_creator/rom/e2e:otp_img_sigverify_always_rma': target 'otp_img_sigverify_always_rma' not declared in package 'sw/device/silicon_creator/rom/e2e' defined by /nightly/current_run/opentitan/sw/device/silicon_creator/rom/e2e/BUILD
ERROR: no such target '//sw/device/silicon_creator/rom/e2e:otp_img_sigverify_always_rma': target 'otp_img_sigverify_always_rma' not declared in package 'sw/device/silicon_creator/rom/e2e' defined by /nightly/current_run/opentitan/sw/device/silicon_creator/rom/e2e/BUILD
ERROR: Build did NOT complete successfully
_run_cmd -> had a non-zero return code of 1.
make: *** [/nightly/current_run/opentitan/hw/dv/tools/dvsim/sim.mk:58: sw_build] Error 1
rom_e2e_sigverify_always_a_nothing_b_bad_test_unlocked0 31949831558981183375332744983543252853088204574270210971370798248613124756275 None
---- STDERR ----
Another command (pid=340066) is running. Waiting for it to complete on the server (server_pid=191100)...
Another command (pid=353608) is running. Waiting for it to complete on the server (server_pid=191100)...
WARNING: Target pattern parsing failed.
ERROR: Skipping '//sw/device/silicon_creator/rom/e2e:otp_img_sigverify_always_test_unlocked0': no such target '//sw/device/silicon_creator/rom/e2e:otp_img_sigverify_always_test_unlocked0': target 'otp_img_sigverify_always_test_unlocked0' not declared in package 'sw/device/silicon_creator/rom/e2e' defined by /nightly/current_run/opentitan/sw/device/silicon_creator/rom/e2e/BUILD
ERROR: no such target '//sw/device/silicon_creator/rom/e2e:otp_img_sigverify_always_test_unlocked0': target 'otp_img_sigverify_always_test_unlocked0' not declared in package 'sw/device/silicon_creator/rom/e2e' defined by /nightly/current_run/opentitan/sw/device/silicon_creator/rom/e2e/BUILD
ERROR: Build did NOT complete successfully
_run_cmd -> had a non-zero return code of 1.
make: *** [/nightly/current_run/opentitan/hw/dv/tools/dvsim/sim.mk:58: sw_build] Error 1
rom_e2e_sigverify_always_a_nothing_b_bad_dev 9737933782021274545878319807969400112226732186984546995436829047190863656187 None
---- STDERR ----
Another command (pid=602625) is running. Waiting for it to complete on the server (server_pid=191100)...
WARNING: Target pattern parsing failed.
ERROR: Skipping '//sw/device/silicon_creator/rom/e2e:otp_img_sigverify_always_dev': no such target '//sw/device/silicon_creator/rom/e2e:otp_img_sigverify_always_dev': target 'otp_img_sigverify_always_dev' not declared in package 'sw/device/silicon_creator/rom/e2e' defined by /nightly/current_run/opentitan/sw/device/silicon_creator/rom/e2e/BUILD
ERROR: no such target '//sw/device/silicon_creator/rom/e2e:otp_img_sigverify_always_dev': target 'otp_img_sigverify_always_dev' not declared in package 'sw/device/silicon_creator/rom/e2e' defined by /nightly/current_run/opentitan/sw/device/silicon_creator/rom/e2e/BUILD
ERROR: Build did NOT complete successfully
_run_cmd -> had a non-zero return code of 1.
make: *** [/nightly/current_run/opentitan/hw/dv/tools/dvsim/sim.mk:58: sw_build] Error 1
rom_e2e_sigverify_always_a_nothing_b_bad_prod 63833791551383842814259382760790387758665934366854960323117275312948882869298 None
---- STDERR ----
Another command (pid=587116) is running. Waiting for it to complete on the server (server_pid=191100)...
WARNING: Target pattern parsing failed.
ERROR: Skipping '//sw/device/silicon_creator/rom/e2e:otp_img_sigverify_always_prod': no such target '//sw/device/silicon_creator/rom/e2e:otp_img_sigverify_always_prod': target 'otp_img_sigverify_always_prod' not declared in package 'sw/device/silicon_creator/rom/e2e' defined by /nightly/current_run/opentitan/sw/device/silicon_creator/rom/e2e/BUILD
ERROR: no such target '//sw/device/silicon_creator/rom/e2e:otp_img_sigverify_always_prod': target 'otp_img_sigverify_always_prod' not declared in package 'sw/device/silicon_creator/rom/e2e' defined by /nightly/current_run/opentitan/sw/device/silicon_creator/rom/e2e/BUILD
ERROR: Build did NOT complete successfully
_run_cmd -> had a non-zero return code of 1.
make: *** [/nightly/current_run/opentitan/hw/dv/tools/dvsim/sim.mk:58: sw_build] Error 1
rom_e2e_sigverify_always_a_nothing_b_bad_prod_end 103858073869087501517962255276538895901219830187121169774958907803514159950512 None
Another command (pid=594818) is running. Waiting for it to complete on the server (server_pid=191100)...
Another command (pid=602625) is running. Waiting for it to complete on the server (server_pid=191100)...
Another command (pid=613940) is running. Waiting for it to complete on the server (server_pid=191100)...
WARNING: Target pattern parsing failed.
ERROR: Skipping '//sw/device/silicon_creator/rom/e2e:otp_img_sigverify_always_prod_end': no such target '//sw/device/silicon_creator/rom/e2e:otp_img_sigverify_always_prod_end': target 'otp_img_sigverify_always_prod_end' not declared in package 'sw/device/silicon_creator/rom/e2e' defined by /nightly/current_run/opentitan/sw/device/silicon_creator/rom/e2e/BUILD
ERROR: no such target '//sw/device/silicon_creator/rom/e2e:otp_img_sigverify_always_prod_end': target 'otp_img_sigverify_always_prod_end' not declared in package 'sw/device/silicon_creator/rom/e2e' defined by /nightly/current_run/opentitan/sw/device/silicon_creator/rom/e2e/BUILD
ERROR: Build did NOT complete successfully
_run_cmd -> had a non-zero return code of 1.
make: *** [/nightly/current_run/opentitan/hw/dv/tools/dvsim/sim.mk:58: sw_build] Error 1
rom_e2e_sigverify_always_a_nothing_b_bad_rma 108720172815992189683586196610191846959010855769842970599300561044897006241805 None
Another command (pid=588012) is running. Waiting for it to complete on the server (server_pid=191100)...
Another command (pid=574418) is running. Waiting for it to complete on the server (server_pid=191100)...
Another command (pid=599451) is running. Waiting for it to complete on the server (server_pid=191100)...
WARNING: Target pattern parsing failed.
ERROR: Skipping '//sw/device/silicon_creator/rom/e2e:otp_img_sigverify_always_rma': no such target '//sw/device/silicon_creator/rom/e2e:otp_img_sigverify_always_rma': target 'otp_img_sigverify_always_rma' not declared in package 'sw/device/silicon_creator/rom/e2e' defined by /nightly/current_run/opentitan/sw/device/silicon_creator/rom/e2e/BUILD
ERROR: no such target '//sw/device/silicon_creator/rom/e2e:otp_img_sigverify_always_rma': target 'otp_img_sigverify_always_rma' not declared in package 'sw/device/silicon_creator/rom/e2e' defined by /nightly/current_run/opentitan/sw/device/silicon_creator/rom/e2e/BUILD
ERROR: Build did NOT complete successfully
_run_cmd -> had a non-zero return code of 1.
make: *** [/nightly/current_run/opentitan/hw/dv/tools/dvsim/sim.mk:58: sw_build] Error 1
rom_e2e_asm_init_test_unlocked0 11937383171585773602810824011311302602574338326067819704013863425800731144406 None
Another command (pid=286192) is running. Waiting for it to complete on the server (server_pid=191100)...
Another command (pid=308709) is running. Waiting for it to complete on the server (server_pid=191100)...
Another command (pid=291915) is running. Waiting for it to complete on the server (server_pid=191100)...
WARNING: Target pattern parsing failed.
ERROR: Skipping '//sw/device/silicon_creator/rom/e2e:empty_test_slot_a_sim_dv': no such target '//sw/device/silicon_creator/rom/e2e:empty_test_slot_a_sim_dv': target 'empty_test_slot_a_sim_dv' not declared in package 'sw/device/silicon_creator/rom/e2e' defined by /nightly/current_run/opentitan/sw/device/silicon_creator/rom/e2e/BUILD
ERROR: no such target '//sw/device/silicon_creator/rom/e2e:empty_test_slot_a_sim_dv': target 'empty_test_slot_a_sim_dv' not declared in package 'sw/device/silicon_creator/rom/e2e' defined by /nightly/current_run/opentitan/sw/device/silicon_creator/rom/e2e/BUILD
ERROR: Build did NOT complete successfully
_run_cmd -> had a non-zero return code of 1.
make: *** [/nightly/current_run/opentitan/hw/dv/tools/dvsim/sim.mk:58: sw_build] Error 1
rom_e2e_asm_init_dev 111277708447834079336854077177438343968574081077079614815121812814709248755744 None
Another command (pid=496715) is running. Waiting for it to complete on the server (server_pid=191100)...
Another command (pid=498391) is running. Waiting for it to complete on the server (server_pid=191100)...
Another command (pid=481450) is running. Waiting for it to complete on the server (server_pid=191100)...
WARNING: Target pattern parsing failed.
ERROR: Skipping '//sw/device/silicon_creator/rom/e2e:empty_test_slot_a_sim_dv': no such target '//sw/device/silicon_creator/rom/e2e:empty_test_slot_a_sim_dv': target 'empty_test_slot_a_sim_dv' not declared in package 'sw/device/silicon_creator/rom/e2e' defined by /nightly/current_run/opentitan/sw/device/silicon_creator/rom/e2e/BUILD
ERROR: no such target '//sw/device/silicon_creator/rom/e2e:empty_test_slot_a_sim_dv': target 'empty_test_slot_a_sim_dv' not declared in package 'sw/device/silicon_creator/rom/e2e' defined by /nightly/current_run/opentitan/sw/device/silicon_creator/rom/e2e/BUILD
ERROR: Build did NOT complete successfully
_run_cmd -> had a non-zero return code of 1.
make: *** [/nightly/current_run/opentitan/hw/dv/tools/dvsim/sim.mk:58: sw_build] Error 1
rom_e2e_asm_init_prod 89246863525193754478378151155781420392756846445547460508174526709471072546172 None
Another command (pid=462397) is running. Waiting for it to complete on the server (server_pid=191100)...
Another command (pid=474708) is running. Waiting for it to complete on the server (server_pid=191100)...
Another command (pid=475536) is running. Waiting for it to complete on the server (server_pid=191100)...
WARNING: Target pattern parsing failed.
ERROR: Skipping '//sw/device/silicon_creator/rom/e2e:empty_test_slot_a_sim_dv': no such target '//sw/device/silicon_creator/rom/e2e:empty_test_slot_a_sim_dv': target 'empty_test_slot_a_sim_dv' not declared in package 'sw/device/silicon_creator/rom/e2e' defined by /nightly/current_run/opentitan/sw/device/silicon_creator/rom/e2e/BUILD
ERROR: no such target '//sw/device/silicon_creator/rom/e2e:empty_test_slot_a_sim_dv': target 'empty_test_slot_a_sim_dv' not declared in package 'sw/device/silicon_creator/rom/e2e' defined by /nightly/current_run/opentitan/sw/device/silicon_creator/rom/e2e/BUILD
ERROR: Build did NOT complete successfully
_run_cmd -> had a non-zero return code of 1.
make: *** [/nightly/current_run/opentitan/hw/dv/tools/dvsim/sim.mk:58: sw_build] Error 1
rom_e2e_asm_init_prod_end 13354609542852756092777877658243360836594078417808098143883059797201552163214 None
Another command (pid=372501) is running. Waiting for it to complete on the server (server_pid=191100)...
Another command (pid=455373) is running. Waiting for it to complete on the server (server_pid=191100)...
Another command (pid=461990) is running. Waiting for it to complete on the server (server_pid=191100)...
WARNING: Target pattern parsing failed.
ERROR: Skipping '//sw/device/silicon_creator/rom/e2e:empty_test_slot_a_sim_dv': no such target '//sw/device/silicon_creator/rom/e2e:empty_test_slot_a_sim_dv': target 'empty_test_slot_a_sim_dv' not declared in package 'sw/device/silicon_creator/rom/e2e' defined by /nightly/current_run/opentitan/sw/device/silicon_creator/rom/e2e/BUILD
ERROR: no such target '//sw/device/silicon_creator/rom/e2e:empty_test_slot_a_sim_dv': target 'empty_test_slot_a_sim_dv' not declared in package 'sw/device/silicon_creator/rom/e2e' defined by /nightly/current_run/opentitan/sw/device/silicon_creator/rom/e2e/BUILD
ERROR: Build did NOT complete successfully
_run_cmd -> had a non-zero return code of 1.
make: *** [/nightly/current_run/opentitan/hw/dv/tools/dvsim/sim.mk:58: sw_build] Error 1
rom_e2e_asm_init_rma 105314924758862816170408847259762461888648318341115719121001794251048456944588 None
Another command (pid=457417) is running. Waiting for it to complete on the server (server_pid=191100)...
Another command (pid=456150) is running. Waiting for it to complete on the server (server_pid=191100)...
Another command (pid=476088) is running. Waiting for it to complete on the server (server_pid=191100)...
WARNING: Target pattern parsing failed.
ERROR: Skipping '//sw/device/silicon_creator/rom/e2e:empty_test_slot_a_sim_dv': no such target '//sw/device/silicon_creator/rom/e2e:empty_test_slot_a_sim_dv': target 'empty_test_slot_a_sim_dv' not declared in package 'sw/device/silicon_creator/rom/e2e' defined by /nightly/current_run/opentitan/sw/device/silicon_creator/rom/e2e/BUILD
ERROR: no such target '//sw/device/silicon_creator/rom/e2e:empty_test_slot_a_sim_dv': target 'empty_test_slot_a_sim_dv' not declared in package 'sw/device/silicon_creator/rom/e2e' defined by /nightly/current_run/opentitan/sw/device/silicon_creator/rom/e2e/BUILD
ERROR: Build did NOT complete successfully
_run_cmd -> had a non-zero return code of 1.
make: *** [/nightly/current_run/opentitan/hw/dv/tools/dvsim/sim.mk:58: sw_build] Error 1
rom_e2e_jtag_debug_test_unlocked0 25501701703859662133530187731634550680013585287599387659796445868347919499910 None
Another command (pid=514632) is running. Waiting for it to complete on the server (server_pid=191100)...
Another command (pid=542691) is running. Waiting for it to complete on the server (server_pid=191100)...
Another command (pid=538953) is running. Waiting for it to complete on the server (server_pid=191100)...
WARNING: Target pattern parsing failed.
ERROR: Skipping '//sw/device/silicon_creator/rom/e2e:img_test_unlocked0_exec_disabled': no such target '//sw/device/silicon_creator/rom/e2e:img_test_unlocked0_exec_disabled': target 'img_test_unlocked0_exec_disabled' not declared in package 'sw/device/silicon_creator/rom/e2e' defined by /nightly/current_run/opentitan/sw/device/silicon_creator/rom/e2e/BUILD
ERROR: no such target '//sw/device/silicon_creator/rom/e2e:img_test_unlocked0_exec_disabled': target 'img_test_unlocked0_exec_disabled' not declared in package 'sw/device/silicon_creator/rom/e2e' defined by /nightly/current_run/opentitan/sw/device/silicon_creator/rom/e2e/BUILD
ERROR: Build did NOT complete successfully
_run_cmd -> had a non-zero return code of 1.
make: *** [/nightly/current_run/opentitan/hw/dv/tools/dvsim/sim.mk:58: sw_build] Error 1
rom_e2e_jtag_debug_dev 98065888389922925778527895834765044492588263760019664130455648100547767927657 None
Another command (pid=525334) is running. Waiting for it to complete on the server (server_pid=191100)...
Another command (pid=526423) is running. Waiting for it to complete on the server (server_pid=191100)...
Another command (pid=521903) is running. Waiting for it to complete on the server (server_pid=191100)...
WARNING: Target pattern parsing failed.
ERROR: Skipping '//sw/device/silicon_creator/rom/e2e:img_dev_exec_disabled': no such target '//sw/device/silicon_creator/rom/e2e:img_dev_exec_disabled': target 'img_dev_exec_disabled' not declared in package 'sw/device/silicon_creator/rom/e2e' defined by /nightly/current_run/opentitan/sw/device/silicon_creator/rom/e2e/BUILD
ERROR: no such target '//sw/device/silicon_creator/rom/e2e:img_dev_exec_disabled': target 'img_dev_exec_disabled' not declared in package 'sw/device/silicon_creator/rom/e2e' defined by /nightly/current_run/opentitan/sw/device/silicon_creator/rom/e2e/BUILD
ERROR: Build did NOT complete successfully
_run_cmd -> had a non-zero return code of 1.
make: *** [/nightly/current_run/opentitan/hw/dv/tools/dvsim/sim.mk:58: sw_build] Error 1
rom_e2e_jtag_debug_rma 33435432077056247872455251767918245071193451382920345151370940177188558139776 None
---- STDERR ----
Another command (pid=499678) is running. Waiting for it to complete on the server (server_pid=191100)...
WARNING: Target pattern parsing failed.
ERROR: Skipping '//sw/device/silicon_creator/rom/e2e:img_rma_exec_disabled': no such target '//sw/device/silicon_creator/rom/e2e:img_rma_exec_disabled': target 'img_rma_exec_disabled' not declared in package 'sw/device/silicon_creator/rom/e2e' defined by /nightly/current_run/opentitan/sw/device/silicon_creator/rom/e2e/BUILD
ERROR: no such target '//sw/device/silicon_creator/rom/e2e:img_rma_exec_disabled': target 'img_rma_exec_disabled' not declared in package 'sw/device/silicon_creator/rom/e2e' defined by /nightly/current_run/opentitan/sw/device/silicon_creator/rom/e2e/BUILD
ERROR: Build did NOT complete successfully
_run_cmd -> had a non-zero return code of 1.
make: *** [/nightly/current_run/opentitan/hw/dv/tools/dvsim/sim.mk:58: sw_build] Error 1
rom_e2e_jtag_inject_test_unlocked0 3259171741379539045915748212615645768892429482128672439279630242856739828764 None
Another command (pid=375102) is running. Waiting for it to complete on the server (server_pid=191100)...
Another command (pid=460932) is running. Waiting for it to complete on the server (server_pid=191100)...
Another command (pid=461483) is running. Waiting for it to complete on the server (server_pid=191100)...
WARNING: Target pattern parsing failed.
ERROR: Skipping '//sw/device/silicon_creator/rom/e2e:img_dev_exec_disabled': no such target '//sw/device/silicon_creator/rom/e2e:img_dev_exec_disabled': target 'img_dev_exec_disabled' not declared in package 'sw/device/silicon_creator/rom/e2e' defined by /nightly/current_run/opentitan/sw/device/silicon_creator/rom/e2e/BUILD
ERROR: no such target '//sw/device/silicon_creator/rom/e2e:img_dev_exec_disabled': target 'img_dev_exec_disabled' not declared in package 'sw/device/silicon_creator/rom/e2e' defined by /nightly/current_run/opentitan/sw/device/silicon_creator/rom/e2e/BUILD
ERROR: Build did NOT complete successfully
_run_cmd -> had a non-zero return code of 1.
make: *** [/nightly/current_run/opentitan/hw/dv/tools/dvsim/sim.mk:58: sw_build] Error 1
rom_e2e_jtag_inject_dev 23424487808352150035163672136863855749185033642719811815485939213295797551755 None
---- STDERR ----
Another command (pid=361074) is running. Waiting for it to complete on the server (server_pid=191100)...
Another command (pid=379458) is running. Waiting for it to complete on the server (server_pid=191100)...
WARNING: Target pattern parsing failed.
ERROR: Skipping '//sw/device/silicon_creator/rom/e2e:img_dev_exec_disabled': no such target '//sw/device/silicon_creator/rom/e2e:img_dev_exec_disabled': target 'img_dev_exec_disabled' not declared in package 'sw/device/silicon_creator/rom/e2e' defined by /nightly/current_run/opentitan/sw/device/silicon_creator/rom/e2e/BUILD
ERROR: no such target '//sw/device/silicon_creator/rom/e2e:img_dev_exec_disabled': target 'img_dev_exec_disabled' not declared in package 'sw/device/silicon_creator/rom/e2e' defined by /nightly/current_run/opentitan/sw/device/silicon_creator/rom/e2e/BUILD
ERROR: Build did NOT complete successfully
_run_cmd -> had a non-zero return code of 1.
make: *** [/nightly/current_run/opentitan/hw/dv/tools/dvsim/sim.mk:58: sw_build] Error 1
rom_e2e_jtag_inject_rma 94432921951850755005067509747718481063743777923401632619752388235192433873266 None
Another command (pid=455373) is running. Waiting for it to complete on the server (server_pid=191100)...
Another command (pid=461990) is running. Waiting for it to complete on the server (server_pid=191100)...
Another command (pid=459178) is running. Waiting for it to complete on the server (server_pid=191100)...
WARNING: Target pattern parsing failed.
ERROR: Skipping '//sw/device/silicon_creator/rom/e2e:img_dev_exec_disabled': no such target '//sw/device/silicon_creator/rom/e2e:img_dev_exec_disabled': target 'img_dev_exec_disabled' not declared in package 'sw/device/silicon_creator/rom/e2e' defined by /nightly/current_run/opentitan/sw/device/silicon_creator/rom/e2e/BUILD
ERROR: no such target '//sw/device/silicon_creator/rom/e2e:img_dev_exec_disabled': target 'img_dev_exec_disabled' not declared in package 'sw/device/silicon_creator/rom/e2e' defined by /nightly/current_run/opentitan/sw/device/silicon_creator/rom/e2e/BUILD
ERROR: Build did NOT complete successfully
_run_cmd -> had a non-zero return code of 1.
make: *** [/nightly/current_run/opentitan/hw/dv/tools/dvsim/sim.mk:58: sw_build] Error 1
rom_e2e_static_critical 28682532561993260603551328554737192859853232498704708537679357165742257183892 None
---- STDERR ----
Another command (pid=619977) is running. Waiting for it to complete on the server (server_pid=191100)...
WARNING: Target pattern parsing failed.
ERROR: Skipping '//sw/device/silicon_creator/rom:rom_with_fake_keys_sim_dv': no such target '//sw/device/silicon_creator/rom:rom_with_fake_keys_sim_dv': target 'rom_with_fake_keys_sim_dv' not declared in package 'sw/device/silicon_creator/rom' defined by /nightly/current_run/opentitan/sw/device/silicon_creator/rom/BUILD
ERROR: no such target '//sw/device/silicon_creator/rom:rom_with_fake_keys_sim_dv': target 'rom_with_fake_keys_sim_dv' not declared in package 'sw/device/silicon_creator/rom' defined by /nightly/current_run/opentitan/sw/device/silicon_creator/rom/BUILD
ERROR: Build did NOT complete successfully
_run_cmd -> had a non-zero return code of 1.
make: *** [/nightly/current_run/opentitan/hw/dv/tools/dvsim/sim.mk:58: sw_build] Error 1
rom_e2e_keymgr_init_rom_ext_meas 80811301966221960058749469247444756808817892657359963055328844830252249480969 None
Another command (pid=517324) is running. Waiting for it to complete on the server (server_pid=191100)...
Another command (pid=531066) is running. Waiting for it to complete on the server (server_pid=191100)...
Another command (pid=522373) is running. Waiting for it to complete on the server (server_pid=191100)...
WARNING: Target pattern parsing failed.
ERROR: Skipping '//sw/device/silicon_creator/rom/e2e:rom_e2e_keymgr_init_test_sim_dv': no such target '//sw/device/silicon_creator/rom/e2e:rom_e2e_keymgr_init_test_sim_dv': target 'rom_e2e_keymgr_init_test_sim_dv' not declared in package 'sw/device/silicon_creator/rom/e2e' defined by /nightly/current_run/opentitan/sw/device/silicon_creator/rom/e2e/BUILD
ERROR: no such target '//sw/device/silicon_creator/rom/e2e:rom_e2e_keymgr_init_test_sim_dv': target 'rom_e2e_keymgr_init_test_sim_dv' not declared in package 'sw/device/silicon_creator/rom/e2e' defined by /nightly/current_run/opentitan/sw/device/silicon_creator/rom/e2e/BUILD
ERROR: Build did NOT complete successfully
_run_cmd -> had a non-zero return code of 1.
make: *** [/nightly/current_run/opentitan/hw/dv/tools/dvsim/sim.mk:58: sw_build] Error 1
rom_e2e_keymgr_init_rom_ext_no_meas 22175579972620173080354805781362884901727120077068093298013985629503215352295 None
Another command (pid=517324) is running. Waiting for it to complete on the server (server_pid=191100)...
Another command (pid=511395) is running. Waiting for it to complete on the server (server_pid=191100)...
Another command (pid=525923) is running. Waiting for it to complete on the server (server_pid=191100)...
WARNING: Target pattern parsing failed.
ERROR: Skipping '//sw/device/silicon_creator/rom/e2e:rom_e2e_keymgr_init_test_sim_dv': no such target '//sw/device/silicon_creator/rom/e2e:rom_e2e_keymgr_init_test_sim_dv': target 'rom_e2e_keymgr_init_test_sim_dv' not declared in package 'sw/device/silicon_creator/rom/e2e' defined by /nightly/current_run/opentitan/sw/device/silicon_creator/rom/e2e/BUILD
ERROR: no such target '//sw/device/silicon_creator/rom/e2e:rom_e2e_keymgr_init_test_sim_dv': target 'rom_e2e_keymgr_init_test_sim_dv' not declared in package 'sw/device/silicon_creator/rom/e2e' defined by /nightly/current_run/opentitan/sw/device/silicon_creator/rom/e2e/BUILD
ERROR: Build did NOT complete successfully
_run_cmd -> had a non-zero return code of 1.
make: *** [/nightly/current_run/opentitan/hw/dv/tools/dvsim/sim.mk:58: sw_build] Error 1
rom_e2e_keymgr_init_rom_ext_invalid_meas 61392813250448837559329593252140682217082347276861240904140536773161656421274 None
Another command (pid=521903) is running. Waiting for it to complete on the server (server_pid=191100)...
Another command (pid=528026) is running. Waiting for it to complete on the server (server_pid=191100)...
Another command (pid=526653) is running. Waiting for it to complete on the server (server_pid=191100)...
WARNING: Target pattern parsing failed.
ERROR: Skipping '//sw/device/silicon_creator/rom/e2e:rom_e2e_keymgr_init_test_sim_dv': no such target '//sw/device/silicon_creator/rom/e2e:rom_e2e_keymgr_init_test_sim_dv': target 'rom_e2e_keymgr_init_test_sim_dv' not declared in package 'sw/device/silicon_creator/rom/e2e' defined by /nightly/current_run/opentitan/sw/device/silicon_creator/rom/e2e/BUILD
ERROR: no such target '//sw/device/silicon_creator/rom/e2e:rom_e2e_keymgr_init_test_sim_dv': target 'rom_e2e_keymgr_init_test_sim_dv' not declared in package 'sw/device/silicon_creator/rom/e2e' defined by /nightly/current_run/opentitan/sw/device/silicon_creator/rom/e2e/BUILD
ERROR: Build did NOT complete successfully
_run_cmd -> had a non-zero return code of 1.
make: *** [/nightly/current_run/opentitan/hw/dv/tools/dvsim/sim.mk:58: sw_build] Error 1
rom_e2e_sigverify_mod_exp_test_unlocked0_otbn 46989572236826749015472341829443078242697967428931369707101383033789181959750 None
Another command (pid=291915) is running. Waiting for it to complete on the server (server_pid=191100)...
Another command (pid=306251) is running. Waiting for it to complete on the server (server_pid=191100)...
Another command (pid=314056) is running. Waiting for it to complete on the server (server_pid=191100)...
WARNING: Target pattern parsing failed.
ERROR: Skipping '//sw/device/silicon_creator/rom/e2e:empty_test_sigverify_mod_exp_sim_dv': no such target '//sw/device/silicon_creator/rom/e2e:empty_test_sigverify_mod_exp_sim_dv': target 'empty_test_sigverify_mod_exp_sim_dv' not declared in package 'sw/device/silicon_creator/rom/e2e' defined by /nightly/current_run/opentitan/sw/device/silicon_creator/rom/e2e/BUILD
ERROR: no such target '//sw/device/silicon_creator/rom/e2e:empty_test_sigverify_mod_exp_sim_dv': target 'empty_test_sigverify_mod_exp_sim_dv' not declared in package 'sw/device/silicon_creator/rom/e2e' defined by /nightly/current_run/opentitan/sw/device/silicon_creator/rom/e2e/BUILD
ERROR: Build did NOT complete successfully
_run_cmd -> had a non-zero return code of 1.
make: *** [/nightly/current_run/opentitan/hw/dv/tools/dvsim/sim.mk:58: sw_build] Error 1
rom_e2e_sigverify_mod_exp_test_unlocked0_sw 55203222848165176530808981592411800519600624543449327437215975165699099801178 None
Another command (pid=308709) is running. Waiting for it to complete on the server (server_pid=191100)...
Another command (pid=291915) is running. Waiting for it to complete on the server (server_pid=191100)...
Another command (pid=352717) is running. Waiting for it to complete on the server (server_pid=191100)...
WARNING: Target pattern parsing failed.
ERROR: Skipping '//sw/device/silicon_creator/rom/e2e:empty_test_sigverify_mod_exp_sim_dv': no such target '//sw/device/silicon_creator/rom/e2e:empty_test_sigverify_mod_exp_sim_dv': target 'empty_test_sigverify_mod_exp_sim_dv' not declared in package 'sw/device/silicon_creator/rom/e2e' defined by /nightly/current_run/opentitan/sw/device/silicon_creator/rom/e2e/BUILD
ERROR: no such target '//sw/device/silicon_creator/rom/e2e:empty_test_sigverify_mod_exp_sim_dv': target 'empty_test_sigverify_mod_exp_sim_dv' not declared in package 'sw/device/silicon_creator/rom/e2e' defined by /nightly/current_run/opentitan/sw/device/silicon_creator/rom/e2e/BUILD
ERROR: Build did NOT complete successfully
_run_cmd -> had a non-zero return code of 1.
make: *** [/nightly/current_run/opentitan/hw/dv/tools/dvsim/sim.mk:58: sw_build] Error 1
rom_e2e_sigverify_mod_exp_dev_otbn 29234316470350566481030730522339024388338222862497843047758159874804925173979 None
---- STDERR ----
Another command (pid=593357) is running. Waiting for it to complete on the server (server_pid=191100)...
WARNING: Target pattern parsing failed.
ERROR: Skipping '//sw/device/silicon_creator/rom/e2e:empty_test_sigverify_mod_exp_sim_dv': no such target '//sw/device/silicon_creator/rom/e2e:empty_test_sigverify_mod_exp_sim_dv': target 'empty_test_sigverify_mod_exp_sim_dv' not declared in package 'sw/device/silicon_creator/rom/e2e' defined by /nightly/current_run/opentitan/sw/device/silicon_creator/rom/e2e/BUILD
ERROR: no such target '//sw/device/silicon_creator/rom/e2e:empty_test_sigverify_mod_exp_sim_dv': target 'empty_test_sigverify_mod_exp_sim_dv' not declared in package 'sw/device/silicon_creator/rom/e2e' defined by /nightly/current_run/opentitan/sw/device/silicon_creator/rom/e2e/BUILD
ERROR: Build did NOT complete successfully
_run_cmd -> had a non-zero return code of 1.
make: *** [/nightly/current_run/opentitan/hw/dv/tools/dvsim/sim.mk:58: sw_build] Error 1
rom_e2e_sigverify_mod_exp_dev_sw 60114686588506246372061402054897626198115763251763223951689086692689812965265 None
Another command (pid=604816) is running. Waiting for it to complete on the server (server_pid=191100)...
Another command (pid=558516) is running. Waiting for it to complete on the server (server_pid=191100)...
Another command (pid=576164) is running. Waiting for it to complete on the server (server_pid=191100)...
WARNING: Target pattern parsing failed.
ERROR: Skipping '//sw/device/silicon_creator/rom/e2e:empty_test_sigverify_mod_exp_sim_dv': no such target '//sw/device/silicon_creator/rom/e2e:empty_test_sigverify_mod_exp_sim_dv': target 'empty_test_sigverify_mod_exp_sim_dv' not declared in package 'sw/device/silicon_creator/rom/e2e' defined by /nightly/current_run/opentitan/sw/device/silicon_creator/rom/e2e/BUILD
ERROR: no such target '//sw/device/silicon_creator/rom/e2e:empty_test_sigverify_mod_exp_sim_dv': target 'empty_test_sigverify_mod_exp_sim_dv' not declared in package 'sw/device/silicon_creator/rom/e2e' defined by /nightly/current_run/opentitan/sw/device/silicon_creator/rom/e2e/BUILD
ERROR: Build did NOT complete successfully
_run_cmd -> had a non-zero return code of 1.
make: *** [/nightly/current_run/opentitan/hw/dv/tools/dvsim/sim.mk:58: sw_build] Error 1
rom_e2e_sigverify_mod_exp_prod_otbn 68622536504394990397184641155239263950746899155001606084485740448581176969662 None
---- STDERR ----
Another command (pid=594818) is running. Waiting for it to complete on the server (server_pid=191100)...
WARNING: Target pattern parsing failed.
ERROR: Skipping '//sw/device/silicon_creator/rom/e2e:empty_test_sigverify_mod_exp_sim_dv': no such target '//sw/device/silicon_creator/rom/e2e:empty_test_sigverify_mod_exp_sim_dv': target 'empty_test_sigverify_mod_exp_sim_dv' not declared in package 'sw/device/silicon_creator/rom/e2e' defined by /nightly/current_run/opentitan/sw/device/silicon_creator/rom/e2e/BUILD
ERROR: no such target '//sw/device/silicon_creator/rom/e2e:empty_test_sigverify_mod_exp_sim_dv': target 'empty_test_sigverify_mod_exp_sim_dv' not declared in package 'sw/device/silicon_creator/rom/e2e' defined by /nightly/current_run/opentitan/sw/device/silicon_creator/rom/e2e/BUILD
ERROR: Build did NOT complete successfully
_run_cmd -> had a non-zero return code of 1.
make: *** [/nightly/current_run/opentitan/hw/dv/tools/dvsim/sim.mk:58: sw_build] Error 1
rom_e2e_sigverify_mod_exp_prod_sw 115526902598065488370485968415718752936198231960969897412260258702682346021549 None
---- STDERR ----
Another command (pid=609967) is running. Waiting for it to complete on the server (server_pid=191100)...
WARNING: Target pattern parsing failed.
ERROR: Skipping '//sw/device/silicon_creator/rom/e2e:empty_test_sigverify_mod_exp_sim_dv': no such target '//sw/device/silicon_creator/rom/e2e:empty_test_sigverify_mod_exp_sim_dv': target 'empty_test_sigverify_mod_exp_sim_dv' not declared in package 'sw/device/silicon_creator/rom/e2e' defined by /nightly/current_run/opentitan/sw/device/silicon_creator/rom/e2e/BUILD
ERROR: no such target '//sw/device/silicon_creator/rom/e2e:empty_test_sigverify_mod_exp_sim_dv': target 'empty_test_sigverify_mod_exp_sim_dv' not declared in package 'sw/device/silicon_creator/rom/e2e' defined by /nightly/current_run/opentitan/sw/device/silicon_creator/rom/e2e/BUILD
ERROR: Build did NOT complete successfully
_run_cmd -> had a non-zero return code of 1.
make: *** [/nightly/current_run/opentitan/hw/dv/tools/dvsim/sim.mk:58: sw_build] Error 1
rom_e2e_sigverify_mod_exp_prod_end_otbn 33264847685928665449544631720467716153274207143790530382591340428981787411006 None
---- STDERR ----
Another command (pid=584580) is running. Waiting for it to complete on the server (server_pid=191100)...
WARNING: Target pattern parsing failed.
ERROR: Skipping '//sw/device/silicon_creator/rom/e2e:empty_test_sigverify_mod_exp_sim_dv': no such target '//sw/device/silicon_creator/rom/e2e:empty_test_sigverify_mod_exp_sim_dv': target 'empty_test_sigverify_mod_exp_sim_dv' not declared in package 'sw/device/silicon_creator/rom/e2e' defined by /nightly/current_run/opentitan/sw/device/silicon_creator/rom/e2e/BUILD
ERROR: no such target '//sw/device/silicon_creator/rom/e2e:empty_test_sigverify_mod_exp_sim_dv': target 'empty_test_sigverify_mod_exp_sim_dv' not declared in package 'sw/device/silicon_creator/rom/e2e' defined by /nightly/current_run/opentitan/sw/device/silicon_creator/rom/e2e/BUILD
ERROR: Build did NOT complete successfully
_run_cmd -> had a non-zero return code of 1.
make: *** [/nightly/current_run/opentitan/hw/dv/tools/dvsim/sim.mk:58: sw_build] Error 1
rom_e2e_sigverify_mod_exp_prod_end_sw 48638293087414570982216921451676867219056015556038441268506843452004040153085 None
Another command (pid=577456) is running. Waiting for it to complete on the server (server_pid=191100)...
Another command (pid=612604) is running. Waiting for it to complete on the server (server_pid=191100)...
Another command (pid=614862) is running. Waiting for it to complete on the server (server_pid=191100)...
WARNING: Target pattern parsing failed.
ERROR: Skipping '//sw/device/silicon_creator/rom/e2e:empty_test_sigverify_mod_exp_sim_dv': no such target '//sw/device/silicon_creator/rom/e2e:empty_test_sigverify_mod_exp_sim_dv': target 'empty_test_sigverify_mod_exp_sim_dv' not declared in package 'sw/device/silicon_creator/rom/e2e' defined by /nightly/current_run/opentitan/sw/device/silicon_creator/rom/e2e/BUILD
ERROR: no such target '//sw/device/silicon_creator/rom/e2e:empty_test_sigverify_mod_exp_sim_dv': target 'empty_test_sigverify_mod_exp_sim_dv' not declared in package 'sw/device/silicon_creator/rom/e2e' defined by /nightly/current_run/opentitan/sw/device/silicon_creator/rom/e2e/BUILD
ERROR: Build did NOT complete successfully
_run_cmd -> had a non-zero return code of 1.
make: *** [/nightly/current_run/opentitan/hw/dv/tools/dvsim/sim.mk:58: sw_build] Error 1
rom_e2e_sigverify_mod_exp_rma_otbn 51984176029943904511674617226742619703429649275418772094118221238541872028613 None
Another command (pid=622951) is running. Waiting for it to complete on the server (server_pid=191100)...
Another command (pid=624229) is running. Waiting for it to complete on the server (server_pid=191100)...
Another command (pid=611282) is running. Waiting for it to complete on the server (server_pid=191100)...
WARNING: Target pattern parsing failed.
ERROR: Skipping '//sw/device/silicon_creator/rom/e2e:empty_test_sigverify_mod_exp_sim_dv': no such target '//sw/device/silicon_creator/rom/e2e:empty_test_sigverify_mod_exp_sim_dv': target 'empty_test_sigverify_mod_exp_sim_dv' not declared in package 'sw/device/silicon_creator/rom/e2e' defined by /nightly/current_run/opentitan/sw/device/silicon_creator/rom/e2e/BUILD
ERROR: no such target '//sw/device/silicon_creator/rom/e2e:empty_test_sigverify_mod_exp_sim_dv': target 'empty_test_sigverify_mod_exp_sim_dv' not declared in package 'sw/device/silicon_creator/rom/e2e' defined by /nightly/current_run/opentitan/sw/device/silicon_creator/rom/e2e/BUILD
ERROR: Build did NOT complete successfully
_run_cmd -> had a non-zero return code of 1.
make: *** [/nightly/current_run/opentitan/hw/dv/tools/dvsim/sim.mk:58: sw_build] Error 1
rom_e2e_sigverify_mod_exp_rma_sw 70196361351427174371119342667123858462306417893842432485900736242152755373210 None
---- STDERR ----
Another command (pid=614862) is running. Waiting for it to complete on the server (server_pid=191100)...
WARNING: Target pattern parsing failed.
ERROR: Skipping '//sw/device/silicon_creator/rom/e2e:empty_test_sigverify_mod_exp_sim_dv': no such target '//sw/device/silicon_creator/rom/e2e:empty_test_sigverify_mod_exp_sim_dv': target 'empty_test_sigverify_mod_exp_sim_dv' not declared in package 'sw/device/silicon_creator/rom/e2e' defined by /nightly/current_run/opentitan/sw/device/silicon_creator/rom/e2e/BUILD
ERROR: no such target '//sw/device/silicon_creator/rom/e2e:empty_test_sigverify_mod_exp_sim_dv': target 'empty_test_sigverify_mod_exp_sim_dv' not declared in package 'sw/device/silicon_creator/rom/e2e' defined by /nightly/current_run/opentitan/sw/device/silicon_creator/rom/e2e/BUILD
ERROR: Build did NOT complete successfully
_run_cmd -> had a non-zero return code of 1.
make: *** [/nightly/current_run/opentitan/hw/dv/tools/dvsim/sim.mk:58: sw_build] Error 1
rom_volatile_raw_unlock 77615229211783444087625777016385928608624692782371535307925141280743239817336 None
Another command (pid=352717) is running. Waiting for it to complete on the server (server_pid=191100)...
Another command (pid=340066) is running. Waiting for it to complete on the server (server_pid=191100)...
Another command (pid=353608) is running. Waiting for it to complete on the server (server_pid=191100)...
WARNING: Target pattern parsing failed.
ERROR: Skipping '//sw/device/silicon_creator/rom/e2e:empty_test_slot_a_sim_dv': no such target '//sw/device/silicon_creator/rom/e2e:empty_test_slot_a_sim_dv': target 'empty_test_slot_a_sim_dv' not declared in package 'sw/device/silicon_creator/rom/e2e' defined by /nightly/current_run/opentitan/sw/device/silicon_creator/rom/e2e/BUILD
ERROR: no such target '//sw/device/silicon_creator/rom/e2e:empty_test_slot_a_sim_dv': target 'empty_test_slot_a_sim_dv' not declared in package 'sw/device/silicon_creator/rom/e2e' defined by /nightly/current_run/opentitan/sw/device/silicon_creator/rom/e2e/BUILD
ERROR: Build did NOT complete successfully
_run_cmd -> had a non-zero return code of 1.
make: *** [/nightly/current_run/opentitan/hw/dv/tools/dvsim/sim.mk:58: sw_build] Error 1
rom_raw_unlock 84262730109925195838055076603875388396052481196621998796773599584603319115877 None
---- STDERR ----
Another command (pid=286192) is running. Waiting for it to complete on the server (server_pid=191100)...
WARNING: Target pattern parsing failed.
ERROR: Skipping '//sw/device/silicon_creator/rom/e2e:empty_test_slot_a_sim_dv': no such target '//sw/device/silicon_creator/rom/e2e:empty_test_slot_a_sim_dv': target 'empty_test_slot_a_sim_dv' not declared in package 'sw/device/silicon_creator/rom/e2e' defined by /nightly/current_run/opentitan/sw/device/silicon_creator/rom/e2e/BUILD
ERROR: no such target '//sw/device/silicon_creator/rom/e2e:empty_test_slot_a_sim_dv': target 'empty_test_slot_a_sim_dv' not declared in package 'sw/device/silicon_creator/rom/e2e' defined by /nightly/current_run/opentitan/sw/device/silicon_creator/rom/e2e/BUILD
ERROR: Build did NOT complete successfully
_run_cmd -> had a non-zero return code of 1.
make: *** [/nightly/current_run/opentitan/hw/dv/tools/dvsim/sim.mk:58: sw_build] Error 1
rom_e2e_self_hash 105589403156671179512072024416373527564720596059130146509928814510313567540273 None
---- STDERR ----
Another command (pid=332040) is running. Waiting for it to complete on the server (server_pid=191100)...
WARNING: Target pattern parsing failed.
ERROR: Skipping '//sw/device/silicon_creator/rom/e2e:otp_img_sigverify_mod_exp_rma_otbn': no such target '//sw/device/silicon_creator/rom/e2e:otp_img_sigverify_mod_exp_rma_otbn': target 'otp_img_sigverify_mod_exp_rma_otbn' not declared in package 'sw/device/silicon_creator/rom/e2e' defined by /nightly/current_run/opentitan/sw/device/silicon_creator/rom/e2e/BUILD
ERROR: no such target '//sw/device/silicon_creator/rom/e2e:otp_img_sigverify_mod_exp_rma_otbn': target 'otp_img_sigverify_mod_exp_rma_otbn' not declared in package 'sw/device/silicon_creator/rom/e2e' defined by /nightly/current_run/opentitan/sw/device/silicon_creator/rom/e2e/BUILD
ERROR: Build did NOT complete successfully
_run_cmd -> had a non-zero return code of 1.
make: *** [/nightly/current_run/opentitan/hw/dv/tools/dvsim/sim.mk:58: sw_build] Error 1
chip_sw_uart_smoketest_signed 27291882075492171751592733920532817436928077168875682863705770375969229921247 None
Another command (pid=456150) is running. Waiting for it to complete on the server (server_pid=191100)...
Another command (pid=476088) is running. Waiting for it to complete on the server (server_pid=191100)...
Another command (pid=454890) is running. Waiting for it to complete on the server (server_pid=191100)...
WARNING: Target pattern parsing failed.
ERROR: Skipping '//sw/device/tests:uart_smoketest_signed_sim_dv': no such target '//sw/device/tests:uart_smoketest_signed_sim_dv': target 'uart_smoketest_signed_sim_dv' not declared in package 'sw/device/tests' defined by /nightly/current_run/opentitan/sw/device/tests/BUILD
ERROR: no such target '//sw/device/tests:uart_smoketest_signed_sim_dv': target 'uart_smoketest_signed_sim_dv' not declared in package 'sw/device/tests' defined by /nightly/current_run/opentitan/sw/device/tests/BUILD
ERROR: Build did NOT complete successfully
_run_cmd -> had a non-zero return code of 1.
make: *** [/nightly/current_run/opentitan/hw/dv/tools/dvsim/sim.mk:58: sw_build] Error 1
rom_keymgr_functest 8347510203722250142707510466676337490000000756772324840794243645825098669887 None
Use --verbose_failures to see the command lines of failed build steps.
ERROR: Analysis of target '//sw/device/silicon_creator/lib/drivers:keymgr_functest_sim_dv' failed; build aborted: Target //sw/device/silicon_creator/lib/drivers:keymgr_functest_sim_dv is incompatible and cannot be built, but was explicitly requested.
Dependency chain:
//sw/device/silicon_creator/lib/drivers:keymgr_functest_sim_dv (f2055d) <-- target platform (//toolchain:opentitan_platform) didn't satisfy constraint @@platforms//:incompatible
INFO: Elapsed time: 0.271s, Critical Path: 0.03s
INFO: 1 process: 1 internal.
ERROR: Build did NOT complete successfully
_run_cmd -> had a non-zero return code of 1.
make: *** [/nightly/current_run/opentitan/hw/dv/tools/dvsim/sim.mk:58: sw_build] Error 1
UVM_FATAL @ * us: (dv_utils_pkg.sv:253) [dv_utils_pkg::sw_symbol_get_addr_size.unnamed$$_*] Check failed (ret) Failed to read line from "kJitterEnabled.dat" 12 test runs
chip_sw_otbn_ecdsa_op_irq_jitter_en 87901006979545738814457168342405619556664529577503741368031235643647852010187 312
UVM_INFO @ 10.380001 us: (uvm_report_catcher.svh:705) [UVM/REPORT/CATCHER]
--- UVM Report catcher Summary ---
chip_sw_aes_enc_jitter_en 20131892592834934610254943335997306266441468784681113213128599468796454407878 312
UVM_INFO @ 10.180001 us: (uvm_report_catcher.svh:705) [UVM/REPORT/CATCHER]
--- UVM Report catcher Summary ---
chip_sw_hmac_enc_jitter_en 64166819000666057687728130333819277949388080642211267555164908847955690117209 312
UVM_INFO @ 10.400001 us: (uvm_report_catcher.svh:705) [UVM/REPORT/CATCHER]
--- UVM Report catcher Summary ---
chip_sw_keymgr_dpe_key_derivation_jitter_en 35135899599332852460337408784585300915338289673894745905660960456898320637731 312
UVM_INFO @ 10.220001 us: (uvm_report_catcher.svh:705) [UVM/REPORT/CATCHER]
--- UVM Report catcher Summary ---
chip_sw_kmac_mode_kmac_jitter_en 71176482208281215775255385459876745112920397953098823920027476439121566598386 312
UVM_INFO @ 10.220001 us: (uvm_report_catcher.svh:705) [UVM/REPORT/CATCHER]
--- UVM Report catcher Summary ---
chip_sw_otbn_ecdsa_op_irq_jitter_en_reduced_freq 48274099723493150213302503649479256798977014156031714054451048519653289053809 312
UVM_INFO @ 10.200001 us: (uvm_report_catcher.svh:705) [UVM/REPORT/CATCHER]
--- UVM Report catcher Summary ---
chip_sw_aes_enc_jitter_en_reduced_freq 107387060600610571709662052310259653387615631912556941729704761010512372015881 312
UVM_INFO @ 10.260001 us: (uvm_report_catcher.svh:705) [UVM/REPORT/CATCHER]
--- UVM Report catcher Summary ---
chip_sw_hmac_enc_jitter_en_reduced_freq 111049716746247930327388883351732150160431752081942825691546866918445053119337 312
UVM_INFO @ 10.380001 us: (uvm_report_catcher.svh:705) [UVM/REPORT/CATCHER]
--- UVM Report catcher Summary ---
chip_sw_keymgr_dpe_key_derivation_jitter_en_reduced_freq 112732067499437811193138629547463910802003349991916407926307701471367729022618 312
UVM_INFO @ 10.140001 us: (uvm_report_catcher.svh:705) [UVM/REPORT/CATCHER]
--- UVM Report catcher Summary ---
chip_sw_kmac_mode_kmac_jitter_en_reduced_freq 80881350417523376569492416310612406453015956654061264346301440746120495785867 312
UVM_INFO @ 10.200001 us: (uvm_report_catcher.svh:705) [UVM/REPORT/CATCHER]
--- UVM Report catcher Summary ---
chip_sw_sram_ctrl_scrambled_access_jitter_en_reduced_freq 5097214362647558404432996368543040421839930605527451795718153051499130639941 312
UVM_INFO @ 10.400001 us: (uvm_report_catcher.svh:705) [UVM/REPORT/CATCHER]
--- UVM Report catcher Summary ---
chip_sw_csrng_edn_concurrency_reduced_freq 64482891027790094722944824061804257331037278978805013007166272235166241879375 312
UVM_INFO @ 10.320001 us: (uvm_report_catcher.svh:705) [UVM/REPORT/CATCHER]
--- UVM Report catcher Summary ---
Offending '((~rst_ni) === (~seed_en_q))' 10 test runs
chip_sw_lc_ctrl_rma_to_scrap 55990043367839162946688785505432926843300605040858225903250389740279639899826 325
UVM_ERROR @ 162.296000 us: (otbn_rnd.sv:233) [ASSERT FAILED] UrndNoReseedOnReset_A
UVM_INFO @ 162.296000 us: (uvm_report_catcher.svh:705) [UVM/REPORT/CATCHER]
--- UVM Report catcher Summary ---
chip_sw_lc_ctrl_raw_to_scrap 111398403034646165523170277669729453402106561369190516121771849150804604494551 322
UVM_ERROR @ 175.224000 us: (otbn_rnd.sv:233) [ASSERT FAILED] UrndNoReseedOnReset_A
UVM_INFO @ 175.224000 us: (uvm_report_catcher.svh:705) [UVM/REPORT/CATCHER]
--- UVM Report catcher Summary ---
chip_sw_lc_ctrl_test_locked0_to_scrap 55248389695223432487768814757780264119431665606416812761387875929296488289115 322
UVM_ERROR @ 170.616000 us: (otbn_rnd.sv:233) [ASSERT FAILED] UrndNoReseedOnReset_A
UVM_INFO @ 170.616000 us: (uvm_report_catcher.svh:705) [UVM/REPORT/CATCHER]
--- UVM Report catcher Summary ---
chip_sw_lc_ctrl_rand_to_scrap 93166054085263764889791763334131077763168319960707747529550109687033334706065 333
UVM_ERROR @ 171.464000 us: (otbn_rnd.sv:233) [ASSERT FAILED] UrndNoReseedOnReset_A
UVM_INFO @ 171.464000 us: (uvm_report_catcher.svh:705) [UVM/REPORT/CATCHER]
--- UVM Report catcher Summary ---
chip_sw_lc_ctrl_volatile_raw_unlock 38075412883718914014680394650524753792921989107490561214064447911758665861257 325
UVM_ERROR @ 392.072000 us: (otbn_rnd.sv:233) [ASSERT FAILED] UrndNoReseedOnReset_A
UVM_INFO @ 392.072000 us: (uvm_report_catcher.svh:705) [UVM/REPORT/CATCHER]
--- UVM Report catcher Summary ---
chip_sw_lc_ctrl_volatile_raw_unlock_ext_clk_48mhz 55280029379705870410933781679721693386293154506305093432119782492598001380926 328
UVM_ERROR @ 382.760000 us: (otbn_rnd.sv:233) [ASSERT FAILED] UrndNoReseedOnReset_A
UVM_INFO @ 382.760000 us: (uvm_report_catcher.svh:705) [UVM/REPORT/CATCHER]
--- UVM Report catcher Summary ---
chip_sw_pwrmgr_full_aon_reset 115266701363968967032429629256668760426110489242609548240281789629130448525471 316
UVM_ERROR @ 118.440000 us: (otbn_rnd.sv:233) [ASSERT FAILED] UrndNoReseedOnReset_A
UVM_INFO @ 118.440000 us: (uvm_report_catcher.svh:705) [UVM/REPORT/CATCHER]
--- UVM Report catcher Summary ---
chip_sw_rom_ctrl_integrity_check 88849853782904621342801066144199345809534581871780569684007749097008477021007 324
UVM_ERROR @ 157.272000 us: (otbn_rnd.sv:233) [ASSERT FAILED] UrndNoReseedOnReset_A
UVM_INFO @ 157.272000 us: (uvm_report_catcher.svh:705) [UVM/REPORT/CATCHER]
--- UVM Report catcher Summary ---
chip_prim_tl_access 63754655354598901482279084899656603865028775489161042912504574149639016240019 234
UVM_ERROR @ 117.992000 us: (otbn_rnd.sv:233) [ASSERT FAILED] UrndNoReseedOnReset_A
UVM_INFO @ 117.992000 us: (uvm_report_catcher.svh:705) [UVM/REPORT/CATCHER]
--- UVM Report catcher Summary ---
chip_rv_dm_lc_disabled 29743838868146404887240303023331224897594685503713096643899749456548261261596 213
UVM_ERROR @ 128.152000 us: (otbn_rnd.sv:233) [ASSERT FAILED] UrndNoReseedOnReset_A
UVM_INFO @ 128.152000 us: (uvm_report_catcher.svh:705) [UVM/REPORT/CATCHER]
--- UVM Report catcher Summary ---
Offending '((!rstreqs[*]) && (reset_cause != HwReq))' 5 test runs
chip_sw_rstmgr_cpu_info 65533720090735225065924537695399042498026508798797141511397390955116637885961 346
UVM_ERROR @ 412.064000 us: (pwrmgr_rstreqs_sva_if.sv:55) [ASSERT FAILED] HwResetOff_A
UVM_INFO @ 412.064000 us: (uvm_report_catcher.svh:705) [UVM/REPORT/CATCHER]
--- UVM Report catcher Summary ---
chip_sw_clkmgr_off_aes_trans 48074045566957380011481704045576602740576887802775021682897201701245508435967 323
UVM_ERROR @ 185.264000 us: (pwrmgr_rstreqs_sva_if.sv:55) [ASSERT FAILED] HwResetOff_A
UVM_INFO @ 185.264000 us: (uvm_report_catcher.svh:705) [UVM/REPORT/CATCHER]
--- UVM Report catcher Summary ---
chip_sw_clkmgr_off_hmac_trans 57453827693711972215027193663976484910284603018958938079370047295324866379878 323
UVM_ERROR @ 185.280000 us: (pwrmgr_rstreqs_sva_if.sv:55) [ASSERT FAILED] HwResetOff_A
UVM_INFO @ 185.280000 us: (uvm_report_catcher.svh:705) [UVM/REPORT/CATCHER]
--- UVM Report catcher Summary ---
chip_sw_clkmgr_off_kmac_trans 19658510879276302862306072028743248508750985458906502584029793214925870434929 323
UVM_ERROR @ 185.232000 us: (pwrmgr_rstreqs_sva_if.sv:55) [ASSERT FAILED] HwResetOff_A
UVM_INFO @ 185.232000 us: (uvm_report_catcher.svh:705) [UVM/REPORT/CATCHER]
--- UVM Report catcher Summary ---
chip_sw_clkmgr_off_otbn_trans 114584973741860731143397730611034685236999378398439062177871916495551401420231 323
UVM_ERROR @ 185.248000 us: (pwrmgr_rstreqs_sva_if.sv:55) [ASSERT FAILED] HwResetOff_A
UVM_INFO @ 185.248000 us: (uvm_report_catcher.svh:705) [UVM/REPORT/CATCHER]
--- UVM Report catcher Summary ---
UVM_FATAL @ * us: (mem_bkdr_util.sv:658) [mem_bkdr_util[Otp]] file otp_ctrl_img_rma.vmem could not be opened for r mode 3 test runs
chip_csr_bit_bash 61761535667182820537709283071553034203367023289623621560667393791508632206135 136
UVM_INFO @ 0.000000 us: (uvm_report_catcher.svh:705) [UVM/REPORT/CATCHER]
--- UVM Report catcher Summary ---
chip_csr_aliasing 4304861156542368807020306582138013391964324827439588872019520703867706697406 136
UVM_INFO @ 0.000000 us: (uvm_report_catcher.svh:705) [UVM/REPORT/CATCHER]
--- UVM Report catcher Summary ---
chip_same_csr_outstanding 44748499756158450107227910020283357439632815916718700003906239026555924818980 136
UVM_INFO @ 0.000000 us: (uvm_report_catcher.svh:705) [UVM/REPORT/CATCHER]
--- UVM Report catcher Summary ---
UVM_ERROR @ * us: (chip_sw_keymgr_dpe_key_derivation_vseq.sv:91) [chip_sw_keymgr_dpe_key_derivation_vseq] Check failed stage_*_key == get_otp_root_key() (* [*] vs * [*]) Expecting boot stage * key to equal creator root key (UDS) from OTP 2 test runs
chip_sw_keymgr_dpe_key_derivation 83609664972195252837445581148418540404385211633264401668645288697158522619914 340
UVM_INFO @ 304.818000 us: (uvm_report_catcher.svh:705) [UVM/REPORT/CATCHER]
--- UVM Report catcher Summary ---
chip_sw_keymgr_dpe_key_derivation_prod 95094629545380658338585522291256874228674665891616430681176449920518058731117 340
UVM_INFO @ 304.738000 us: (uvm_report_catcher.svh:705) [UVM/REPORT/CATCHER]
--- UVM Report catcher Summary ---
UVM_ERROR @ * us: (jtag_riscv_driver.sv:221) [jtag_riscv_agent_pkg] Check failed sbcs_val[SbAccess32] == * (* [*] vs * [*]) expect SBA width to be * bits! 2 test runs
chip_jtag_csr_rw 39482108072857253747826381067205773706062083306193793218280473729882590530961 5956
UVM_INFO @ 132.376000 us: (uvm_report_catcher.svh:705) [UVM/REPORT/CATCHER]
--- UVM Report catcher Summary ---
chip_jtag_mem_access 40415127119386098618841664196641233958241875770900420299552102667151605435158 5956
UVM_INFO @ 131.488000 us: (uvm_report_catcher.svh:705) [UVM/REPORT/CATCHER]
--- UVM Report catcher Summary ---
UVM_FATAL @ * us: (mem_bkdr_util.sv:658) [mem_bkdr_util[Rom0]] file example_test_from_rom_rom_prog_sim_dv.*.scr.vmem could not be opened for r mode 1 test run
chip_sw_example_rom 41480954143140866097851367707366539337562939414614432290400480061005156502011 284
UVM_INFO @ 10.400001 us: (uvm_report_catcher.svh:705) [UVM/REPORT/CATCHER]
--- UVM Report catcher Summary ---
UVM_ERROR @ * us: (sw_logger_if.sv:526) [all_escalation_resets_test_sim_dv(sw/device/lib/testing/alert_handler_testutils.c:78)] CHECK-fail: word_index < dump_size 1 test run
chip_sw_all_escalation_resets 110984528222881096809124867730546009376364891109397749110152697641205189934840 350
UVM_INFO @ 943.642000 us: (uvm_report_catcher.svh:705) [UVM/REPORT/CATCHER]
--- UVM Report catcher Summary ---
UVM_FATAL @ * us: (sec_cm_pkg.sv:48) [sec_cm_pkg::find_sec_cm_if_proxy] no proxy with path *rstmgr_aon.u_d0_spi_host*.leaf_rst_path 1 test run
chip_sw_rstmgr_rst_cnsty_escalation 5876518657819624690517327654734755807761377834519444311047598452814569814837 313
UVM_INFO @ 10.180001 us: (uvm_report_catcher.svh:705) [UVM/REPORT/CATCHER]
--- UVM Report catcher Summary ---
UVM_ERROR @ * us: (sw_logger_if.sv:526) [spi_passthrough_test_sim_dv(sw/device/tests/sim_dv/spi_passthrough_test.c:382)] CHECK-fail: irq == kDtSpiDeviceIrqUploadCmdfifoNotEmpty 1 test run
chip_sw_spi_device_pass_through_collision 51042222679576368517708537863744897289776458427878425025095534195126196019716 334
UVM_INFO @ 213.058000 us: (uvm_report_catcher.svh:705) [UVM/REPORT/CATCHER]
--- UVM Report catcher Summary ---
Offending '(!$fell(lc_ctrl_pkg::lc_tx_test_true_strict(lc_init_done_o)))' 1 test run
chip_sw_otp_ctrl_escalation 18834182762876205285275845656359154109616861384153083324777335122974874613476 328
UVM_ERROR @ 177.120000 us: (lc_ctrl.sv:884) [ASSERT FAILED] LcInitDoneSticky_A
UVM_INFO @ 177.120000 us: (uvm_report_catcher.svh:705) [UVM/REPORT/CATCHER]
--- UVM Report catcher Summary ---
UVM_ERROR @ * us: (sw_logger_if.sv:526) [rstmgr_alert_info_test_sim_dv(sw/device/lib/testing/alert_handler_testutils.c:78)] CHECK-fail: word_index < dump_size 1 test run
chip_sw_rstmgr_alert_info 105294538735508104686805370199584418172144628561751468144311307980947917478157 342
UVM_INFO @ 331.075000 us: (uvm_report_catcher.svh:705) [UVM/REPORT/CATCHER]
--- UVM Report catcher Summary ---
UVM_ERROR @ * us: (chip_sw_soc_proxy_smoke_vseq.sv:36) [chip_env_pkg::\chip_sw_soc_proxy_smoke_vseq::body ] Resets did not complete within required time! 1 test run
chip_sw_soc_proxy_smoketest 61671904742784796970002736609895790442410562083529836722403549296732214843035 321
UVM_INFO @ 156.176000 us: (uvm_report_catcher.svh:705) [UVM/REPORT/CATCHER]
--- UVM Report catcher Summary ---
UVM_ERROR @ * us: (sw_logger_if.sv:526) [soc_proxy_external_wakeup_sim_dv(sw/device/tests/soc_proxy_external_wakeup.c:50)] DIF-fail: dif_pwrmgr_get_request_sources(&pwrmgr, kDifPwrmgrReqTypeWakeup, &wakeup_req_srcs) returns * 1 test run
chip_sw_soc_proxy_external_wakeup 52515278849147531834596802089398690016429976032540031396364264183778626914857 319
UVM_INFO @ 157.926000 us: (uvm_report_catcher.svh:705) [UVM/REPORT/CATCHER]
--- UVM Report catcher Summary ---
UVM_ERROR @ * us: (sw_logger_if.sv:526) [aon_timer_irq_test_sim_dv(sw/device/tests/aon_timer_irq_test.c:139)] CHECK-fail: Timer took * usec which is not in the range * usec and * usec 1 test run
chip_sw_aon_timer_irq 110730093049548885232339286111203149865673651797246665005850732020115961474016 320
UVM_INFO @ 522.248000 us: (uvm_report_catcher.svh:705) [UVM/REPORT/CATCHER]
--- UVM Report catcher Summary ---
UVM_ERROR @ * us: (sw_logger_if.sv:526) [aon_timer_wdog_bite_reset_test_sim_dv(sw/device/tests/aon_timer_wdog_bite_reset_test.c:84)] CHECK-fail: Wdog bark irq did not rise after * microseconds 1 test run
chip_sw_aon_timer_wdog_bite_reset 51243156615639886243602433281775676803707789824518173783120978730827767136514 321
UVM_INFO @ 182.643000 us: (uvm_report_catcher.svh:705) [UVM/REPORT/CATCHER]
--- UVM Report catcher Summary ---
UVM_ERROR @ * us: (sw_logger_if.sv:526) [rv_core_ibex_nmi_irq_test_sim_dv(sw/device/tests/rv_core_ibex_nmi_irq_test.c:172)] CHECK-fail: Timed out after * usec (* CPU cycles) waiting for nmi_fired 1 test run
chip_sw_rv_core_ibex_nmi_irq 40596698747506632550715047901049413659853712643637211787099437276872291320899 322
UVM_INFO @ 269.292000 us: (uvm_report_catcher.svh:705) [UVM/REPORT/CATCHER]
--- UVM Report catcher Summary ---
Offending '(tl_h_i[*].a_source[(IDW - *)-:STIDW] == '0)' 1 test run
chip_tl_errors 8301956404164504505828269206368068464300423068718226276914144119913574461051 232
UVM_ERROR @ 117.756000 us: (tlul_socket_m1.sv:101) [ASSERT FAILED] idInRange
UVM_INFO @ 117.756000 us: (uvm_report_catcher.svh:705) [UVM/REPORT/CATCHER]
--- UVM Report catcher Summary ---
Error-[CNST-CIF] Constraints inconsistency failure 1 test run
chip_padctrl_attributes 109415230791648968477355615789214673757407970910859362889720464804847240022289 281
src/lowrisc_dv_dv_lib_0/dv_base_test.sv, 143
Constraints are inconsistent and cannot be solved.
Please check the inconsistent constraints being printed above and rewrite
them.
UVM_ERROR @ * us: (sw_logger_if.sv:526) [dma_abort_sim_dv(sw/device/tests/dma_abort.c:77)] CHECK-fail: Timed out after * usec (* CPU cycles) waiting for kSoftwareBarrier == * 1 test run
chip_sw_dma_abort 70566310463038772761849117656158407695478034272431592066784682554044364071544 325
UVM_INFO @ 211.741000 us: (uvm_report_catcher.svh:705) [UVM/REPORT/CATCHER]
--- UVM Report catcher Summary ---