Simulation Results: chip

 
11/08/2026 19:53:31 DVSim: v1.50.1 sha: 49df6ac json Branch: master Tool: vcs [unknown]
Coverage statistics
  • Total
  • 65.02 %
  • code
  • 62.56 %
  • assert
  • 76.58 %
  • func
  • 55.93 %
  • line
  • 67.12 %
  • branch
  • 75.60 %
  • cond
  • 67.68 %
  • toggle
  • 45.26 %
  • FSM
  • 57.14 %
Validation stages
V1
27.27%
V2
32.16%
V2S
100.00%
V3
0.00%
unmapped
40.00%
Testpoint Test Max Runtime Sim Time Pass Total %
chip_sw_uart_tx_rx 0 1 0.00
chip_sw_uart_tx_rx 11.020s 0.000us 0 1 0.00
chip_sw_uart_rx_overflow 0 1 0.00
chip_sw_uart_tx_rx 11.020s 0.000us 0 1 0.00
chip_sw_uart_rand_baudrate 0 1 0.00
chip_sw_uart_rand_baudrate 35.443s 0.000us 0 1 0.00
chip_sw_uart_tx_rx_alt_clk_freq 0 1 0.00
chip_sw_uart_tx_rx_alt_clk_freq 19.356s 0.000us 0 1 0.00
chip_sw_gpio_out 1 1 100.00
chip_sw_gpio 338.900s 288.727us 1 1 100.00
chip_sw_gpio_in 1 1 100.00
chip_sw_gpio 338.900s 288.727us 1 1 100.00
chip_sw_gpio_irq 1 1 100.00
chip_sw_gpio 338.900s 288.727us 1 1 100.00
chip_sw_example_tests 1 4 25.00
chip_sw_example_rom 37.590s 10.320us 0 1 0.00
chip_sw_example_manufacturer 8.577s 0.000us 0 1 0.00
chip_sw_example_concurrency 237.540s 168.759us 1 1 100.00
chip_sw_uart_smoketest_signed 8.352s 0.000us 0 1 0.00
csr_bit_bash 0 1 0.00
chip_csr_bit_bash 8.960s 0.000us 0 1 0.00
csr_aliasing 0 1 0.00
chip_csr_aliasing 8.550s 0.000us 0 1 0.00
regwen_csr_and_corresponding_lockable_csr 0 1 0.00
chip_csr_aliasing 8.550s 0.000us 0 1 0.00
xbar_smoke 1 1 100.00
xbar_smoke 10.220s 12.980us 1 1 100.00
Testpoint Test Max Runtime Sim Time Pass Total %
chip_sw_spi_device_flash_mode 0 1 0.00
chip_sw_uart_tx_rx_bootstrap 85.675s 0.000us 0 1 0.00
chip_sw_spi_device_pass_through 1 1 100.00
chip_sw_spi_device_pass_through 2467.260s 3789.719us 1 1 100.00
chip_sw_spi_device_pass_through_collision 0 1 0.00
chip_sw_spi_device_pass_through_collision 3600.165s 0.000us 0 1 0.00
chip_sw_spi_device_tpm 0 1 0.00
chip_sw_spi_device_tpm 14.330s 0.000us 0 1 0.00
chip_sw_spi_host_tx_rx 0 1 0.00
chip_sw_spi_host_tx_rx 9.139s 0.000us 0 1 0.00
chip_sw_i2c_host_tx_rx 0 1 0.00
chip_sw_i2c_host_tx_rx 10.022s 0.000us 0 1 0.00
chip_sw_i2c_device_tx_rx 0 1 0.00
chip_sw_i2c_device_tx_rx 9.234s 0.000us 0 1 0.00
chip_pin_mux 0 1 0.00
chip_padctrl_attributes 2.590s 0.000us 0 1 0.00
chip_padctrl_attributes 0 1 0.00
chip_padctrl_attributes 2.590s 0.000us 0 1 0.00
chip_sw_sleep_pin_wake 0 1 0.00
chip_sw_sleep_pin_wake 18.613s 0.000us 0 1 0.00
chip_sw_sleep_pin_retention 0 1 0.00
chip_sw_sleep_pin_retention 19.941s 0.000us 0 1 0.00
chip_sw_data_integrity 0 1 0.00
chip_sw_data_integrity_escalation 8.960s 0.000us 0 1 0.00
chip_sw_instruction_integrity 0 1 0.00
chip_sw_data_integrity_escalation 8.960s 0.000us 0 1 0.00
chip_jtag_csr_rw 0 1 0.00
chip_jtag_csr_rw 120.120s 130.727us 0 1 0.00
chip_jtag_mem_access 0 1 0.00
chip_jtag_mem_access 116.650s 131.278us 0 1 0.00
chip_rv_dm_ndm_reset_req 1 1 100.00
chip_rv_dm_ndm_reset_req 390.510s 310.248us 1 1 100.00
chip_sw_rv_dm_ndm_reset_req_when_cpu_halted 0 1 0.00
chip_sw_rv_dm_ndm_reset_req_when_cpu_halted 10.948s 0.000us 0 1 0.00
chip_rv_dm_access_after_wakeup 0 1 0.00
chip_sw_rv_dm_access_after_wakeup 9.253s 0.000us 0 1 0.00
chip_rv_dm_lc_disabled 0 1 0.00
chip_rv_dm_lc_disabled 84.290s 125.736us 0 1 0.00
chip_sw_timer 1 1 100.00
chip_sw_rv_timer_irq 275.400s 266.883us 1 1 100.00
chip_sw_aon_timer_wakeup_irq 0 1 0.00
chip_sw_aon_timer_irq 543.340s 564.285us 0 1 0.00
chip_sw_aon_timer_wdog_bark_irq 0 1 0.00
chip_sw_aon_timer_irq 543.340s 564.285us 0 1 0.00
chip_sw_aon_timer_wdog_lc_escalate 1 1 100.00
chip_sw_aon_timer_wdog_lc_escalate 459.390s 386.458us 1 1 100.00
chip_sw_aon_timer_wdog_bite_reset 0 1 0.00
chip_sw_aon_timer_wdog_bite_reset 240.400s 182.523us 0 1 0.00
chip_sw_aon_timer_sleep_wdog_bite_reset 0 1 0.00
chip_sw_aon_timer_wdog_bite_reset 240.400s 182.523us 0 1 0.00
chip_sw_aon_timer_sleep_wdog_sleep_pause 1 1 100.00
chip_sw_aon_timer_sleep_wdog_sleep_pause 384.570s 2310.324us 1 1 100.00
chip_sw_plic_sw_irq 1 1 100.00
chip_sw_plic_sw_irq 198.770s 164.289us 1 1 100.00
chip_sw_clkmgr_idle_trans 4 4 100.00
chip_sw_otbn_randomness 315.900s 245.074us 1 1 100.00
chip_sw_aes_idle 188.880s 165.843us 1 1 100.00
chip_sw_hmac_enc_idle 242.350s 178.105us 1 1 100.00
chip_sw_kmac_idle 201.740s 164.005us 1 1 100.00
chip_sw_clkmgr_off_trans 0 4 0.00
chip_sw_clkmgr_off_aes_trans 213.850s 185.344us 0 1 0.00
chip_sw_clkmgr_off_hmac_trans 240.550s 185.312us 0 1 0.00
chip_sw_clkmgr_off_kmac_trans 212.140s 185.264us 0 1 0.00
chip_sw_clkmgr_off_otbn_trans 240.230s 185.264us 0 1 0.00
chip_sw_clkmgr_jitter 1 7 14.29
chip_sw_otbn_ecdsa_op_irq_jitter_en 39.710s 10.100us 0 1 0.00
chip_sw_aes_enc_jitter_en 42.070s 10.340us 0 1 0.00
chip_sw_hmac_enc_jitter_en 47.450s 10.280us 0 1 0.00
chip_sw_keymgr_dpe_key_derivation_jitter_en 39.690s 10.100us 0 1 0.00
chip_sw_kmac_mode_kmac_jitter_en 44.370s 10.260us 0 1 0.00
chip_sw_sram_ctrl_scrambled_access_jitter_en 8.708s 0.000us 0 1 0.00
chip_sw_clkmgr_jitter 206.130s 161.150us 1 1 100.00
chip_sw_clkmgr_extended_range 1 8 12.50
chip_sw_clkmgr_jitter_reduced_freq 470.640s 1962.899us 1 1 100.00
chip_sw_otbn_ecdsa_op_irq_jitter_en_reduced_freq 39.080s 10.360us 0 1 0.00
chip_sw_aes_enc_jitter_en_reduced_freq 46.540s 10.360us 0 1 0.00
chip_sw_hmac_enc_jitter_en_reduced_freq 40.760s 10.260us 0 1 0.00
chip_sw_keymgr_dpe_key_derivation_jitter_en_reduced_freq 42.910s 10.320us 0 1 0.00
chip_sw_kmac_mode_kmac_jitter_en_reduced_freq 43.760s 10.200us 0 1 0.00
chip_sw_sram_ctrl_scrambled_access_jitter_en_reduced_freq 39.680s 10.400us 0 1 0.00
chip_sw_csrng_edn_concurrency_reduced_freq 38.960s 10.180us 0 1 0.00
chip_sw_clkmgr_deep_sleep_frequency 0 1 0.00
chip_sw_ast_clk_outputs 15.240s 0.000us 0 1 0.00
chip_sw_clkmgr_sleep_frequency 0 1 0.00
chip_sw_clkmgr_sleep_frequency 10.994s 0.000us 0 1 0.00
chip_sw_clkmgr_reset_frequency 0 1 0.00
chip_sw_clkmgr_reset_frequency 11.417s 0.000us 0 1 0.00
chip_sw_clkmgr_escalation_reset 0 1 0.00
chip_sw_all_escalation_resets 1147.740s 943.602us 0 1 0.00
chip_sw_pwrmgr_external_full_reset 0 1 0.00
chip_sw_pwrmgr_full_aon_reset 127.160s 118.472us 0 1 0.00
chip_sw_pwrmgr_sleep_all_reset_reqs 0 1 0.00
chip_sw_aon_timer_wdog_bite_reset 240.400s 182.523us 0 1 0.00
chip_sw_pwrmgr_wdog_reset 0 1 0.00
chip_sw_pwrmgr_wdog_reset 9.705s 0.000us 0 1 0.00
chip_sw_pwrmgr_power_glitch_reset 0 1 0.00
chip_sw_pwrmgr_full_aon_reset 127.160s 118.472us 0 1 0.00
chip_sw_pwrmgr_main_power_glitch_reset 0 1 0.00
chip_sw_pwrmgr_main_power_glitch_reset 15.550s 0.000us 0 1 0.00
chip_sw_pwrmgr_random_sleep_power_glitch_reset 0 1 0.00
chip_sw_pwrmgr_random_sleep_power_glitch_reset 40.125s 0.000us 0 1 0.00
chip_sw_pwrmgr_deep_sleep_power_glitch_reset 0 1 0.00
chip_sw_pwrmgr_deep_sleep_power_glitch_reset 13.680s 0.000us 0 1 0.00
chip_sw_pwrmgr_sleep_power_glitch_reset 0 1 0.00
chip_sw_pwrmgr_sleep_power_glitch_reset 13.113s 0.000us 0 1 0.00
chip_sw_pwrmgr_sleep_disabled 0 1 0.00
chip_sw_pwrmgr_sleep_disabled 13.078s 0.000us 0 1 0.00
chip_sw_pwrmgr_escalation_reset 0 1 0.00
chip_sw_all_escalation_resets 1147.740s 943.602us 0 1 0.00
chip_sw_rstmgr_sys_reset_info 1 1 100.00
chip_rv_dm_ndm_reset_req 390.510s 310.248us 1 1 100.00
chip_sw_rstmgr_cpu_info 0 1 0.00
chip_sw_rstmgr_cpu_info 457.080s 412.064us 0 1 0.00
chip_sw_rstmgr_sw_req_reset 1 1 100.00
chip_sw_rstmgr_sw_req 359.150s 305.416us 1 1 100.00
chip_sw_rstmgr_alert_info 0 1 0.00
chip_sw_rstmgr_alert_info 373.580s 331.207us 0 1 0.00
chip_sw_rstmgr_sw_rst 1 1 100.00
chip_sw_rstmgr_sw_rst 205.900s 163.656us 1 1 100.00
chip_sw_rstmgr_escalation_reset 0 1 0.00
chip_sw_all_escalation_resets 1147.740s 943.602us 0 1 0.00
chip_sw_alert_handler_alerts 0 1 0.00
chip_sw_alert_test 9.463s 0.000us 0 1 0.00
chip_sw_alert_handler_escalations 0 1 0.00
chip_sw_alert_handler_escalation 23.316s 0.000us 0 1 0.00
chip_sw_all_escalation_resets 0 1 0.00
chip_sw_all_escalation_resets 1147.740s 943.602us 0 1 0.00
chip_sw_alert_handler_entropy 0 1 0.00
chip_sw_alert_handler_entropy 14.288s 0.000us 0 1 0.00
chip_sw_alert_handler_crashdump 0 1 0.00
chip_sw_rstmgr_alert_info 373.580s 331.207us 0 1 0.00
chip_sw_alert_handler_ping_timeout 1 1 100.00
chip_sw_alert_handler_ping_timeout 366.010s 372.243us 1 1 100.00
chip_sw_alert_handler_lpg_sleep_mode_alerts 0 1 0.00
chip_sw_alert_handler_lpg_sleep_mode_alerts 63.228s 0.000us 0 1 0.00
chip_sw_alert_handler_lpg_sleep_mode_pings 0 1 0.00
chip_sw_alert_handler_lpg_sleep_mode_pings 74.780s 0.000us 0 1 0.00
chip_sw_alert_handler_lpg_clock_off 0 1 0.00
chip_sw_alert_handler_lpg_clkoff 69.544s 0.000us 0 1 0.00
chip_sw_alert_handler_lpg_reset_toggle 0 1 0.00
chip_sw_alert_handler_lpg_reset_toggle 95.525s 0.000us 0 1 0.00
chip_sw_alert_handler_reverse_ping_in_deep_sleep 0 1 0.00
chip_sw_alert_handler_reverse_ping_in_deep_sleep 70.261s 0.000us 0 1 0.00
chip_sw_lc_ctrl_alert_handler_escalation 0 1 0.00
chip_sw_alert_handler_escalation 23.316s 0.000us 0 1 0.00
chip_sw_lc_ctrl_jtag_access 0 1 0.00
chip_sw_lc_ctrl_transition 9.064s 0.000us 0 1 0.00
chip_sw_lc_ctrl_otp_hw_cfg 0 1 0.00
chip_sw_lc_ctrl_otp_hw_cfg 12.730s 0.000us 0 1 0.00
chip_sw_lc_ctrl_init 0 1 0.00
chip_sw_lc_ctrl_transition 9.064s 0.000us 0 1 0.00
chip_sw_lc_ctrl_transitions 0 1 0.00
chip_sw_lc_ctrl_transition 9.064s 0.000us 0 1 0.00
chip_sw_lc_ctrl_kmac_req 0 1 0.00
chip_sw_lc_ctrl_transition 9.064s 0.000us 0 1 0.00
chip_sw_lc_ctrl_key_div 1 1 100.00
chip_sw_keymgr_dpe_key_derivation_prod 443.440s 359.436us 1 1 100.00
chip_sw_lc_ctrl_broadcast 1 10 10.00
chip_sw_otp_ctrl_lc_signals_test_unlocked0 10.378s 0.000us 0 1 0.00
chip_sw_otp_ctrl_lc_signals_dev 13.913s 0.000us 0 1 0.00
chip_sw_otp_ctrl_lc_signals_prod 9.618s 0.000us 0 1 0.00
chip_sw_otp_ctrl_lc_signals_rma 9.835s 0.000us 0 1 0.00
chip_sw_lc_ctrl_transition 9.064s 0.000us 0 1 0.00
chip_sw_keymgr_dpe_key_derivation 411.090s 351.409us 1 1 100.00
chip_sw_rom_ctrl_integrity_check 192.870s 157.272us 0 1 0.00
chip_sw_sram_ctrl_execution_main 9.133s 0.000us 0 1 0.00
chip_prim_tl_access 79.020s 118.328us 0 1 0.00
chip_rv_dm_lc_disabled 84.290s 125.736us 0 1 0.00
chip_sw_aes_enc 1 2 50.00
chip_sw_aes_enc 232.690s 173.125us 1 1 100.00
chip_sw_aes_enc_jitter_en 42.070s 10.340us 0 1 0.00
chip_sw_aes_gcm 1 2 50.00
chip_sw_aes_enc 232.690s 173.125us 1 1 100.00
chip_sw_aes_enc_jitter_en 42.070s 10.340us 0 1 0.00
chip_sw_aes_entropy 1 1 100.00
chip_sw_aes_entropy 197.100s 164.506us 1 1 100.00
chip_sw_aes_idle 1 1 100.00
chip_sw_aes_idle 188.880s 165.843us 1 1 100.00
chip_sw_hmac_enc 1 2 50.00
chip_sw_hmac_enc 199.420s 173.693us 1 1 100.00
chip_sw_hmac_enc_jitter_en 47.450s 10.280us 0 1 0.00
chip_sw_hmac_idle 1 1 100.00
chip_sw_hmac_enc_idle 242.350s 178.105us 1 1 100.00
chip_sw_kmac_enc 2 3 66.67
chip_sw_kmac_mode_cshake 210.300s 167.304us 1 1 100.00
chip_sw_kmac_mode_kmac 248.470s 188.902us 1 1 100.00
chip_sw_kmac_mode_kmac_jitter_en 44.370s 10.260us 0 1 0.00
chip_sw_kmac_app_keymgr 1 1 100.00
chip_sw_keymgr_dpe_key_derivation 411.090s 351.409us 1 1 100.00
chip_sw_kmac_app_lc 0 1 0.00
chip_sw_lc_ctrl_transition 9.064s 0.000us 0 1 0.00
chip_sw_kmac_app_rom 0 1 0.00
chip_sw_kmac_app_rom 14.858s 0.000us 0 1 0.00
chip_sw_kmac_entropy 1 1 100.00
chip_sw_kmac_entropy 336.930s 228.886us 1 1 100.00
chip_sw_kmac_idle 1 1 100.00
chip_sw_kmac_idle 201.740s 164.005us 1 1 100.00
chip_sw_entropy_src_csrng 1 1 100.00
chip_sw_entropy_src_csrng 1706.420s 2224.047us 1 1 100.00
chip_sw_csrng_edn_cmd 1 1 100.00
chip_sw_entropy_src_csrng 1706.420s 2224.047us 1 1 100.00
chip_sw_csrng_fuse_en_sw_app_read 0 1 0.00
chip_sw_csrng_fuse_en_sw_app_read_test 11.157s 0.000us 0 1 0.00
chip_sw_csrng_known_answer_tests 1 1 100.00
chip_sw_csrng_kat_test 234.890s 175.996us 1 1 100.00
chip_sw_edn_entropy_reqs 1 1 100.00
chip_sw_csrng_edn_concurrency 2620.880s 1709.850us 1 1 100.00
chip_sw_keymgr_dpe_key_derivation 1 2 50.00
chip_sw_keymgr_dpe_key_derivation 411.090s 351.409us 1 1 100.00
chip_sw_keymgr_dpe_key_derivation_jitter_en 39.690s 10.100us 0 1 0.00
chip_sw_otbn_op 1 2 50.00
chip_sw_otbn_ecdsa_op_irq 3288.470s 1498.397us 1 1 100.00
chip_sw_otbn_ecdsa_op_irq_jitter_en 39.710s 10.100us 0 1 0.00
chip_sw_otbn_rnd_entropy 1 1 100.00
chip_sw_otbn_randomness 315.900s 245.074us 1 1 100.00
chip_sw_otbn_urnd_entropy 1 1 100.00
chip_sw_otbn_randomness 315.900s 245.074us 1 1 100.00
chip_sw_otbn_idle 1 1 100.00
chip_sw_otbn_randomness 315.900s 245.074us 1 1 100.00
chip_sw_otbn_mem_scramble 1 1 100.00
chip_sw_otbn_mem_scramble 468.780s 280.496us 1 1 100.00
chip_sw_rom_access 0 1 0.00
chip_sw_rom_ctrl_integrity_check 192.870s 157.272us 0 1 0.00
chip_sw_rom_ctrl_integrity_check 0 1 0.00
chip_sw_rom_ctrl_integrity_check 192.870s 157.272us 0 1 0.00
chip_sw_sram_scrambled_access 1 2 50.00
chip_sw_sram_ctrl_scrambled_access 434.650s 358.358us 1 1 100.00
chip_sw_sram_ctrl_scrambled_access_jitter_en 8.708s 0.000us 0 1 0.00
chip_sw_sram_execution 0 1 0.00
chip_sw_sram_ctrl_execution_main 9.133s 0.000us 0 1 0.00
chip_sw_sram_lc_escalation 0 2 0.00
chip_sw_all_escalation_resets 1147.740s 943.602us 0 1 0.00
chip_sw_data_integrity_escalation 8.960s 0.000us 0 1 0.00
chip_otp_ctrl_init 0 1 0.00
chip_sw_lc_ctrl_transition 9.064s 0.000us 0 1 0.00
chip_sw_otp_ctrl_keys 4 4 100.00
chip_sw_otbn_mem_scramble 468.780s 280.496us 1 1 100.00
chip_sw_keymgr_dpe_key_derivation 411.090s 351.409us 1 1 100.00
chip_sw_sram_ctrl_scrambled_access 434.650s 358.358us 1 1 100.00
chip_sw_rv_core_ibex_icache_invalidate 241.690s 187.107us 1 1 100.00
chip_sw_otp_ctrl_entropy 4 4 100.00
chip_sw_otbn_mem_scramble 468.780s 280.496us 1 1 100.00
chip_sw_keymgr_dpe_key_derivation 411.090s 351.409us 1 1 100.00
chip_sw_sram_ctrl_scrambled_access 434.650s 358.358us 1 1 100.00
chip_sw_rv_core_ibex_icache_invalidate 241.690s 187.107us 1 1 100.00
chip_sw_otp_ctrl_program 0 1 0.00
chip_sw_lc_ctrl_transition 9.064s 0.000us 0 1 0.00
chip_sw_otp_ctrl_program_error 0 1 0.00
chip_sw_lc_ctrl_program_error 13.285s 0.000us 0 1 0.00
chip_sw_otp_ctrl_hw_cfg 0 1 0.00
chip_sw_lc_ctrl_otp_hw_cfg 12.730s 0.000us 0 1 0.00
chip_sw_otp_ctrl_lc_signals 0 6 0.00
chip_sw_otp_ctrl_lc_signals_test_unlocked0 10.378s 0.000us 0 1 0.00
chip_sw_otp_ctrl_lc_signals_dev 13.913s 0.000us 0 1 0.00
chip_sw_otp_ctrl_lc_signals_prod 9.618s 0.000us 0 1 0.00
chip_sw_otp_ctrl_lc_signals_rma 9.835s 0.000us 0 1 0.00
chip_sw_lc_ctrl_transition 9.064s 0.000us 0 1 0.00
chip_prim_tl_access 79.020s 118.328us 0 1 0.00
chip_sw_otp_prim_tl_access 0 1 0.00
chip_prim_tl_access 79.020s 118.328us 0 1 0.00
chip_sw_otp_ctrl_nvm_cnt 0 1 0.00
chip_sw_otp_ctrl_nvm_cnt 33.008s 0.000us 0 1 0.00
chip_sw_otp_ctrl_sw_parts 0 1 0.00
chip_sw_otp_ctrl_sw_parts 28.616s 0.000us 0 1 0.00
chip_sw_ast_clk_outputs 0 1 0.00
chip_sw_ast_clk_outputs 15.240s 0.000us 0 1 0.00
chip_sw_ast_sys_clk_jitter 1 7 14.29
chip_sw_otbn_ecdsa_op_irq_jitter_en 39.710s 10.100us 0 1 0.00
chip_sw_aes_enc_jitter_en 42.070s 10.340us 0 1 0.00
chip_sw_hmac_enc_jitter_en 47.450s 10.280us 0 1 0.00
chip_sw_keymgr_dpe_key_derivation_jitter_en 39.690s 10.100us 0 1 0.00
chip_sw_kmac_mode_kmac_jitter_en 44.370s 10.260us 0 1 0.00
chip_sw_sram_ctrl_scrambled_access_jitter_en 8.708s 0.000us 0 1 0.00
chip_sw_clkmgr_jitter 206.130s 161.150us 1 1 100.00
chip_sw_soc_proxy_external_reset_requests 0 1 0.00
chip_sw_soc_proxy_smoketest 200.360s 156.160us 0 1 0.00
chip_sw_soc_proxy_external_irqs 0 1 0.00
chip_sw_soc_proxy_smoketest 200.360s 156.160us 0 1 0.00
chip_sw_soc_proxy_external_wakeup_requests 0 1 0.00
chip_sw_soc_proxy_external_wakeup 195.370s 157.833us 0 1 0.00
chip_sw_soc_proxy_gpios 1 1 100.00
chip_sw_soc_proxy_gpios 211.390s 172.006us 1 1 100.00
chip_sw_nmi_irq 0 1 0.00
chip_sw_rv_core_ibex_nmi_irq 385.410s 269.312us 0 1 0.00
chip_sw_rv_core_ibex_rnd 1 1 100.00
chip_sw_rv_core_ibex_rnd 258.350s 197.145us 1 1 100.00
chip_sw_rv_core_ibex_address_translation 1 1 100.00
chip_sw_rv_core_ibex_address_translation 220.080s 179.941us 1 1 100.00
chip_sw_rv_core_ibex_icache_scrambled_access 1 1 100.00
chip_sw_rv_core_ibex_icache_invalidate 241.690s 187.107us 1 1 100.00
chip_sw_rv_core_ibex_fault_dump 0 1 0.00
chip_sw_rstmgr_cpu_info 457.080s 412.064us 0 1 0.00
chip_sw_rv_core_ibex_double_fault 0 1 0.00
chip_sw_rstmgr_cpu_info 457.080s 412.064us 0 1 0.00
chip_sw_smoketest 14 14 100.00
chip_sw_aes_smoketest 218.210s 173.164us 1 1 100.00
chip_sw_aon_timer_smoketest 224.880s 182.263us 1 1 100.00
chip_sw_clkmgr_smoketest 203.240s 162.138us 1 1 100.00
chip_sw_csrng_smoketest 211.280s 164.202us 1 1 100.00
chip_sw_gpio_smoketest 235.410s 192.836us 1 1 100.00
chip_sw_hmac_smoketest 232.140s 194.809us 1 1 100.00
chip_sw_kmac_smoketest 244.310s 185.492us 1 1 100.00
chip_sw_otbn_smoketest 266.100s 199.817us 1 1 100.00
chip_sw_otp_ctrl_smoketest 206.990s 165.920us 1 1 100.00
chip_sw_rv_plic_smoketest 190.460s 164.002us 1 1 100.00
chip_sw_rv_timer_smoketest 274.690s 266.791us 1 1 100.00
chip_sw_rstmgr_smoketest 195.910s 161.000us 1 1 100.00
chip_sw_sram_ctrl_smoketest 183.390s 164.473us 1 1 100.00
chip_sw_uart_smoketest 222.050s 175.164us 1 1 100.00
chip_sw_rom_functests 0 1 0.00
rom_keymgr_functest 9.001s 0.000us 0 1 0.00
chip_sw_signed 0 1 0.00
chip_sw_uart_smoketest_signed 8.352s 0.000us 0 1 0.00
chip_sw_boot 0 1 0.00
chip_sw_uart_tx_rx_bootstrap 85.675s 0.000us 0 1 0.00
chip_sw_secure_boot 0 1 0.00
base_rom_e2e_smoke 8.355s 0.000us 0 1 0.00
chip_lc_scrap 0 4 0.00
chip_sw_lc_ctrl_rma_to_scrap 217.620s 172.312us 0 1 0.00
chip_sw_lc_ctrl_raw_to_scrap 175.420s 170.776us 0 1 0.00
chip_sw_lc_ctrl_test_locked0_to_scrap 163.970s 168.824us 0 1 0.00
chip_sw_lc_ctrl_rand_to_scrap 163.810s 171.112us 0 1 0.00
chip_lc_test_locked 0 2 0.00
chip_sw_lc_walkthrough_testunlocks 13.594s 0.000us 0 1 0.00
chip_rv_dm_lc_disabled 84.290s 125.736us 0 1 0.00
chip_sw_lc_walkthrough 0 5 0.00
chip_sw_lc_walkthrough_dev 75.990s 0.000us 0 1 0.00
chip_sw_lc_walkthrough_prod 72.137s 0.000us 0 1 0.00
chip_sw_lc_walkthrough_prodend 10.308s 0.000us 0 1 0.00
chip_sw_lc_walkthrough_rma 73.369s 0.000us 0 1 0.00
chip_sw_lc_walkthrough_testunlocks 13.594s 0.000us 0 1 0.00
chip_sw_lc_ctrl_volatile_raw_unlock 0 3 0.00
chip_sw_lc_ctrl_volatile_raw_unlock 401.310s 453.976us 0 1 0.00
chip_sw_lc_ctrl_volatile_raw_unlock_ext_clk_48mhz 375.180s 515.400us 0 1 0.00
rom_volatile_raw_unlock 8.151s 0.000us 0 1 0.00
chip_sw_rom_raw_unlock 0 1 0.00
rom_raw_unlock 18.900s 0.000us 0 1 0.00
chip_sw_exit_test_unlocked_bootstrap 0 1 0.00
chip_sw_exit_test_unlocked_bootstrap 86.802s 0.000us 0 1 0.00
chip_sw_inject_scramble_seed 0 1 0.00
chip_sw_inject_scramble_seed 75.485s 0.000us 0 1 0.00
tl_d_oob_addr_access 0 1 0.00
chip_tl_errors 108.160s 117.811us 0 1 0.00
tl_d_illegal_access 0 1 0.00
chip_tl_errors 108.160s 117.811us 0 1 0.00
tl_d_outstanding_access 0 2 0.00
chip_csr_aliasing 8.550s 0.000us 0 1 0.00
chip_same_csr_outstanding 9.040s 0.000us 0 1 0.00
tl_d_partial_access 0 2 0.00
chip_csr_aliasing 8.550s 0.000us 0 1 0.00
chip_same_csr_outstanding 9.040s 0.000us 0 1 0.00
xbar_base_random_sequence 1 1 100.00
xbar_random 65.060s 149.595us 1 1 100.00
xbar_random_delay 6 6 100.00
xbar_smoke_zero_delays 9.630s 11.893us 1 1 100.00
xbar_smoke_large_delays 251.030s 2536.386us 1 1 100.00
xbar_smoke_slow_rsp 324.340s 2061.211us 1 1 100.00
xbar_random_zero_delays 43.140s 34.937us 1 1 100.00
xbar_random_large_delays 136.460s 1256.230us 1 1 100.00
xbar_random_slow_rsp 1508.050s 9391.391us 1 1 100.00
xbar_unmapped_address 2 2 100.00
xbar_unmapped_addr 166.550s 221.632us 1 1 100.00
xbar_error_and_unmapped_addr 8.920s 15.661us 1 1 100.00
xbar_error_cases 2 2 100.00
xbar_error_random 103.550s 221.008us 1 1 100.00
xbar_error_and_unmapped_addr 8.920s 15.661us 1 1 100.00
xbar_all_access_same_device 2 2 100.00
xbar_access_same_device 103.190s 82.012us 1 1 100.00
xbar_access_same_device_slow_rsp 372.620s 2310.811us 1 1 100.00
xbar_all_hosts_use_same_source_id 1 1 100.00
xbar_same_source 196.250s 399.163us 1 1 100.00
xbar_stress_all 2 2 100.00
xbar_stress_all 933.220s 2025.698us 1 1 100.00
xbar_stress_all_with_error 310.080s 242.648us 1 1 100.00
xbar_stress_with_reset 2 2 100.00
xbar_stress_all_with_rand_reset 1702.030s 859.811us 1 1 100.00
xbar_stress_all_with_reset_error 371.540s 162.885us 1 1 100.00
rom_e2e_smoke 0 1 0.00
rom_e2e_smoke 10.006s 0.000us 0 1 0.00
rom_e2e_shutdown_output 0 1 0.00
rom_e2e_shutdown_output 22.309s 0.000us 0 1 0.00
rom_e2e_shutdown_exception_c 0 1 0.00
rom_e2e_shutdown_exception_c 29.862s 0.000us 0 1 0.00
rom_e2e_boot_policy_valid 0 15 0.00
rom_e2e_boot_policy_valid_a_good_b_good_test_unlocked0 39.442s 0.000us 0 1 0.00
rom_e2e_boot_policy_valid_a_good_b_good_dev 14.883s 0.000us 0 1 0.00
rom_e2e_boot_policy_valid_a_good_b_good_prod 8.719s 0.000us 0 1 0.00
rom_e2e_boot_policy_valid_a_good_b_good_prod_end 32.553s 0.000us 0 1 0.00
rom_e2e_boot_policy_valid_a_good_b_good_rma 21.229s 0.000us 0 1 0.00
rom_e2e_boot_policy_valid_a_good_b_bad_test_unlocked0 41.852s 0.000us 0 1 0.00
rom_e2e_boot_policy_valid_a_good_b_bad_dev 11.216s 0.000us 0 1 0.00
rom_e2e_boot_policy_valid_a_good_b_bad_prod 12.450s 0.000us 0 1 0.00
rom_e2e_boot_policy_valid_a_good_b_bad_prod_end 33.709s 0.000us 0 1 0.00
rom_e2e_boot_policy_valid_a_good_b_bad_rma 14.574s 0.000us 0 1 0.00
rom_e2e_boot_policy_valid_a_bad_b_good_test_unlocked0 53.506s 0.000us 0 1 0.00
rom_e2e_boot_policy_valid_a_bad_b_good_dev 44.989s 0.000us 0 1 0.00
rom_e2e_boot_policy_valid_a_bad_b_good_prod 18.950s 0.000us 0 1 0.00
rom_e2e_boot_policy_valid_a_bad_b_good_prod_end 26.747s 0.000us 0 1 0.00
rom_e2e_boot_policy_valid_a_bad_b_good_rma 16.615s 0.000us 0 1 0.00
rom_e2e_sigverify_always 0 15 0.00
rom_e2e_sigverify_always_a_bad_b_bad_test_unlocked0 62.294s 0.000us 0 1 0.00
rom_e2e_sigverify_always_a_bad_b_bad_dev 29.461s 0.000us 0 1 0.00
rom_e2e_sigverify_always_a_bad_b_bad_prod 20.525s 0.000us 0 1 0.00
rom_e2e_sigverify_always_a_bad_b_bad_prod_end 27.671s 0.000us 0 1 0.00
rom_e2e_sigverify_always_a_bad_b_bad_rma 24.342s 0.000us 0 1 0.00
rom_e2e_sigverify_always_a_bad_b_nothing_test_unlocked0 30.868s 0.000us 0 1 0.00
rom_e2e_sigverify_always_a_bad_b_nothing_dev 20.747s 0.000us 0 1 0.00
rom_e2e_sigverify_always_a_bad_b_nothing_prod 15.145s 0.000us 0 1 0.00
rom_e2e_sigverify_always_a_bad_b_nothing_prod_end 12.663s 0.000us 0 1 0.00
rom_e2e_sigverify_always_a_bad_b_nothing_rma 18.660s 0.000us 0 1 0.00
rom_e2e_sigverify_always_a_nothing_b_bad_test_unlocked0 115.329s 0.000us 0 1 0.00
rom_e2e_sigverify_always_a_nothing_b_bad_dev 21.512s 0.000us 0 1 0.00
rom_e2e_sigverify_always_a_nothing_b_bad_prod 16.309s 0.000us 0 1 0.00
rom_e2e_sigverify_always_a_nothing_b_bad_prod_end 13.004s 0.000us 0 1 0.00
rom_e2e_sigverify_always_a_nothing_b_bad_rma 13.023s 0.000us 0 1 0.00
rom_e2e_asm_init 0 5 0.00
rom_e2e_asm_init_test_unlocked0 58.841s 0.000us 0 1 0.00
rom_e2e_asm_init_dev 9.324s 0.000us 0 1 0.00
rom_e2e_asm_init_prod 8.191s 0.000us 0 1 0.00
rom_e2e_asm_init_prod_end 16.844s 0.000us 0 1 0.00
rom_e2e_asm_init_rma 26.250s 0.000us 0 1 0.00
rom_e2e_keymgr_init 0 3 0.00
rom_e2e_keymgr_init_rom_ext_meas 12.809s 0.000us 0 1 0.00
rom_e2e_keymgr_init_rom_ext_no_meas 39.194s 0.000us 0 1 0.00
rom_e2e_keymgr_init_rom_ext_invalid_meas 14.822s 0.000us 0 1 0.00
rom_e2e_static_critical 0 1 0.00
rom_e2e_static_critical 8.827s 0.000us 0 1 0.00
Testpoint Test Max Runtime Sim Time Pass Total %
chip_sw_aes_masking_off 1 1 100.00
chip_sw_aes_masking_off 241.290s 187.853us 1 1 100.00
chip_sw_rv_core_ibex_lockstep_glitch 1 1 100.00
chip_sw_rv_core_ibex_lockstep_glitch 182.830s 136.228us 1 1 100.00
Testpoint Test Max Runtime Sim Time Pass Total %
chip_rv_dm_perform_debug 0 3 0.00
rom_e2e_jtag_debug_test_unlocked0 17.858s 0.000us 0 1 0.00
rom_e2e_jtag_debug_dev 10.350s 0.000us 0 1 0.00
rom_e2e_jtag_debug_rma 21.328s 0.000us 0 1 0.00
chip_sw_rv_dm_access_after_hw_reset 0 1 0.00
chip_sw_rv_dm_access_after_escalation_reset 11.726s 0.000us 0 1 0.00
chip_sw_plic_alerts 0 1 0.00
chip_sw_all_escalation_resets 1147.740s 943.602us 0 1 0.00
chip_sw_otp_ctrl_vendor_test_csr_access 0 1 0.00
chip_sw_otp_ctrl_vendor_test_csr_access 11.659s 0.000us 0 1 0.00
chip_sw_otp_ctrl_escalation 0 1 0.00
chip_sw_otp_ctrl_escalation 224.020s 176.944us 0 1 0.00
chip_sw_coremark 0 1 0.00
chip_sw_coremark 38.177s 0.000us 0 1 0.00
chip_sw_power_max_load 0 1 0.00
chip_sw_power_virus 77.672s 0.000us 0 1 0.00
rom_e2e_debug 0 3 0.00
rom_e2e_jtag_debug_test_unlocked0 17.858s 0.000us 0 1 0.00
rom_e2e_jtag_debug_dev 10.350s 0.000us 0 1 0.00
rom_e2e_jtag_debug_rma 21.328s 0.000us 0 1 0.00
rom_e2e_jtag_inject 0 3 0.00
rom_e2e_jtag_inject_test_unlocked0 77.182s 0.000us 0 1 0.00
rom_e2e_jtag_inject_dev 73.707s 0.000us 0 1 0.00
rom_e2e_jtag_inject_rma 69.040s 0.000us 0 1 0.00
rom_e2e_self_hash 0 1 0.00
rom_e2e_self_hash 33.887s 0.000us 0 1 0.00
Testpoint Test Max Runtime Sim Time Pass Total %
Unmapped 8 20 40.00
chip_sw_rstmgr_rst_cnsty_escalation 43.750s 10.140us 0 1 0.00
chip_sw_aes_gcm 281.270s 203.482us 1 1 100.00
chip_sw_entropy_src_kat_test 204.050s 163.619us 1 1 100.00
chip_sw_entropy_src_ast_rng_req 183.800s 161.163us 1 1 100.00
chip_plic_all_irqs_0 443.330s 327.695us 1 1 100.00
chip_plic_all_irqs_10 414.870s 300.629us 1 1 100.00
chip_sw_dma_inline_hashing 228.310s 210.336us 1 1 100.00
chip_sw_dma_abort 265.620s 193.352us 0 1 0.00
rom_e2e_sigverify_mod_exp_test_unlocked0_otbn 20.565s 0.000us 0 1 0.00
rom_e2e_sigverify_mod_exp_test_unlocked0_sw 20.573s 0.000us 0 1 0.00
rom_e2e_sigverify_mod_exp_dev_otbn 9.876s 0.000us 0 1 0.00
rom_e2e_sigverify_mod_exp_dev_sw 8.428s 0.000us 0 1 0.00
rom_e2e_sigverify_mod_exp_prod_otbn 8.191s 0.000us 0 1 0.00
rom_e2e_sigverify_mod_exp_prod_sw 8.158s 0.000us 0 1 0.00
rom_e2e_sigverify_mod_exp_prod_end_otbn 8.789s 0.000us 0 1 0.00
rom_e2e_sigverify_mod_exp_prod_end_sw 8.420s 0.000us 0 1 0.00
rom_e2e_sigverify_mod_exp_rma_otbn 8.454s 0.000us 0 1 0.00
rom_e2e_sigverify_mod_exp_rma_sw 8.244s 0.000us 0 1 0.00
chip_sw_entropy_src_smoketest 236.960s 190.727us 1 1 100.00
chip_sw_mbx_smoketest 489.750s 402.761us 1 1 100.00

Error Messages

   Test seed line log context
Some pass patterns missing: ['^TEST PASSED (UVM_)?CHECKS$'] 119 test runs
chip_sw_example_manufacturer 63202529925785026289116546853548687647115781895924135908482808296662466442246 None
Use --verbose_failures to see the command lines of failed build steps.
ERROR: Analysis of target '@@+hooks+manufacturer_test_hooks//:example_test_sim_dv' failed; build aborted: Target @@+hooks+manufacturer_test_hooks//:example_test_sim_dv is incompatible and cannot be built, but was explicitly requested.
Dependency chain:
@@+hooks+manufacturer_test_hooks//:example_test_sim_dv (f2055d) <-- target platform (//toolchain:opentitan_platform) didn't satisfy constraint @@platforms//:incompatible
INFO: Elapsed time: 0.281s, Critical Path: 0.03s
INFO: 1 process: 1 internal.
ERROR: Build did NOT complete successfully
_run_cmd -> had a non-zero return code of 1.
make: *** [/nightly/current_run/opentitan/hw/dv/tools/dvsim/sim.mk:58: sw_build] Error 1
chip_sw_data_integrity_escalation 14540202451148796153047815365363198205043888076545183294124507737321995494486 None
Use --verbose_failures to see the command lines of failed build steps.
ERROR: Analysis of target '//sw/device/tests/sim_dv:data_integrity_escalation_reset_test_sim_dv' failed; build aborted: Target //sw/device/tests/sim_dv:data_integrity_escalation_reset_test_sim_dv is incompatible and cannot be built, but was explicitly requested.
Dependency chain:
//sw/device/tests/sim_dv:data_integrity_escalation_reset_test_sim_dv (f2055d) <-- target platform (//toolchain:opentitan_platform) didn't satisfy constraint @@platforms//:incompatible
INFO: Elapsed time: 0.309s, Critical Path: 0.03s
INFO: 1 process: 1 internal.
ERROR: Build did NOT complete successfully
_run_cmd -> had a non-zero return code of 1.
make: *** [/nightly/current_run/opentitan/hw/dv/tools/dvsim/sim.mk:58: sw_build] Error 1
chip_sw_sleep_pin_wake 82223456911242669539813202176222989624189733195599954610210800103914166605506 None
Use --verbose_failures to see the command lines of failed build steps.
ERROR: Analysis of target '//sw/device/tests:sleep_pin_wake_test_sim_dv' failed; build aborted: Target //sw/device/tests:sleep_pin_wake_test_sim_dv is incompatible and cannot be built, but was explicitly requested.
Dependency chain:
//sw/device/tests:sleep_pin_wake_test_sim_dv (f2055d) <-- target platform (//toolchain:opentitan_platform) didn't satisfy constraint @@platforms//:incompatible
INFO: Elapsed time: 5.490s, Critical Path: 0.00s
INFO: 1 process: 1 internal.
ERROR: Build did NOT complete successfully
_run_cmd -> had a non-zero return code of 1.
make: *** [/nightly/current_run/opentitan/hw/dv/tools/dvsim/sim.mk:58: sw_build] Error 1
chip_sw_sleep_pin_retention 54412667774779494126472705545215400655311803187776545827789167891810771470685 None
Use --verbose_failures to see the command lines of failed build steps.
ERROR: Analysis of target '//sw/device/tests:sleep_pin_retention_test_sim_dv' failed; build aborted: Target //sw/device/tests:sleep_pin_retention_test_sim_dv is incompatible and cannot be built, but was explicitly requested.
Dependency chain:
//sw/device/tests:sleep_pin_retention_test_sim_dv (f2055d) <-- target platform (//toolchain:opentitan_platform) didn't satisfy constraint @@platforms//:incompatible
INFO: Elapsed time: 2.815s, Critical Path: 0.02s
INFO: 1 process: 1 internal.
ERROR: Build did NOT complete successfully
_run_cmd -> had a non-zero return code of 1.
make: *** [/nightly/current_run/opentitan/hw/dv/tools/dvsim/sim.mk:58: sw_build] Error 1
chip_sw_uart_tx_rx 45692228820308379796188268525910797568584074916737816405957654327068730266643 None
Use --verbose_failures to see the command lines of failed build steps.
ERROR: Analysis of target '//sw/device/tests:uart_tx_rx_test_sim_dv' failed; build aborted: Target //sw/device/tests:uart_tx_rx_test_sim_dv is incompatible and cannot be built, but was explicitly requested.
Dependency chain:
//sw/device/tests:uart_tx_rx_test_sim_dv (f2055d) <-- target platform (//toolchain:opentitan_platform) didn't satisfy constraint @@platforms//:incompatible
INFO: Elapsed time: 0.679s, Critical Path: 0.03s
INFO: 1 process: 1 internal.
ERROR: Build did NOT complete successfully
_run_cmd -> had a non-zero return code of 1.
make: *** [/nightly/current_run/opentitan/hw/dv/tools/dvsim/sim.mk:58: sw_build] Error 1
chip_sw_uart_tx_rx_bootstrap 40381358201601556929240612109178449392235047686602228720270251911037221022368 None
Use --verbose_failures to see the command lines of failed build steps.
ERROR: Analysis of target '//sw/device/tests:uart_tx_rx_test_sim_dv' failed; build aborted: Target //sw/device/tests:uart_tx_rx_test_sim_dv is incompatible and cannot be built, but was explicitly requested.
Dependency chain:
//sw/device/tests:uart_tx_rx_test_sim_dv (f2055d) <-- target platform (//toolchain:opentitan_platform) didn't satisfy constraint @@platforms//:incompatible
INFO: Elapsed time: 18.226s, Critical Path: 0.02s
INFO: 1 process: 1 internal.
ERROR: Build did NOT complete successfully
_run_cmd -> had a non-zero return code of 1.
make: *** [/nightly/current_run/opentitan/hw/dv/tools/dvsim/sim.mk:58: sw_build] Error 1
chip_sw_inject_scramble_seed 105322094204860105483798383716753065169682161784013301459498304028555685842863 None
Use --verbose_failures to see the command lines of failed build steps.
ERROR: Analysis of target '//sw/device/tests/sim_dv:inject_scramble_seed_sim_dv' failed; build aborted: Target //sw/device/tests/sim_dv:inject_scramble_seed_sim_dv is incompatible and cannot be built, but was explicitly requested.
Dependency chain:
//sw/device/tests/sim_dv:inject_scramble_seed_sim_dv (f2055d) <-- target platform (//toolchain:opentitan_platform) didn't satisfy constraint @@platforms//:incompatible
INFO: Elapsed time: 2.738s, Critical Path: 0.02s
INFO: 1 process: 1 internal.
ERROR: Build did NOT complete successfully
_run_cmd -> had a non-zero return code of 1.
make: *** [/nightly/current_run/opentitan/hw/dv/tools/dvsim/sim.mk:58: sw_build] Error 1
chip_sw_exit_test_unlocked_bootstrap 99295635193903188119448463534931249804872342849604439082403816004116991711757 None
Use --verbose_failures to see the command lines of failed build steps.
ERROR: Analysis of target '//sw/device/tests/sim_dv:exit_test_unlocked_bootstrap_sim_dv' failed; build aborted: Target //sw/device/tests/sim_dv:exit_test_unlocked_bootstrap_sim_dv is incompatible and cannot be built, but was explicitly requested.
Dependency chain:
//sw/device/tests/sim_dv:exit_test_unlocked_bootstrap_sim_dv (f2055d) <-- target platform (//toolchain:opentitan_platform) didn't satisfy constraint @@platforms//:incompatible
INFO: Elapsed time: 11.859s, Critical Path: 0.02s
INFO: 1 process: 1 internal.
ERROR: Build did NOT complete successfully
_run_cmd -> had a non-zero return code of 1.
make: *** [/nightly/current_run/opentitan/hw/dv/tools/dvsim/sim.mk:58: sw_build] Error 1
chip_sw_uart_rand_baudrate 32216087009696330545800314476395652551677408251452567502644485477947906653688 None
Use --verbose_failures to see the command lines of failed build steps.
ERROR: Analysis of target '//sw/device/tests:uart_tx_rx_test_sim_dv' failed; build aborted: Target //sw/device/tests:uart_tx_rx_test_sim_dv is incompatible and cannot be built, but was explicitly requested.
Dependency chain:
//sw/device/tests:uart_tx_rx_test_sim_dv (f2055d) <-- target platform (//toolchain:opentitan_platform) didn't satisfy constraint @@platforms//:incompatible
INFO: Elapsed time: 14.387s, Critical Path: 0.02s
INFO: 1 process: 1 internal.
ERROR: Build did NOT complete successfully
_run_cmd -> had a non-zero return code of 1.
make: *** [/nightly/current_run/opentitan/hw/dv/tools/dvsim/sim.mk:58: sw_build] Error 1
chip_sw_uart_tx_rx_alt_clk_freq 70852496152135492706162552062839325480438015025202978508273961156755061668670 None
Use --verbose_failures to see the command lines of failed build steps.
ERROR: Analysis of target '//sw/device/tests:uart_tx_rx_test_sim_dv' failed; build aborted: Target //sw/device/tests:uart_tx_rx_test_sim_dv is incompatible and cannot be built, but was explicitly requested.
Dependency chain:
//sw/device/tests:uart_tx_rx_test_sim_dv (f2055d) <-- target platform (//toolchain:opentitan_platform) didn't satisfy constraint @@platforms//:incompatible
INFO: Elapsed time: 8.322s, Critical Path: 0.02s
INFO: 1 process: 1 internal.
ERROR: Build did NOT complete successfully
_run_cmd -> had a non-zero return code of 1.
make: *** [/nightly/current_run/opentitan/hw/dv/tools/dvsim/sim.mk:58: sw_build] Error 1
chip_sw_i2c_host_tx_rx 74273413947499537049971016681499707853579880466679220284400286112751756775859 None
Use --verbose_failures to see the command lines of failed build steps.
ERROR: Analysis of target '//sw/device/tests/sim_dv:i2c_host_tx_rx_test_sim_dv' failed; build aborted: Target //sw/device/tests/sim_dv:i2c_host_tx_rx_test_sim_dv is incompatible and cannot be built, but was explicitly requested.
Dependency chain:
//sw/device/tests/sim_dv:i2c_host_tx_rx_test_sim_dv (f2055d) <-- target platform (//toolchain:opentitan_platform) didn't satisfy constraint @@platforms//:incompatible
INFO: Elapsed time: 0.373s, Critical Path: 0.03s
INFO: 1 process: 1 internal.
ERROR: Build did NOT complete successfully
_run_cmd -> had a non-zero return code of 1.
make: *** [/nightly/current_run/opentitan/hw/dv/tools/dvsim/sim.mk:58: sw_build] Error 1
chip_sw_i2c_device_tx_rx 18943677872861293213814108187635842704028291824650621362520052211787894126108 None
Use --verbose_failures to see the command lines of failed build steps.
ERROR: Analysis of target '//sw/device/tests/sim_dv:i2c_device_tx_rx_test_sim_dv' failed; build aborted: Target //sw/device/tests/sim_dv:i2c_device_tx_rx_test_sim_dv is incompatible and cannot be built, but was explicitly requested.
Dependency chain:
//sw/device/tests/sim_dv:i2c_device_tx_rx_test_sim_dv (f2055d) <-- target platform (//toolchain:opentitan_platform) didn't satisfy constraint @@platforms//:incompatible
INFO: Elapsed time: 0.293s, Critical Path: 0.02s
INFO: 1 process: 1 internal.
ERROR: Build did NOT complete successfully
_run_cmd -> had a non-zero return code of 1.
make: *** [/nightly/current_run/opentitan/hw/dv/tools/dvsim/sim.mk:58: sw_build] Error 1
chip_sw_spi_device_tpm 88558043935404097252129879952857239915738566692603747929085598296454886030146 None
Use --verbose_failures to see the command lines of failed build steps.
ERROR: Analysis of target '//sw/device/tests:spi_device_tpm_tx_rx_test_sim_dv' failed; build aborted: Target //sw/device/tests:spi_device_tpm_tx_rx_test_sim_dv is incompatible and cannot be built, but was explicitly requested.
Dependency chain:
//sw/device/tests:spi_device_tpm_tx_rx_test_sim_dv (f2055d) <-- target platform (//toolchain:opentitan_platform) didn't satisfy constraint @@platforms//:incompatible
INFO: Elapsed time: 2.288s, Critical Path: 0.02s
INFO: 1 process: 1 internal.
ERROR: Build did NOT complete successfully
_run_cmd -> had a non-zero return code of 1.
make: *** [/nightly/current_run/opentitan/hw/dv/tools/dvsim/sim.mk:58: sw_build] Error 1
chip_sw_spi_host_tx_rx 61835299839667858061384789623872531244621771155966674302079382081230937799280 None
Use --verbose_failures to see the command lines of failed build steps.
ERROR: Analysis of target '//sw/device/tests/sim_dv:spi_host_tx_rx_test_sim_dv' failed; build aborted: Target //sw/device/tests/sim_dv:spi_host_tx_rx_test_sim_dv is incompatible and cannot be built, but was explicitly requested.
Dependency chain:
//sw/device/tests/sim_dv:spi_host_tx_rx_test_sim_dv (f2055d) <-- target platform (//toolchain:opentitan_platform) didn't satisfy constraint @@platforms//:incompatible
INFO: Elapsed time: 0.281s, Critical Path: 0.01s
INFO: 1 process: 1 internal.
ERROR: Build did NOT complete successfully
_run_cmd -> had a non-zero return code of 1.
make: *** [/nightly/current_run/opentitan/hw/dv/tools/dvsim/sim.mk:58: sw_build] Error 1
chip_sw_lc_ctrl_otp_hw_cfg 66638784710300394221332685447193204973477913943887553756646323779922321752245 None
Another command (pid=1173928) is running. Waiting for it to complete on the server (server_pid=196006)...
Another command (pid=1171644) is running. Waiting for it to complete on the server (server_pid=196006)...
Another command (pid=1176183) is running. Waiting for it to complete on the server (server_pid=196006)...
WARNING: Target pattern parsing failed.
ERROR: Skipping '//sw/device/tests:lc_ctrl_otp_hw_cfg_test_sim_dv': no such target '//sw/device/tests:lc_ctrl_otp_hw_cfg_test_sim_dv': target 'lc_ctrl_otp_hw_cfg_test_sim_dv' not declared in package 'sw/device/tests' defined by /nightly/current_run/opentitan/sw/device/tests/BUILD (did you mean lc_ctrl_otp_hw_cfg0_test_sim_dv?)
ERROR: no such target '//sw/device/tests:lc_ctrl_otp_hw_cfg_test_sim_dv': target 'lc_ctrl_otp_hw_cfg_test_sim_dv' not declared in package 'sw/device/tests' defined by /nightly/current_run/opentitan/sw/device/tests/BUILD (did you mean lc_ctrl_otp_hw_cfg0_test_sim_dv?)
ERROR: Build did NOT complete successfully
_run_cmd -> had a non-zero return code of 1.
make: *** [/nightly/current_run/opentitan/hw/dv/tools/dvsim/sim.mk:58: sw_build] Error 1
chip_sw_otp_ctrl_lc_signals_test_unlocked0 109471913499551731750456150396646838926373699249848436278365187605800909403530 None
Use --verbose_failures to see the command lines of failed build steps.
ERROR: Analysis of target '//sw/device/tests/sim_dv:otp_ctrl_lc_signals_test_sim_dv' failed; build aborted: Target //sw/device/tests/sim_dv:otp_ctrl_lc_signals_test_sim_dv is incompatible and cannot be built, but was explicitly requested.
Dependency chain:
//sw/device/tests/sim_dv:otp_ctrl_lc_signals_test_sim_dv (f2055d) <-- target platform (//toolchain:opentitan_platform) didn't satisfy constraint @@platforms//:incompatible
INFO: Elapsed time: 0.583s, Critical Path: 0.02s
INFO: 1 process: 1 internal.
ERROR: Build did NOT complete successfully
_run_cmd -> had a non-zero return code of 1.
make: *** [/nightly/current_run/opentitan/hw/dv/tools/dvsim/sim.mk:58: sw_build] Error 1
chip_sw_otp_ctrl_lc_signals_dev 27558914175676398998662574094721959121989396522270252924061246290880889270485 None
Use --verbose_failures to see the command lines of failed build steps.
ERROR: Analysis of target '//sw/device/tests/sim_dv:otp_ctrl_lc_signals_test_sim_dv' failed; build aborted: Target //sw/device/tests/sim_dv:otp_ctrl_lc_signals_test_sim_dv is incompatible and cannot be built, but was explicitly requested.
Dependency chain:
//sw/device/tests/sim_dv:otp_ctrl_lc_signals_test_sim_dv (f2055d) <-- target platform (//toolchain:opentitan_platform) didn't satisfy constraint @@platforms//:incompatible
INFO: Elapsed time: 0.618s, Critical Path: 0.02s
INFO: 1 process: 1 internal.
ERROR: Build did NOT complete successfully
_run_cmd -> had a non-zero return code of 1.
make: *** [/nightly/current_run/opentitan/hw/dv/tools/dvsim/sim.mk:58: sw_build] Error 1
chip_sw_otp_ctrl_lc_signals_prod 54910096173134370412678517244693798985530861692837138507857022537755548322301 None
Use --verbose_failures to see the command lines of failed build steps.
ERROR: Analysis of target '//sw/device/tests/sim_dv:otp_ctrl_lc_signals_test_sim_dv' failed; build aborted: Target //sw/device/tests/sim_dv:otp_ctrl_lc_signals_test_sim_dv is incompatible and cannot be built, but was explicitly requested.
Dependency chain:
//sw/device/tests/sim_dv:otp_ctrl_lc_signals_test_sim_dv (f2055d) <-- target platform (//toolchain:opentitan_platform) didn't satisfy constraint @@platforms//:incompatible
INFO: Elapsed time: 0.267s, Critical Path: 0.02s
INFO: 1 process: 1 internal.
ERROR: Build did NOT complete successfully
_run_cmd -> had a non-zero return code of 1.
make: *** [/nightly/current_run/opentitan/hw/dv/tools/dvsim/sim.mk:58: sw_build] Error 1
chip_sw_otp_ctrl_lc_signals_rma 66202878831243558938955217792210864682934753889157569789848539646397214049050 None
Use --verbose_failures to see the command lines of failed build steps.
ERROR: Analysis of target '//sw/device/tests/sim_dv:otp_ctrl_lc_signals_test_sim_dv' failed; build aborted: Target //sw/device/tests/sim_dv:otp_ctrl_lc_signals_test_sim_dv is incompatible and cannot be built, but was explicitly requested.
Dependency chain:
//sw/device/tests/sim_dv:otp_ctrl_lc_signals_test_sim_dv (f2055d) <-- target platform (//toolchain:opentitan_platform) didn't satisfy constraint @@platforms//:incompatible
INFO: Elapsed time: 0.293s, Critical Path: 0.03s
INFO: 1 process: 1 internal.
ERROR: Build did NOT complete successfully
_run_cmd -> had a non-zero return code of 1.
make: *** [/nightly/current_run/opentitan/hw/dv/tools/dvsim/sim.mk:58: sw_build] Error 1
chip_sw_otp_ctrl_vendor_test_csr_access 1983088598314248146214104867384075926581405644339956113349744049965778447265 None
Use --verbose_failures to see the command lines of failed build steps.
ERROR: Analysis of target '//sw/device/tests/sim_dv:otp_ctrl_vendor_test_csr_access_test_sim_dv' failed; build aborted: Target //sw/device/tests/sim_dv:otp_ctrl_vendor_test_csr_access_test_sim_dv is incompatible and cannot be built, but was explicitly requested.
Dependency chain:
//sw/device/tests/sim_dv:otp_ctrl_vendor_test_csr_access_test_sim_dv (f2055d) <-- target platform (//toolchain:opentitan_platform) didn't satisfy constraint @@platforms//:incompatible
INFO: Elapsed time: 0.883s, Critical Path: 0.02s
INFO: 1 process: 1 internal.
ERROR: Build did NOT complete successfully
_run_cmd -> had a non-zero return code of 1.
make: *** [/nightly/current_run/opentitan/hw/dv/tools/dvsim/sim.mk:58: sw_build] Error 1
chip_sw_otp_ctrl_nvm_cnt 99049031082455300573690779329416442642615983411282625011133778978189715770552 None
Another command (pid=446774) is running. Waiting for it to complete on the server (server_pid=196006)...
Another command (pid=450255) is running. Waiting for it to complete on the server (server_pid=196006)...
Another command (pid=447256) is running. Waiting for it to complete on the server (server_pid=196006)...
WARNING: Target pattern parsing failed.
ERROR: Skipping '//sw/device/tests:otp_ctrl_nvm_cnt_test_sim_dv': no such target '//sw/device/tests:otp_ctrl_nvm_cnt_test_sim_dv': target 'otp_ctrl_nvm_cnt_test_sim_dv' not declared in package 'sw/device/tests' defined by /nightly/current_run/opentitan/sw/device/tests/BUILD
ERROR: no such target '//sw/device/tests:otp_ctrl_nvm_cnt_test_sim_dv': target 'otp_ctrl_nvm_cnt_test_sim_dv' not declared in package 'sw/device/tests' defined by /nightly/current_run/opentitan/sw/device/tests/BUILD
ERROR: Build did NOT complete successfully
_run_cmd -> had a non-zero return code of 1.
make: *** [/nightly/current_run/opentitan/hw/dv/tools/dvsim/sim.mk:58: sw_build] Error 1
chip_sw_otp_ctrl_sw_parts 22761071862116036840626285083433776826927898880415934764243127427350359813903 None
Another command (pid=355131) is running. Waiting for it to complete on the server (server_pid=196006)...
Another command (pid=369392) is running. Waiting for it to complete on the server (server_pid=196006)...
Another command (pid=371550) is running. Waiting for it to complete on the server (server_pid=196006)...
WARNING: Target pattern parsing failed.
ERROR: Skipping '//sw/device/tests:otp_ctrl_sw_parts_test_sim_dv': no such target '//sw/device/tests:otp_ctrl_sw_parts_test_sim_dv': target 'otp_ctrl_sw_parts_test_sim_dv' not declared in package 'sw/device/tests' defined by /nightly/current_run/opentitan/sw/device/tests/BUILD
ERROR: no such target '//sw/device/tests:otp_ctrl_sw_parts_test_sim_dv': target 'otp_ctrl_sw_parts_test_sim_dv' not declared in package 'sw/device/tests' defined by /nightly/current_run/opentitan/sw/device/tests/BUILD
ERROR: Build did NOT complete successfully
_run_cmd -> had a non-zero return code of 1.
make: *** [/nightly/current_run/opentitan/hw/dv/tools/dvsim/sim.mk:58: sw_build] Error 1
chip_sw_lc_ctrl_transition 6498869884527188507325756142966762964607692329576640685713742371452620662503 None
Use --verbose_failures to see the command lines of failed build steps.
ERROR: Analysis of target '//sw/device/tests/sim_dv:lc_ctrl_transition_test_sim_dv' failed; build aborted: Target //sw/device/tests/sim_dv:lc_ctrl_transition_test_sim_dv is incompatible and cannot be built, but was explicitly requested.
Dependency chain:
//sw/device/tests/sim_dv:lc_ctrl_transition_test_sim_dv (f2055d) <-- target platform (//toolchain:opentitan_platform) didn't satisfy constraint @@platforms//:incompatible
INFO: Elapsed time: 0.324s, Critical Path: 0.03s
INFO: 1 process: 1 internal.
ERROR: Build did NOT complete successfully
_run_cmd -> had a non-zero return code of 1.
make: *** [/nightly/current_run/opentitan/hw/dv/tools/dvsim/sim.mk:58: sw_build] Error 1
chip_sw_lc_walkthrough_dev 113726639780325499943006193924272262206768948952943475771940467019282398137688 None
Use --verbose_failures to see the command lines of failed build steps.
ERROR: Analysis of target '//sw/device/tests/sim_dv:lc_walkthrough_test_sim_dv' failed; build aborted: Target //sw/device/tests/sim_dv:lc_walkthrough_test_sim_dv is incompatible and cannot be built, but was explicitly requested.
Dependency chain:
//sw/device/tests/sim_dv:lc_walkthrough_test_sim_dv (f2055d) <-- target platform (//toolchain:opentitan_platform) didn't satisfy constraint @@platforms//:incompatible
INFO: Elapsed time: 1.123s, Critical Path: 0.03s
INFO: 1 process: 1 internal.
ERROR: Build did NOT complete successfully
_run_cmd -> had a non-zero return code of 1.
make: *** [/nightly/current_run/opentitan/hw/dv/tools/dvsim/sim.mk:58: sw_build] Error 1
chip_sw_lc_walkthrough_prod 56546841153479391853414881650648569270281208101656096980785937309674836902259 None
Use --verbose_failures to see the command lines of failed build steps.
ERROR: Analysis of target '//sw/device/tests/sim_dv:lc_walkthrough_test_sim_dv' failed; build aborted: Target //sw/device/tests/sim_dv:lc_walkthrough_test_sim_dv is incompatible and cannot be built, but was explicitly requested.
Dependency chain:
//sw/device/tests/sim_dv:lc_walkthrough_test_sim_dv (f2055d) <-- target platform (//toolchain:opentitan_platform) didn't satisfy constraint @@platforms//:incompatible
INFO: Elapsed time: 2.754s, Critical Path: 0.02s
INFO: 1 process: 1 internal.
ERROR: Build did NOT complete successfully
_run_cmd -> had a non-zero return code of 1.
make: *** [/nightly/current_run/opentitan/hw/dv/tools/dvsim/sim.mk:58: sw_build] Error 1
chip_sw_lc_walkthrough_prodend 71717363437758321004123090345310223701338780130623603529398969318092606493951 None
Use --verbose_failures to see the command lines of failed build steps.
ERROR: Analysis of target '//sw/device/tests/sim_dv:lc_walkthrough_test_sim_dv' failed; build aborted: Target //sw/device/tests/sim_dv:lc_walkthrough_test_sim_dv is incompatible and cannot be built, but was explicitly requested.
Dependency chain:
//sw/device/tests/sim_dv:lc_walkthrough_test_sim_dv (f2055d) <-- target platform (//toolchain:opentitan_platform) didn't satisfy constraint @@platforms//:incompatible
INFO: Elapsed time: 0.293s, Critical Path: 0.03s
INFO: 1 process: 1 internal.
ERROR: Build did NOT complete successfully
_run_cmd -> had a non-zero return code of 1.
make: *** [/nightly/current_run/opentitan/hw/dv/tools/dvsim/sim.mk:58: sw_build] Error 1
chip_sw_lc_walkthrough_rma 35872380167471676672246957145860871339627258428770158155919844228062034599316 None
Use --verbose_failures to see the command lines of failed build steps.
ERROR: Analysis of target '//sw/device/tests/sim_dv:lc_walkthrough_test_sim_dv' failed; build aborted: Target //sw/device/tests/sim_dv:lc_walkthrough_test_sim_dv is incompatible and cannot be built, but was explicitly requested.
Dependency chain:
//sw/device/tests/sim_dv:lc_walkthrough_test_sim_dv (f2055d) <-- target platform (//toolchain:opentitan_platform) didn't satisfy constraint @@platforms//:incompatible
INFO: Elapsed time: 0.701s, Critical Path: 0.02s
INFO: 1 process: 1 internal.
ERROR: Build did NOT complete successfully
_run_cmd -> had a non-zero return code of 1.
make: *** [/nightly/current_run/opentitan/hw/dv/tools/dvsim/sim.mk:58: sw_build] Error 1
chip_sw_lc_walkthrough_testunlocks 83748486266341629311811980853598596805297621895812787069321450073232568738285 None
Use --verbose_failures to see the command lines of failed build steps.
ERROR: Analysis of target '//sw/device/tests/sim_dv:lc_walkthrough_testunlocks_test_sim_dv' failed; build aborted: Target //sw/device/tests/sim_dv:lc_walkthrough_testunlocks_test_sim_dv is incompatible and cannot be built, but was explicitly requested.
Dependency chain:
//sw/device/tests/sim_dv:lc_walkthrough_testunlocks_test_sim_dv (f2055d) <-- target platform (//toolchain:opentitan_platform) didn't satisfy constraint @@platforms//:incompatible
INFO: Elapsed time: 0.239s, Critical Path: 0.03s
INFO: 1 process: 1 internal.
ERROR: Build did NOT complete successfully
_run_cmd -> had a non-zero return code of 1.
make: *** [/nightly/current_run/opentitan/hw/dv/tools/dvsim/sim.mk:58: sw_build] Error 1
chip_sw_pwrmgr_main_power_glitch_reset 98134935008216797037480195232995755381328356764973894736800892209425911266527 None
Use --verbose_failures to see the command lines of failed build steps.
ERROR: Analysis of target '//sw/device/tests/sim_dv:pwrmgr_main_power_glitch_test_sim_dv' failed; build aborted: Target //sw/device/tests/sim_dv:pwrmgr_main_power_glitch_test_sim_dv is incompatible and cannot be built, but was explicitly requested.
Dependency chain:
//sw/device/tests/sim_dv:pwrmgr_main_power_glitch_test_sim_dv (f2055d) <-- target platform (//toolchain:opentitan_platform) didn't satisfy constraint @@platforms//:incompatible
INFO: Elapsed time: 3.685s, Critical Path: 0.02s
INFO: 1 process: 1 internal.
ERROR: Build did NOT complete successfully
_run_cmd -> had a non-zero return code of 1.
make: *** [/nightly/current_run/opentitan/hw/dv/tools/dvsim/sim.mk:58: sw_build] Error 1
chip_sw_pwrmgr_sleep_power_glitch_reset 73105153081373256000747301475507080556616148451092979873949108670107875372044 None
Use --verbose_failures to see the command lines of failed build steps.
ERROR: Analysis of target '//sw/device/tests/sim_dv:pwrmgr_sleep_power_glitch_test_sim_dv' failed; build aborted: Target //sw/device/tests/sim_dv:pwrmgr_sleep_power_glitch_test_sim_dv is incompatible and cannot be built, but was explicitly requested.
Dependency chain:
//sw/device/tests/sim_dv:pwrmgr_sleep_power_glitch_test_sim_dv (f2055d) <-- target platform (//toolchain:opentitan_platform) didn't satisfy constraint @@platforms//:incompatible
INFO: Elapsed time: 2.160s, Critical Path: 0.03s
INFO: 1 process: 1 internal.
ERROR: Build did NOT complete successfully
_run_cmd -> had a non-zero return code of 1.
make: *** [/nightly/current_run/opentitan/hw/dv/tools/dvsim/sim.mk:58: sw_build] Error 1
chip_sw_pwrmgr_deep_sleep_power_glitch_reset 38494261036059001000368074250324464096739856239042270942943518031702806095977 None
Use --verbose_failures to see the command lines of failed build steps.
ERROR: Analysis of target '//sw/device/tests/sim_dv:pwrmgr_deep_sleep_power_glitch_test_sim_dv' failed; build aborted: Target //sw/device/tests/sim_dv:pwrmgr_deep_sleep_power_glitch_test_sim_dv is incompatible and cannot be built, but was explicitly requested.
Dependency chain:
//sw/device/tests/sim_dv:pwrmgr_deep_sleep_power_glitch_test_sim_dv (f2055d) <-- target platform (//toolchain:opentitan_platform) didn't satisfy constraint @@platforms//:incompatible
INFO: Elapsed time: 0.777s, Critical Path: 0.03s
INFO: 1 process: 1 internal.
ERROR: Build did NOT complete successfully
_run_cmd -> had a non-zero return code of 1.
make: *** [/nightly/current_run/opentitan/hw/dv/tools/dvsim/sim.mk:58: sw_build] Error 1
chip_sw_pwrmgr_random_sleep_power_glitch_reset 110216746000989884040674524702544341846138728176314047242163846416417062902019 None
Use --verbose_failures to see the command lines of failed build steps.
ERROR: Analysis of target '//sw/device/tests/sim_dv:pwrmgr_random_sleep_power_glitch_reset_test_sim_dv' failed; build aborted: Target //sw/device/tests/sim_dv:pwrmgr_random_sleep_power_glitch_reset_test_sim_dv is incompatible and cannot be built, but was explicitly requested.
Dependency chain:
//sw/device/tests/sim_dv:pwrmgr_random_sleep_power_glitch_reset_test_sim_dv (f2055d) <-- target platform (//toolchain:opentitan_platform) didn't satisfy constraint @@platforms//:incompatible
INFO: Elapsed time: 16.702s, Critical Path: 0.02s
INFO: 1 process: 1 internal.
ERROR: Build did NOT complete successfully
_run_cmd -> had a non-zero return code of 1.
make: *** [/nightly/current_run/opentitan/hw/dv/tools/dvsim/sim.mk:58: sw_build] Error 1
chip_sw_pwrmgr_sleep_disabled 82297136793066922171118560362215810986144596575982040580945396517589927267814 None
Use --verbose_failures to see the command lines of failed build steps.
ERROR: Analysis of target '//sw/device/tests:pwrmgr_sleep_disabled_test_sim_dv' failed; build aborted: Target //sw/device/tests:pwrmgr_sleep_disabled_test_sim_dv is incompatible and cannot be built, but was explicitly requested.
Dependency chain:
//sw/device/tests:pwrmgr_sleep_disabled_test_sim_dv (f2055d) <-- target platform (//toolchain:opentitan_platform) didn't satisfy constraint @@platforms//:incompatible
INFO: Elapsed time: 1.141s, Critical Path: 0.02s
INFO: 1 process: 1 internal.
ERROR: Build did NOT complete successfully
_run_cmd -> had a non-zero return code of 1.
make: *** [/nightly/current_run/opentitan/hw/dv/tools/dvsim/sim.mk:58: sw_build] Error 1
chip_sw_pwrmgr_wdog_reset 30244755511553083030752529711029277772907033355405538685147834939524634538140 None
Use --verbose_failures to see the command lines of failed build steps.
ERROR: Analysis of target '//sw/device/tests:pwrmgr_wdog_reset_reqs_test_sim_dv' failed; build aborted: Target //sw/device/tests:pwrmgr_wdog_reset_reqs_test_sim_dv is incompatible and cannot be built, but was explicitly requested.
Dependency chain:
//sw/device/tests:pwrmgr_wdog_reset_reqs_test_sim_dv (f2055d) <-- target platform (//toolchain:opentitan_platform) didn't satisfy constraint @@platforms//:incompatible
INFO: Elapsed time: 0.255s, Critical Path: 0.03s
INFO: 1 process: 1 internal.
ERROR: Build did NOT complete successfully
_run_cmd -> had a non-zero return code of 1.
make: *** [/nightly/current_run/opentitan/hw/dv/tools/dvsim/sim.mk:58: sw_build] Error 1
chip_sw_alert_test 79821251074846358896111728886070900328630396324070075033664351788981151281276 None
Another command (pid=661086) is running. Waiting for it to complete on the server (server_pid=196006)...
WARNING: Target pattern parsing failed.
ERROR: Skipping '//sw/device/tests/autogen/top_darjeeling:alert_test_sim_dv': no such package 'sw/device/tests/autogen/top_darjeeling': BUILD file not found in any of the following directories. Add a BUILD file to a directory to mark it as a package.
- sw/device/tests/autogen/top_darjeeling
ERROR: no such package 'sw/device/tests/autogen/top_darjeeling': BUILD file not found in any of the following directories. Add a BUILD file to a directory to mark it as a package.
- sw/device/tests/autogen/top_darjeeling
ERROR: Build did NOT complete successfully
_run_cmd -> had a non-zero return code of 1.
make: *** [/nightly/current_run/opentitan/hw/dv/tools/dvsim/sim.mk:58: sw_build] Error 1
chip_sw_alert_handler_escalation 13897488749652490450745873015115118008097008802096457900435658736023818212016 None
Use --verbose_failures to see the command lines of failed build steps.
ERROR: Analysis of target '//sw/device/tests:alert_handler_escalation_test_sim_dv' failed; build aborted: Target //sw/device/tests:alert_handler_escalation_test_sim_dv is incompatible and cannot be built, but was explicitly requested.
Dependency chain:
//sw/device/tests:alert_handler_escalation_test_sim_dv (f2055d) <-- target platform (//toolchain:opentitan_platform) didn't satisfy constraint @@platforms//:incompatible
INFO: Elapsed time: 4.779s, Critical Path: 0.02s
INFO: 1 process: 1 internal.
ERROR: Build did NOT complete successfully
_run_cmd -> had a non-zero return code of 1.
make: *** [/nightly/current_run/opentitan/hw/dv/tools/dvsim/sim.mk:58: sw_build] Error 1
chip_sw_alert_handler_reverse_ping_in_deep_sleep 57981021296373944884115710718305678535090728448078296587206048138019148306743 None
Use --verbose_failures to see the command lines of failed build steps.
ERROR: Analysis of target '//sw/device/tests:alert_handler_reverse_ping_in_deep_sleep_test_sim_dv' failed; build aborted: Target //sw/device/tests:alert_handler_reverse_ping_in_deep_sleep_test_sim_dv is incompatible and cannot be built, but was explicitly requested.
Dependency chain:
//sw/device/tests:alert_handler_reverse_ping_in_deep_sleep_test_sim_dv (f2055d) <-- target platform (//toolchain:opentitan_platform) didn't satisfy constraint @@platforms//:incompatible
INFO: Elapsed time: 0.707s, Critical Path: 0.02s
INFO: 1 process: 1 internal.
ERROR: Build did NOT complete successfully
_run_cmd -> had a non-zero return code of 1.
make: *** [/nightly/current_run/opentitan/hw/dv/tools/dvsim/sim.mk:58: sw_build] Error 1
chip_sw_alert_handler_lpg_sleep_mode_alerts 56467736130430466869255493290933500685295402878692550833737756489842692025481 None
---- STDERR ----
Another command (pid=355131) is running. Waiting for it to complete on the server (server_pid=196006)...
WARNING: Target pattern parsing failed.
ERROR: Skipping '//sw/device/tests:alert_handler_lpg_sleep_mode_alerts_test_sim_dv': no such target '//sw/device/tests:alert_handler_lpg_sleep_mode_alerts_test_sim_dv': target 'alert_handler_lpg_sleep_mode_alerts_test_sim_dv' not declared in package 'sw/device/tests' defined by /nightly/current_run/opentitan/sw/device/tests/BUILD
ERROR: no such target '//sw/device/tests:alert_handler_lpg_sleep_mode_alerts_test_sim_dv': target 'alert_handler_lpg_sleep_mode_alerts_test_sim_dv' not declared in package 'sw/device/tests' defined by /nightly/current_run/opentitan/sw/device/tests/BUILD
ERROR: Build did NOT complete successfully
_run_cmd -> had a non-zero return code of 1.
make: *** [/nightly/current_run/opentitan/hw/dv/tools/dvsim/sim.mk:58: sw_build] Error 1
chip_sw_alert_handler_lpg_sleep_mode_pings 109735663992852359950980503995162949457667159717234396544210367510411253901549 None
Use --verbose_failures to see the command lines of failed build steps.
ERROR: Analysis of target '//sw/device/tests:alert_handler_lpg_sleep_mode_pings_test_sim_dv' failed; build aborted: Target //sw/device/tests:alert_handler_lpg_sleep_mode_pings_test_sim_dv is incompatible and cannot be built, but was explicitly requested.
Dependency chain:
//sw/device/tests:alert_handler_lpg_sleep_mode_pings_test_sim_dv (f2055d) <-- target platform (//toolchain:opentitan_platform) didn't satisfy constraint @@platforms//:incompatible
INFO: Elapsed time: 1.194s, Critical Path: 0.02s
INFO: 1 process: 1 internal.
ERROR: Build did NOT complete successfully
_run_cmd -> had a non-zero return code of 1.
make: *** [/nightly/current_run/opentitan/hw/dv/tools/dvsim/sim.mk:58: sw_build] Error 1
chip_sw_alert_handler_lpg_clkoff 70886939354568873758460562640961226580151887500704609113076144979167213242348 None
Use --verbose_failures to see the command lines of failed build steps.
ERROR: Analysis of target '//sw/device/tests:alert_handler_lpg_clkoff_test_sim_dv' failed; build aborted: Target //sw/device/tests:alert_handler_lpg_clkoff_test_sim_dv is incompatible and cannot be built, but was explicitly requested.
Dependency chain:
//sw/device/tests:alert_handler_lpg_clkoff_test_sim_dv (f2055d) <-- target platform (//toolchain:opentitan_platform) didn't satisfy constraint @@platforms//:incompatible
INFO: Elapsed time: 2.157s, Critical Path: 0.02s
INFO: 1 process: 1 internal.
ERROR: Build did NOT complete successfully
_run_cmd -> had a non-zero return code of 1.
make: *** [/nightly/current_run/opentitan/hw/dv/tools/dvsim/sim.mk:58: sw_build] Error 1
chip_sw_alert_handler_lpg_reset_toggle 94587690769588649855620721411227490975276646647336319285963925507398589908114 None
Use --verbose_failures to see the command lines of failed build steps.
ERROR: Analysis of target '//sw/device/tests:alert_handler_lpg_reset_toggle_test_sim_dv' failed; build aborted: Target //sw/device/tests:alert_handler_lpg_reset_toggle_test_sim_dv is incompatible and cannot be built, but was explicitly requested.
Dependency chain:
//sw/device/tests:alert_handler_lpg_reset_toggle_test_sim_dv (f2055d) <-- target platform (//toolchain:opentitan_platform) didn't satisfy constraint @@platforms//:incompatible
INFO: Elapsed time: 20.747s, Critical Path: 0.01s
INFO: 1 process: 1 internal.
ERROR: Build did NOT complete successfully
_run_cmd -> had a non-zero return code of 1.
make: *** [/nightly/current_run/opentitan/hw/dv/tools/dvsim/sim.mk:58: sw_build] Error 1
chip_sw_alert_handler_entropy 108534424302291053427135799323570285903410567132626032474545098295753268999216 None
Use --verbose_failures to see the command lines of failed build steps.
ERROR: Analysis of target '//sw/device/tests/sim_dv:alert_handler_entropy_test_sim_dv' failed; build aborted: Target //sw/device/tests/sim_dv:alert_handler_entropy_test_sim_dv is incompatible and cannot be built, but was explicitly requested.
Dependency chain:
//sw/device/tests/sim_dv:alert_handler_entropy_test_sim_dv (f2055d) <-- target platform (//toolchain:opentitan_platform) didn't satisfy constraint @@platforms//:incompatible
INFO: Elapsed time: 1.249s, Critical Path: 0.02s
INFO: 1 process: 1 internal.
ERROR: Build did NOT complete successfully
_run_cmd -> had a non-zero return code of 1.
make: *** [/nightly/current_run/opentitan/hw/dv/tools/dvsim/sim.mk:58: sw_build] Error 1
chip_sw_csrng_fuse_en_sw_app_read_test 107438288349103133864846580585148883644934199427349950339045254507893516443446 None
Use --verbose_failures to see the command lines of failed build steps.
ERROR: Analysis of target '//sw/device/tests/sim_dv:csrng_fuse_en_sw_app_read_sim_dv' failed; build aborted: Target //sw/device/tests/sim_dv:csrng_fuse_en_sw_app_read_sim_dv is incompatible and cannot be built, but was explicitly requested.
Dependency chain:
//sw/device/tests/sim_dv:csrng_fuse_en_sw_app_read_sim_dv (f2055d) <-- target platform (//toolchain:opentitan_platform) didn't satisfy constraint @@platforms//:incompatible
INFO: Elapsed time: 2.198s, Critical Path: 0.03s
INFO: 1 process: 1 internal.
ERROR: Build did NOT complete successfully
_run_cmd -> had a non-zero return code of 1.
make: *** [/nightly/current_run/opentitan/hw/dv/tools/dvsim/sim.mk:58: sw_build] Error 1
chip_sw_kmac_app_rom 88016575295346038795795928563161364075766644054507737075880981743561183605445 None
INFO: [build_sw_collateral_for_sim.py:202] cquery_cmd = ./bazelisk.sh cquery labels(data, //sw/device/tests:kmac_app_rom_test_sim_dv) union labels(srcs, //sw/device/tests:kmac_app_rom_test_sim_dv) --ui_event_filters=-info --noshow_progress --//hw/top=darjeeling --//hw/top=darjeeling --output=starlark
---- STDOUT ----
---- STDERR ----
Another command (pid=1150074) is running. Waiting for it to complete on the server (server_pid=196006)...
ERROR: Error doing post analysis query: Evaluation of subquery "labels('data', //sw/device/tests:kmac_app_rom_test_sim_dv)" failed (did you want to use --keep_going?): in 'data' of rule //sw/device/tests:kmac_app_rom_test_sim_dv: configured target of type test_suite does not have attribute 'data'
ERROR: Build did NOT complete successfully
_run_cmd -> had a non-zero return code of 1.
make: *** [/nightly/current_run/opentitan/hw/dv/tools/dvsim/sim.mk:58: sw_build] Error 1
chip_sw_sram_ctrl_scrambled_access_jitter_en 94267332112226252436907736354415703149552084914580600409775850780172655557063 None
---- STDERR ----
Another command (pid=1365702) is running. Waiting for it to complete on the server (server_pid=196006)...
WARNING: Target pattern parsing failed.
ERROR: Skipping '//sw/device/tests/sim_dv:sram_ctrl_scrambled_access_test_sim_dv': no such target '//sw/device/tests/sim_dv:sram_ctrl_scrambled_access_test_sim_dv': target 'sram_ctrl_scrambled_access_test_sim_dv' not declared in package 'sw/device/tests/sim_dv' defined by /nightly/current_run/opentitan/sw/device/tests/sim_dv/BUILD
ERROR: no such target '//sw/device/tests/sim_dv:sram_ctrl_scrambled_access_test_sim_dv': target 'sram_ctrl_scrambled_access_test_sim_dv' not declared in package 'sw/device/tests/sim_dv' defined by /nightly/current_run/opentitan/sw/device/tests/sim_dv/BUILD
ERROR: Build did NOT complete successfully
_run_cmd -> had a non-zero return code of 1.
make: *** [/nightly/current_run/opentitan/hw/dv/tools/dvsim/sim.mk:58: sw_build] Error 1
chip_sw_sram_ctrl_execution_main 41135752252446675043177982632344625369081311505633572435975149885461150055763 None
Use --verbose_failures to see the command lines of failed build steps.
ERROR: Analysis of target '//sw/device/tests/sim_dv:sram_ctrl_execution_main_test_sim_dv' failed; build aborted: Target //sw/device/tests/sim_dv:sram_ctrl_execution_main_test_sim_dv is incompatible and cannot be built, but was explicitly requested.
Dependency chain:
//sw/device/tests/sim_dv:sram_ctrl_execution_main_test_sim_dv (f2055d) <-- target platform (//toolchain:opentitan_platform) didn't satisfy constraint @@platforms//:incompatible
INFO: Elapsed time: 0.282s, Critical Path: 0.02s
INFO: 1 process: 1 internal.
ERROR: Build did NOT complete successfully
_run_cmd -> had a non-zero return code of 1.
make: *** [/nightly/current_run/opentitan/hw/dv/tools/dvsim/sim.mk:58: sw_build] Error 1
chip_sw_coremark 101329879800987556954660966077694403988288611501093014796862629785323210236621 None
Another command (pid=464881) is running. Waiting for it to complete on the server (server_pid=196006)...
WARNING: Target pattern parsing failed.
ERROR: Skipping '//third_party/coremark/top_darjeeling:coremark_test_sim_dv': no such package 'third_party/coremark/top_darjeeling': BUILD file not found in any of the following directories. Add a BUILD file to a directory to mark it as a package.
- third_party/coremark/top_darjeeling
ERROR: no such package 'third_party/coremark/top_darjeeling': BUILD file not found in any of the following directories. Add a BUILD file to a directory to mark it as a package.
- third_party/coremark/top_darjeeling
ERROR: Build did NOT complete successfully
_run_cmd -> had a non-zero return code of 1.
make: *** [/nightly/current_run/opentitan/hw/dv/tools/dvsim/sim.mk:58: sw_build] Error 1
chip_sw_clkmgr_reset_frequency 18237808081230909706537057416683404813023222837103221463157790692827660464055 None
Use --verbose_failures to see the command lines of failed build steps.
ERROR: Analysis of target '//sw/device/tests:clkmgr_reset_frequency_test_sim_dv' failed; build aborted: Target //sw/device/tests:clkmgr_reset_frequency_test_sim_dv is incompatible and cannot be built, but was explicitly requested.
Dependency chain:
//sw/device/tests:clkmgr_reset_frequency_test_sim_dv (f2055d) <-- target platform (//toolchain:opentitan_platform) didn't satisfy constraint @@platforms//:incompatible
INFO: Elapsed time: 0.601s, Critical Path: 0.01s
INFO: 1 process: 1 internal.
ERROR: Build did NOT complete successfully
_run_cmd -> had a non-zero return code of 1.
make: *** [/nightly/current_run/opentitan/hw/dv/tools/dvsim/sim.mk:58: sw_build] Error 1
chip_sw_clkmgr_sleep_frequency 5826398490145988574827914024044545593777319232763703213458780934618055983974 None
Use --verbose_failures to see the command lines of failed build steps.
ERROR: Analysis of target '//sw/device/tests:clkmgr_sleep_frequency_test_sim_dv' failed; build aborted: Target //sw/device/tests:clkmgr_sleep_frequency_test_sim_dv is incompatible and cannot be built, but was explicitly requested.
Dependency chain:
//sw/device/tests:clkmgr_sleep_frequency_test_sim_dv (f2055d) <-- target platform (//toolchain:opentitan_platform) didn't satisfy constraint @@platforms//:incompatible
INFO: Elapsed time: 0.460s, Critical Path: 0.00s
INFO: 1 process: 1 internal.
ERROR: Build did NOT complete successfully
_run_cmd -> had a non-zero return code of 1.
make: *** [/nightly/current_run/opentitan/hw/dv/tools/dvsim/sim.mk:58: sw_build] Error 1
chip_sw_ast_clk_outputs 36487873880711306827367442817877110253333608281440240023836673986117515265538 None
Use --verbose_failures to see the command lines of failed build steps.
ERROR: Analysis of target '//sw/device/tests:ast_clk_outs_test_sim_dv' failed; build aborted: Target //sw/device/tests:ast_clk_outs_test_sim_dv is incompatible and cannot be built, but was explicitly requested.
Dependency chain:
//sw/device/tests:ast_clk_outs_test_sim_dv (f2055d) <-- target platform (//toolchain:opentitan_platform) didn't satisfy constraint @@platforms//:incompatible
INFO: Elapsed time: 1.425s, Critical Path: 0.02s
INFO: 1 process: 1 internal.
ERROR: Build did NOT complete successfully
_run_cmd -> had a non-zero return code of 1.
make: *** [/nightly/current_run/opentitan/hw/dv/tools/dvsim/sim.mk:58: sw_build] Error 1
chip_sw_lc_ctrl_program_error 32021241775424171414592905618649755285300253646150233805559448190902451809690 None
ERROR: Analysis of target '//sw/device/tests/sim_dv:lc_ctrl_program_error_sim_dv' failed; build aborted: Target //sw/device/tests/sim_dv:lc_ctrl_program_error_sim_dv is incompatible and cannot be built, but was explicitly requested.
Dependency chain:
//sw/device/tests/sim_dv:lc_ctrl_program_error_sim_dv (f2055d) <-- target platform (//toolchain:opentitan_platform) didn't satisfy constraint @@platforms//:incompatible
INFO: Elapsed time: 1.062s, Critical Path: 0.02s
INFO: 1 process: 1 internal.
ERROR: Build did NOT complete successfully
FAILED:
_run_cmd -> had a non-zero return code of 1.
make: *** [/nightly/current_run/opentitan/hw/dv/tools/dvsim/sim.mk:58: sw_build] Error 1
chip_sw_rv_dm_ndm_reset_req_when_cpu_halted 111134916413438004649703417454880415940044932451446048260443178561796650509679 None
---- STDOUT ----
---- STDERR ----
WARNING: Target pattern parsing failed.
ERROR: Skipping '//sw/device/tests:rv_dm_ndm_reset_req_when_cpu_halted_sim_dv': no such target '//sw/device/tests:rv_dm_ndm_reset_req_when_cpu_halted_sim_dv': target 'rv_dm_ndm_reset_req_when_cpu_halted_sim_dv' not declared in package 'sw/device/tests' defined by /nightly/current_run/opentitan/sw/device/tests/BUILD (did you mean rv_dm_ndm_reset_req_when_cpu_halted_dev_sim_dv, or rv_dm_ndm_reset_req_when_cpu_halted_rma_sim_dv?)
ERROR: no such target '//sw/device/tests:rv_dm_ndm_reset_req_when_cpu_halted_sim_dv': target 'rv_dm_ndm_reset_req_when_cpu_halted_sim_dv' not declared in package 'sw/device/tests' defined by /nightly/current_run/opentitan/sw/device/tests/BUILD (did you mean rv_dm_ndm_reset_req_when_cpu_halted_dev_sim_dv, or rv_dm_ndm_reset_req_when_cpu_halted_rma_sim_dv?)
ERROR: Build did NOT complete successfully
_run_cmd -> had a non-zero return code of 1.
make: *** [/nightly/current_run/opentitan/hw/dv/tools/dvsim/sim.mk:58: sw_build] Error 1
chip_sw_rv_dm_access_after_wakeup 45089976669830628647997587080434663627030197780972234926670140301937289637257 None
---- STDOUT ----
---- STDERR ----
WARNING: Target pattern parsing failed.
ERROR: Skipping '//sw/device/tests:rv_dm_access_after_wakeup_sim_dv': no such target '//sw/device/tests:rv_dm_access_after_wakeup_sim_dv': target 'rv_dm_access_after_wakeup_sim_dv' not declared in package 'sw/device/tests' defined by /nightly/current_run/opentitan/sw/device/tests/BUILD (did you mean rv_dm_access_after_wakeup_dev_sim_dv, or rv_dm_access_after_wakeup_rma_sim_dv?)
ERROR: no such target '//sw/device/tests:rv_dm_access_after_wakeup_sim_dv': target 'rv_dm_access_after_wakeup_sim_dv' not declared in package 'sw/device/tests' defined by /nightly/current_run/opentitan/sw/device/tests/BUILD (did you mean rv_dm_access_after_wakeup_dev_sim_dv, or rv_dm_access_after_wakeup_rma_sim_dv?)
ERROR: Build did NOT complete successfully
_run_cmd -> had a non-zero return code of 1.
make: *** [/nightly/current_run/opentitan/hw/dv/tools/dvsim/sim.mk:58: sw_build] Error 1
chip_sw_rv_dm_access_after_escalation_reset 7972794160690511896305321996855992659207623438191992615076632243671857932852 None
Use --verbose_failures to see the command lines of failed build steps.
ERROR: Analysis of target '//sw/device/tests:alert_handler_escalation_test_sim_dv' failed; build aborted: Target //sw/device/tests:alert_handler_escalation_test_sim_dv is incompatible and cannot be built, but was explicitly requested.
Dependency chain:
//sw/device/tests:alert_handler_escalation_test_sim_dv (f2055d) <-- target platform (//toolchain:opentitan_platform) didn't satisfy constraint @@platforms//:incompatible
INFO: Elapsed time: 0.618s, Critical Path: 0.02s
INFO: 1 process: 1 internal.
ERROR: Build did NOT complete successfully
_run_cmd -> had a non-zero return code of 1.
make: *** [/nightly/current_run/opentitan/hw/dv/tools/dvsim/sim.mk:58: sw_build] Error 1
chip_sw_power_virus 22406560437354623087497740911546438994530622493021720881824819987970004686403 None
ERROR: Analysis of target '//sw/device/tests:power_virus_systemtest_sim_dv' failed; build aborted: Target //sw/device/tests:power_virus_systemtest_sim_dv is incompatible and cannot be built, but was explicitly requested.
Dependency chain:
//sw/device/tests:power_virus_systemtest_sim_dv (f2055d) <-- target platform (//toolchain:opentitan_platform) didn't satisfy constraint @@platforms//:incompatible
INFO: Elapsed time: 1.208s, Critical Path: 0.02s
INFO: 1 process: 1 internal.
ERROR: Build did NOT complete successfully
FAILED:
_run_cmd -> had a non-zero return code of 1.
make: *** [/nightly/current_run/opentitan/hw/dv/tools/dvsim/sim.mk:58: sw_build] Error 1
base_rom_e2e_smoke 35015562320713641369088395175564282398939364576609516677080202751714378245881 None
_deploy_software_collateral(args)
~~~~~~~~~~~~~~~~~~~~~~~~~~~^^^^^^
File "/nightly/current_run/opentitan/util/py/scripts/build_sw_collateral_for_sim.py", line 324, in _deploy_software_collateral
image_string = ImageString(image)
File "<string>", line 4, in __init__
File "/nightly/current_run/opentitan/util/py/scripts/build_sw_collateral_for_sim.py", line 256, in __post_init__
assert flag in KNOWN_FLAGS, f"Unknown flag '{flag}' used in sw_image '{self.raw}'"
^^^^^^^^^^^^^^^^^^^
AssertionError: Unknown flag 'test_in_second_rom' used in sw_image '//sw/device/silicon_creator/rom/e2e:base_rom_e2e_smoke:7:test_in_second_rom'
make: *** [/nightly/current_run/opentitan/hw/dv/tools/dvsim/sim.mk:58: sw_build] Error 1
rom_e2e_smoke 100646411540127982930525954602093123575882576110172436591350205111523154064377 None
---- STDOUT ----
---- STDERR ----
WARNING: Target pattern parsing failed.
ERROR: Skipping '//sw/device/silicon_creator/rom/e2e:empty_test_slot_a_sim_dv': no such target '//sw/device/silicon_creator/rom/e2e:empty_test_slot_a_sim_dv': target 'empty_test_slot_a_sim_dv' not declared in package 'sw/device/silicon_creator/rom/e2e' defined by /nightly/current_run/opentitan/sw/device/silicon_creator/rom/e2e/BUILD
ERROR: no such target '//sw/device/silicon_creator/rom/e2e:empty_test_slot_a_sim_dv': target 'empty_test_slot_a_sim_dv' not declared in package 'sw/device/silicon_creator/rom/e2e' defined by /nightly/current_run/opentitan/sw/device/silicon_creator/rom/e2e/BUILD
ERROR: Build did NOT complete successfully
_run_cmd -> had a non-zero return code of 1.
make: *** [/nightly/current_run/opentitan/hw/dv/tools/dvsim/sim.mk:58: sw_build] Error 1
rom_e2e_shutdown_exception_c 58444893253599919796891990643756756213451382026630811433560811892012101332344 None
Another command (pid=589166) is running. Waiting for it to complete on the server (server_pid=196006)...
Another command (pid=602898) is running. Waiting for it to complete on the server (server_pid=196006)...
Another command (pid=558237) is running. Waiting for it to complete on the server (server_pid=196006)...
WARNING: Target pattern parsing failed.
ERROR: Skipping '//sw/device/silicon_creator/rom:rom_with_fake_keys_sim_dv': no such target '//sw/device/silicon_creator/rom:rom_with_fake_keys_sim_dv': target 'rom_with_fake_keys_sim_dv' not declared in package 'sw/device/silicon_creator/rom' defined by /nightly/current_run/opentitan/sw/device/silicon_creator/rom/BUILD
ERROR: no such target '//sw/device/silicon_creator/rom:rom_with_fake_keys_sim_dv': target 'rom_with_fake_keys_sim_dv' not declared in package 'sw/device/silicon_creator/rom' defined by /nightly/current_run/opentitan/sw/device/silicon_creator/rom/BUILD
ERROR: Build did NOT complete successfully
_run_cmd -> had a non-zero return code of 1.
make: *** [/nightly/current_run/opentitan/hw/dv/tools/dvsim/sim.mk:58: sw_build] Error 1
rom_e2e_shutdown_output 3777493139815330417849646585877823713961126478940780190140246926207737409790 None
Another command (pid=568620) is running. Waiting for it to complete on the server (server_pid=196006)...
Another command (pid=525077) is running. Waiting for it to complete on the server (server_pid=196006)...
Another command (pid=574032) is running. Waiting for it to complete on the server (server_pid=196006)...
WARNING: Target pattern parsing failed.
ERROR: Skipping '//sw/device/silicon_creator/rom/e2e:empty_test_slot_a_sim_dv': no such target '//sw/device/silicon_creator/rom/e2e:empty_test_slot_a_sim_dv': target 'empty_test_slot_a_sim_dv' not declared in package 'sw/device/silicon_creator/rom/e2e' defined by /nightly/current_run/opentitan/sw/device/silicon_creator/rom/e2e/BUILD
ERROR: no such target '//sw/device/silicon_creator/rom/e2e:empty_test_slot_a_sim_dv': target 'empty_test_slot_a_sim_dv' not declared in package 'sw/device/silicon_creator/rom/e2e' defined by /nightly/current_run/opentitan/sw/device/silicon_creator/rom/e2e/BUILD
ERROR: Build did NOT complete successfully
_run_cmd -> had a non-zero return code of 1.
make: *** [/nightly/current_run/opentitan/hw/dv/tools/dvsim/sim.mk:58: sw_build] Error 1
rom_e2e_boot_policy_valid_a_good_b_good_test_unlocked0 28864240882082194037544296809236689380307892881567988518656901881950906968158 None
---- STDERR ----
Another command (pid=271645) is running. Waiting for it to complete on the server (server_pid=196006)...
Another command (pid=294434) is running. Waiting for it to complete on the server (server_pid=196006)...
WARNING: Target pattern parsing failed.
ERROR: Skipping '//sw/device/silicon_creator/rom/e2e:empty_test_slot_a_sim_dv': no such target '//sw/device/silicon_creator/rom/e2e:empty_test_slot_a_sim_dv': target 'empty_test_slot_a_sim_dv' not declared in package 'sw/device/silicon_creator/rom/e2e' defined by /nightly/current_run/opentitan/sw/device/silicon_creator/rom/e2e/BUILD
ERROR: no such target '//sw/device/silicon_creator/rom/e2e:empty_test_slot_a_sim_dv': target 'empty_test_slot_a_sim_dv' not declared in package 'sw/device/silicon_creator/rom/e2e' defined by /nightly/current_run/opentitan/sw/device/silicon_creator/rom/e2e/BUILD
ERROR: Build did NOT complete successfully
_run_cmd -> had a non-zero return code of 1.
make: *** [/nightly/current_run/opentitan/hw/dv/tools/dvsim/sim.mk:58: sw_build] Error 1
rom_e2e_boot_policy_valid_a_good_b_good_dev 19079227923080934682505211044556755640322665507836303946248894264174454280920 None
Another command (pid=458091) is running. Waiting for it to complete on the server (server_pid=196006)...
Another command (pid=501077) is running. Waiting for it to complete on the server (server_pid=196006)...
Another command (pid=490278) is running. Waiting for it to complete on the server (server_pid=196006)...
WARNING: Target pattern parsing failed.
ERROR: Skipping '//sw/device/silicon_creator/rom/e2e:empty_test_slot_a_sim_dv': no such target '//sw/device/silicon_creator/rom/e2e:empty_test_slot_a_sim_dv': target 'empty_test_slot_a_sim_dv' not declared in package 'sw/device/silicon_creator/rom/e2e' defined by /nightly/current_run/opentitan/sw/device/silicon_creator/rom/e2e/BUILD
ERROR: no such target '//sw/device/silicon_creator/rom/e2e:empty_test_slot_a_sim_dv': target 'empty_test_slot_a_sim_dv' not declared in package 'sw/device/silicon_creator/rom/e2e' defined by /nightly/current_run/opentitan/sw/device/silicon_creator/rom/e2e/BUILD
ERROR: Build did NOT complete successfully
_run_cmd -> had a non-zero return code of 1.
make: *** [/nightly/current_run/opentitan/hw/dv/tools/dvsim/sim.mk:58: sw_build] Error 1
rom_e2e_boot_policy_valid_a_good_b_good_prod 85208096518480059637419101250996223596198384525806633347542896475129118281432 None
---- STDERR ----
Another command (pid=467405) is running. Waiting for it to complete on the server (server_pid=196006)...
WARNING: Target pattern parsing failed.
ERROR: Skipping '//sw/device/silicon_creator/rom/e2e:empty_test_slot_a_sim_dv': no such target '//sw/device/silicon_creator/rom/e2e:empty_test_slot_a_sim_dv': target 'empty_test_slot_a_sim_dv' not declared in package 'sw/device/silicon_creator/rom/e2e' defined by /nightly/current_run/opentitan/sw/device/silicon_creator/rom/e2e/BUILD
ERROR: no such target '//sw/device/silicon_creator/rom/e2e:empty_test_slot_a_sim_dv': target 'empty_test_slot_a_sim_dv' not declared in package 'sw/device/silicon_creator/rom/e2e' defined by /nightly/current_run/opentitan/sw/device/silicon_creator/rom/e2e/BUILD
ERROR: Build did NOT complete successfully
_run_cmd -> had a non-zero return code of 1.
make: *** [/nightly/current_run/opentitan/hw/dv/tools/dvsim/sim.mk:58: sw_build] Error 1
rom_e2e_boot_policy_valid_a_good_b_good_prod_end 108135485107945841921743822078796031267624601079603764224832712917705364434817 None
Another command (pid=542772) is running. Waiting for it to complete on the server (server_pid=196006)...
Another command (pid=534060) is running. Waiting for it to complete on the server (server_pid=196006)...
Another command (pid=552348) is running. Waiting for it to complete on the server (server_pid=196006)...
WARNING: Target pattern parsing failed.
ERROR: Skipping '//sw/device/silicon_creator/rom/e2e:empty_test_slot_a_sim_dv': no such target '//sw/device/silicon_creator/rom/e2e:empty_test_slot_a_sim_dv': target 'empty_test_slot_a_sim_dv' not declared in package 'sw/device/silicon_creator/rom/e2e' defined by /nightly/current_run/opentitan/sw/device/silicon_creator/rom/e2e/BUILD
ERROR: no such target '//sw/device/silicon_creator/rom/e2e:empty_test_slot_a_sim_dv': target 'empty_test_slot_a_sim_dv' not declared in package 'sw/device/silicon_creator/rom/e2e' defined by /nightly/current_run/opentitan/sw/device/silicon_creator/rom/e2e/BUILD
ERROR: Build did NOT complete successfully
_run_cmd -> had a non-zero return code of 1.
make: *** [/nightly/current_run/opentitan/hw/dv/tools/dvsim/sim.mk:58: sw_build] Error 1
rom_e2e_boot_policy_valid_a_good_b_good_rma 36210655043882639170585983284728423749372945090857041346065276047548616973505 None
Another command (pid=505402) is running. Waiting for it to complete on the server (server_pid=196006)...
Another command (pid=481312) is running. Waiting for it to complete on the server (server_pid=196006)...
Another command (pid=476554) is running. Waiting for it to complete on the server (server_pid=196006)...
WARNING: Target pattern parsing failed.
ERROR: Skipping '//sw/device/silicon_creator/rom/e2e:empty_test_slot_a_sim_dv': no such target '//sw/device/silicon_creator/rom/e2e:empty_test_slot_a_sim_dv': target 'empty_test_slot_a_sim_dv' not declared in package 'sw/device/silicon_creator/rom/e2e' defined by /nightly/current_run/opentitan/sw/device/silicon_creator/rom/e2e/BUILD
ERROR: no such target '//sw/device/silicon_creator/rom/e2e:empty_test_slot_a_sim_dv': target 'empty_test_slot_a_sim_dv' not declared in package 'sw/device/silicon_creator/rom/e2e' defined by /nightly/current_run/opentitan/sw/device/silicon_creator/rom/e2e/BUILD
ERROR: Build did NOT complete successfully
_run_cmd -> had a non-zero return code of 1.
make: *** [/nightly/current_run/opentitan/hw/dv/tools/dvsim/sim.mk:58: sw_build] Error 1
rom_e2e_boot_policy_valid_a_good_b_bad_test_unlocked0 67637119794954923900814230088017318092992357496455128710800330092648938599998 None
Another command (pid=271645) is running. Waiting for it to complete on the server (server_pid=196006)...
Another command (pid=294434) is running. Waiting for it to complete on the server (server_pid=196006)...
Another command (pid=315164) is running. Waiting for it to complete on the server (server_pid=196006)...
WARNING: Target pattern parsing failed.
ERROR: Skipping '//sw/device/silicon_creator/rom/e2e:empty_test_slot_a_sim_dv': no such target '//sw/device/silicon_creator/rom/e2e:empty_test_slot_a_sim_dv': target 'empty_test_slot_a_sim_dv' not declared in package 'sw/device/silicon_creator/rom/e2e' defined by /nightly/current_run/opentitan/sw/device/silicon_creator/rom/e2e/BUILD
ERROR: no such target '//sw/device/silicon_creator/rom/e2e:empty_test_slot_a_sim_dv': target 'empty_test_slot_a_sim_dv' not declared in package 'sw/device/silicon_creator/rom/e2e' defined by /nightly/current_run/opentitan/sw/device/silicon_creator/rom/e2e/BUILD
ERROR: Build did NOT complete successfully
_run_cmd -> had a non-zero return code of 1.
make: *** [/nightly/current_run/opentitan/hw/dv/tools/dvsim/sim.mk:58: sw_build] Error 1
rom_e2e_boot_policy_valid_a_good_b_bad_dev 97684943773239485908086888353958334553051920787277852623065227128004697579045 None
---- STDERR ----
Another command (pid=467405) is running. Waiting for it to complete on the server (server_pid=196006)...
Another command (pid=483132) is running. Waiting for it to complete on the server (server_pid=196006)...
WARNING: Target pattern parsing failed.
ERROR: Skipping '//sw/device/silicon_creator/rom/e2e:empty_test_slot_a_sim_dv': no such target '//sw/device/silicon_creator/rom/e2e:empty_test_slot_a_sim_dv': target 'empty_test_slot_a_sim_dv' not declared in package 'sw/device/silicon_creator/rom/e2e' defined by /nightly/current_run/opentitan/sw/device/silicon_creator/rom/e2e/BUILD
ERROR: no such target '//sw/device/silicon_creator/rom/e2e:empty_test_slot_a_sim_dv': target 'empty_test_slot_a_sim_dv' not declared in package 'sw/device/silicon_creator/rom/e2e' defined by /nightly/current_run/opentitan/sw/device/silicon_creator/rom/e2e/BUILD
ERROR: Build did NOT complete successfully
_run_cmd -> had a non-zero return code of 1.
make: *** [/nightly/current_run/opentitan/hw/dv/tools/dvsim/sim.mk:58: sw_build] Error 1
rom_e2e_boot_policy_valid_a_good_b_bad_prod 62705335403318515602084282567411930559052356300420246465281326961546535895850 None
Another command (pid=483132) is running. Waiting for it to complete on the server (server_pid=196006)...
Another command (pid=491747) is running. Waiting for it to complete on the server (server_pid=196006)...
Another command (pid=487455) is running. Waiting for it to complete on the server (server_pid=196006)...
WARNING: Target pattern parsing failed.
ERROR: Skipping '//sw/device/silicon_creator/rom/e2e:empty_test_slot_a_sim_dv': no such target '//sw/device/silicon_creator/rom/e2e:empty_test_slot_a_sim_dv': target 'empty_test_slot_a_sim_dv' not declared in package 'sw/device/silicon_creator/rom/e2e' defined by /nightly/current_run/opentitan/sw/device/silicon_creator/rom/e2e/BUILD
ERROR: no such target '//sw/device/silicon_creator/rom/e2e:empty_test_slot_a_sim_dv': target 'empty_test_slot_a_sim_dv' not declared in package 'sw/device/silicon_creator/rom/e2e' defined by /nightly/current_run/opentitan/sw/device/silicon_creator/rom/e2e/BUILD
ERROR: Build did NOT complete successfully
_run_cmd -> had a non-zero return code of 1.
make: *** [/nightly/current_run/opentitan/hw/dv/tools/dvsim/sim.mk:58: sw_build] Error 1
rom_e2e_boot_policy_valid_a_good_b_bad_prod_end 15348912373781924964877368427817643274879051550625042476709327763008493229528 None
Another command (pid=513023) is running. Waiting for it to complete on the server (server_pid=196006)...
Another command (pid=543268) is running. Waiting for it to complete on the server (server_pid=196006)...
Another command (pid=542772) is running. Waiting for it to complete on the server (server_pid=196006)...
WARNING: Target pattern parsing failed.
ERROR: Skipping '//sw/device/silicon_creator/rom/e2e:empty_test_slot_a_sim_dv': no such target '//sw/device/silicon_creator/rom/e2e:empty_test_slot_a_sim_dv': target 'empty_test_slot_a_sim_dv' not declared in package 'sw/device/silicon_creator/rom/e2e' defined by /nightly/current_run/opentitan/sw/device/silicon_creator/rom/e2e/BUILD
ERROR: no such target '//sw/device/silicon_creator/rom/e2e:empty_test_slot_a_sim_dv': target 'empty_test_slot_a_sim_dv' not declared in package 'sw/device/silicon_creator/rom/e2e' defined by /nightly/current_run/opentitan/sw/device/silicon_creator/rom/e2e/BUILD
ERROR: Build did NOT complete successfully
_run_cmd -> had a non-zero return code of 1.
make: *** [/nightly/current_run/opentitan/hw/dv/tools/dvsim/sim.mk:58: sw_build] Error 1
rom_e2e_boot_policy_valid_a_good_b_bad_rma 31899091490797121567086732384495235236776341273622698603986643553528118484052 None
Another command (pid=500666) is running. Waiting for it to complete on the server (server_pid=196006)...
Another command (pid=458091) is running. Waiting for it to complete on the server (server_pid=196006)...
Another command (pid=501077) is running. Waiting for it to complete on the server (server_pid=196006)...
WARNING: Target pattern parsing failed.
ERROR: Skipping '//sw/device/silicon_creator/rom/e2e:empty_test_slot_a_sim_dv': no such target '//sw/device/silicon_creator/rom/e2e:empty_test_slot_a_sim_dv': target 'empty_test_slot_a_sim_dv' not declared in package 'sw/device/silicon_creator/rom/e2e' defined by /nightly/current_run/opentitan/sw/device/silicon_creator/rom/e2e/BUILD
ERROR: no such target '//sw/device/silicon_creator/rom/e2e:empty_test_slot_a_sim_dv': target 'empty_test_slot_a_sim_dv' not declared in package 'sw/device/silicon_creator/rom/e2e' defined by /nightly/current_run/opentitan/sw/device/silicon_creator/rom/e2e/BUILD
ERROR: Build did NOT complete successfully
_run_cmd -> had a non-zero return code of 1.
make: *** [/nightly/current_run/opentitan/hw/dv/tools/dvsim/sim.mk:58: sw_build] Error 1
rom_e2e_boot_policy_valid_a_bad_b_good_test_unlocked0 65561629176423699480645207821012902371287658079747625994763806993036275381537 None
Another command (pid=286039) is running. Waiting for it to complete on the server (server_pid=196006)...
Another command (pid=315164) is running. Waiting for it to complete on the server (server_pid=196006)...
Another command (pid=304977) is running. Waiting for it to complete on the server (server_pid=196006)...
WARNING: Target pattern parsing failed.
ERROR: Skipping '//sw/device/silicon_creator/rom/e2e:empty_test_slot_b_sim_dv': no such target '//sw/device/silicon_creator/rom/e2e:empty_test_slot_b_sim_dv': target 'empty_test_slot_b_sim_dv' not declared in package 'sw/device/silicon_creator/rom/e2e' defined by /nightly/current_run/opentitan/sw/device/silicon_creator/rom/e2e/BUILD
ERROR: no such target '//sw/device/silicon_creator/rom/e2e:empty_test_slot_b_sim_dv': target 'empty_test_slot_b_sim_dv' not declared in package 'sw/device/silicon_creator/rom/e2e' defined by /nightly/current_run/opentitan/sw/device/silicon_creator/rom/e2e/BUILD
ERROR: Build did NOT complete successfully
_run_cmd -> had a non-zero return code of 1.
make: *** [/nightly/current_run/opentitan/hw/dv/tools/dvsim/sim.mk:58: sw_build] Error 1
rom_e2e_boot_policy_valid_a_bad_b_good_dev 15628888659019515344194611654674873245396735848700131563272439261887778217382 None
---- STDERR ----
Another command (pid=548745) is running. Waiting for it to complete on the server (server_pid=196006)...
Another command (pid=568981) is running. Waiting for it to complete on the server (server_pid=196006)...
WARNING: Target pattern parsing failed.
ERROR: Skipping '//sw/device/silicon_creator/rom/e2e:empty_test_slot_b_sim_dv': no such target '//sw/device/silicon_creator/rom/e2e:empty_test_slot_b_sim_dv': target 'empty_test_slot_b_sim_dv' not declared in package 'sw/device/silicon_creator/rom/e2e' defined by /nightly/current_run/opentitan/sw/device/silicon_creator/rom/e2e/BUILD
ERROR: no such target '//sw/device/silicon_creator/rom/e2e:empty_test_slot_b_sim_dv': target 'empty_test_slot_b_sim_dv' not declared in package 'sw/device/silicon_creator/rom/e2e' defined by /nightly/current_run/opentitan/sw/device/silicon_creator/rom/e2e/BUILD
ERROR: Build did NOT complete successfully
_run_cmd -> had a non-zero return code of 1.
make: *** [/nightly/current_run/opentitan/hw/dv/tools/dvsim/sim.mk:58: sw_build] Error 1
rom_e2e_boot_policy_valid_a_bad_b_good_prod 18009670179564632665564030425346465713608130421689790886880065732211927156449 None
Another command (pid=458091) is running. Waiting for it to complete on the server (server_pid=196006)...
Another command (pid=501077) is running. Waiting for it to complete on the server (server_pid=196006)...
Another command (pid=497252) is running. Waiting for it to complete on the server (server_pid=196006)...
WARNING: Target pattern parsing failed.
ERROR: Skipping '//sw/device/silicon_creator/rom/e2e:empty_test_slot_b_sim_dv': no such target '//sw/device/silicon_creator/rom/e2e:empty_test_slot_b_sim_dv': target 'empty_test_slot_b_sim_dv' not declared in package 'sw/device/silicon_creator/rom/e2e' defined by /nightly/current_run/opentitan/sw/device/silicon_creator/rom/e2e/BUILD
ERROR: no such target '//sw/device/silicon_creator/rom/e2e:empty_test_slot_b_sim_dv': target 'empty_test_slot_b_sim_dv' not declared in package 'sw/device/silicon_creator/rom/e2e' defined by /nightly/current_run/opentitan/sw/device/silicon_creator/rom/e2e/BUILD
ERROR: Build did NOT complete successfully
_run_cmd -> had a non-zero return code of 1.
make: *** [/nightly/current_run/opentitan/hw/dv/tools/dvsim/sim.mk:58: sw_build] Error 1
rom_e2e_boot_policy_valid_a_bad_b_good_prod_end 91597619571903729758550819128741168356717347221612395705128399508694696607251 None
Another command (pid=515968) is running. Waiting for it to complete on the server (server_pid=196006)...
Another command (pid=523094) is running. Waiting for it to complete on the server (server_pid=196006)...
Another command (pid=521632) is running. Waiting for it to complete on the server (server_pid=196006)...
WARNING: Target pattern parsing failed.
ERROR: Skipping '//sw/device/silicon_creator/rom/e2e:empty_test_slot_b_sim_dv': no such target '//sw/device/silicon_creator/rom/e2e:empty_test_slot_b_sim_dv': target 'empty_test_slot_b_sim_dv' not declared in package 'sw/device/silicon_creator/rom/e2e' defined by /nightly/current_run/opentitan/sw/device/silicon_creator/rom/e2e/BUILD
ERROR: no such target '//sw/device/silicon_creator/rom/e2e:empty_test_slot_b_sim_dv': target 'empty_test_slot_b_sim_dv' not declared in package 'sw/device/silicon_creator/rom/e2e' defined by /nightly/current_run/opentitan/sw/device/silicon_creator/rom/e2e/BUILD
ERROR: Build did NOT complete successfully
_run_cmd -> had a non-zero return code of 1.
make: *** [/nightly/current_run/opentitan/hw/dv/tools/dvsim/sim.mk:58: sw_build] Error 1
rom_e2e_boot_policy_valid_a_bad_b_good_rma 51231884661787528232914052993196573278265677231789981699121681993877950553992 None
Another command (pid=495332) is running. Waiting for it to complete on the server (server_pid=196006)...
Another command (pid=458091) is running. Waiting for it to complete on the server (server_pid=196006)...
Another command (pid=501077) is running. Waiting for it to complete on the server (server_pid=196006)...
WARNING: Target pattern parsing failed.
ERROR: Skipping '//sw/device/silicon_creator/rom/e2e:empty_test_slot_b_sim_dv': no such target '//sw/device/silicon_creator/rom/e2e:empty_test_slot_b_sim_dv': target 'empty_test_slot_b_sim_dv' not declared in package 'sw/device/silicon_creator/rom/e2e' defined by /nightly/current_run/opentitan/sw/device/silicon_creator/rom/e2e/BUILD
ERROR: no such target '//sw/device/silicon_creator/rom/e2e:empty_test_slot_b_sim_dv': target 'empty_test_slot_b_sim_dv' not declared in package 'sw/device/silicon_creator/rom/e2e' defined by /nightly/current_run/opentitan/sw/device/silicon_creator/rom/e2e/BUILD
ERROR: Build did NOT complete successfully
_run_cmd -> had a non-zero return code of 1.
make: *** [/nightly/current_run/opentitan/hw/dv/tools/dvsim/sim.mk:58: sw_build] Error 1
rom_e2e_sigverify_always_a_bad_b_bad_test_unlocked0 110274673148454028467158961302174965410289341518125156954801347781995563799424 None
---- STDERR ----
Another command (pid=332069) is running. Waiting for it to complete on the server (server_pid=196006)...
WARNING: Target pattern parsing failed.
ERROR: Skipping '//sw/device/silicon_creator/rom/e2e:otp_img_sigverify_always_test_unlocked0': no such target '//sw/device/silicon_creator/rom/e2e:otp_img_sigverify_always_test_unlocked0': target 'otp_img_sigverify_always_test_unlocked0' not declared in package 'sw/device/silicon_creator/rom/e2e' defined by /nightly/current_run/opentitan/sw/device/silicon_creator/rom/e2e/BUILD
ERROR: no such target '//sw/device/silicon_creator/rom/e2e:otp_img_sigverify_always_test_unlocked0': target 'otp_img_sigverify_always_test_unlocked0' not declared in package 'sw/device/silicon_creator/rom/e2e' defined by /nightly/current_run/opentitan/sw/device/silicon_creator/rom/e2e/BUILD
ERROR: Build did NOT complete successfully
_run_cmd -> had a non-zero return code of 1.
make: *** [/nightly/current_run/opentitan/hw/dv/tools/dvsim/sim.mk:58: sw_build] Error 1
rom_e2e_sigverify_always_a_bad_b_bad_dev 55056728581560099036174448864800495833963238568312864300239719256293010687625 None
---- STDERR ----
Another command (pid=599161) is running. Waiting for it to complete on the server (server_pid=196006)...
WARNING: Target pattern parsing failed.
ERROR: Skipping '//sw/device/silicon_creator/rom/e2e:otp_img_sigverify_always_dev': no such target '//sw/device/silicon_creator/rom/e2e:otp_img_sigverify_always_dev': target 'otp_img_sigverify_always_dev' not declared in package 'sw/device/silicon_creator/rom/e2e' defined by /nightly/current_run/opentitan/sw/device/silicon_creator/rom/e2e/BUILD
ERROR: no such target '//sw/device/silicon_creator/rom/e2e:otp_img_sigverify_always_dev': target 'otp_img_sigverify_always_dev' not declared in package 'sw/device/silicon_creator/rom/e2e' defined by /nightly/current_run/opentitan/sw/device/silicon_creator/rom/e2e/BUILD
ERROR: Build did NOT complete successfully
_run_cmd -> had a non-zero return code of 1.
make: *** [/nightly/current_run/opentitan/hw/dv/tools/dvsim/sim.mk:58: sw_build] Error 1
rom_e2e_sigverify_always_a_bad_b_bad_prod 91486537265261154958678714612343448304020490076733350999751556549285879095992 None
---- STDERR ----
Another command (pid=525077) is running. Waiting for it to complete on the server (server_pid=196006)...
WARNING: Target pattern parsing failed.
ERROR: Skipping '//sw/device/silicon_creator/rom/e2e:otp_img_sigverify_always_prod': no such target '//sw/device/silicon_creator/rom/e2e:otp_img_sigverify_always_prod': target 'otp_img_sigverify_always_prod' not declared in package 'sw/device/silicon_creator/rom/e2e' defined by /nightly/current_run/opentitan/sw/device/silicon_creator/rom/e2e/BUILD
ERROR: no such target '//sw/device/silicon_creator/rom/e2e:otp_img_sigverify_always_prod': target 'otp_img_sigverify_always_prod' not declared in package 'sw/device/silicon_creator/rom/e2e' defined by /nightly/current_run/opentitan/sw/device/silicon_creator/rom/e2e/BUILD
ERROR: Build did NOT complete successfully
_run_cmd -> had a non-zero return code of 1.
make: *** [/nightly/current_run/opentitan/hw/dv/tools/dvsim/sim.mk:58: sw_build] Error 1
rom_e2e_sigverify_always_a_bad_b_bad_prod_end 37097342223350747449428144373494184568423823462417412805603144701200701208 None
Another command (pid=602898) is running. Waiting for it to complete on the server (server_pid=196006)...
Another command (pid=582191) is running. Waiting for it to complete on the server (server_pid=196006)...
Another command (pid=571316) is running. Waiting for it to complete on the server (server_pid=196006)...
WARNING: Target pattern parsing failed.
ERROR: Skipping '//sw/device/silicon_creator/rom/e2e:otp_img_sigverify_always_prod_end': no such target '//sw/device/silicon_creator/rom/e2e:otp_img_sigverify_always_prod_end': target 'otp_img_sigverify_always_prod_end' not declared in package 'sw/device/silicon_creator/rom/e2e' defined by /nightly/current_run/opentitan/sw/device/silicon_creator/rom/e2e/BUILD
ERROR: no such target '//sw/device/silicon_creator/rom/e2e:otp_img_sigverify_always_prod_end': target 'otp_img_sigverify_always_prod_end' not declared in package 'sw/device/silicon_creator/rom/e2e' defined by /nightly/current_run/opentitan/sw/device/silicon_creator/rom/e2e/BUILD
ERROR: Build did NOT complete successfully
_run_cmd -> had a non-zero return code of 1.
make: *** [/nightly/current_run/opentitan/hw/dv/tools/dvsim/sim.mk:58: sw_build] Error 1
rom_e2e_sigverify_always_a_bad_b_bad_rma 65380650484385752279761061267050998301926576860095753626087653987516844276828 None
Another command (pid=602898) is running. Waiting for it to complete on the server (server_pid=196006)...
Another command (pid=558237) is running. Waiting for it to complete on the server (server_pid=196006)...
Another command (pid=586510) is running. Waiting for it to complete on the server (server_pid=196006)...
WARNING: Target pattern parsing failed.
ERROR: Skipping '//sw/device/silicon_creator/rom/e2e:otp_img_sigverify_always_rma': no such target '//sw/device/silicon_creator/rom/e2e:otp_img_sigverify_always_rma': target 'otp_img_sigverify_always_rma' not declared in package 'sw/device/silicon_creator/rom/e2e' defined by /nightly/current_run/opentitan/sw/device/silicon_creator/rom/e2e/BUILD
ERROR: no such target '//sw/device/silicon_creator/rom/e2e:otp_img_sigverify_always_rma': target 'otp_img_sigverify_always_rma' not declared in package 'sw/device/silicon_creator/rom/e2e' defined by /nightly/current_run/opentitan/sw/device/silicon_creator/rom/e2e/BUILD
ERROR: Build did NOT complete successfully
_run_cmd -> had a non-zero return code of 1.
make: *** [/nightly/current_run/opentitan/hw/dv/tools/dvsim/sim.mk:58: sw_build] Error 1
rom_e2e_sigverify_always_a_bad_b_nothing_test_unlocked0 14019686000181899507850025443486736331499680209085890084438225073942431276435 None
---- STDERR ----
Another command (pid=307227) is running. Waiting for it to complete on the server (server_pid=196006)...
Another command (pid=349925) is running. Waiting for it to complete on the server (server_pid=196006)...
WARNING: Target pattern parsing failed.
ERROR: Skipping '//sw/device/silicon_creator/rom/e2e:otp_img_sigverify_always_test_unlocked0': no such target '//sw/device/silicon_creator/rom/e2e:otp_img_sigverify_always_test_unlocked0': target 'otp_img_sigverify_always_test_unlocked0' not declared in package 'sw/device/silicon_creator/rom/e2e' defined by /nightly/current_run/opentitan/sw/device/silicon_creator/rom/e2e/BUILD
ERROR: no such target '//sw/device/silicon_creator/rom/e2e:otp_img_sigverify_always_test_unlocked0': target 'otp_img_sigverify_always_test_unlocked0' not declared in package 'sw/device/silicon_creator/rom/e2e' defined by /nightly/current_run/opentitan/sw/device/silicon_creator/rom/e2e/BUILD
ERROR: Build did NOT complete successfully
_run_cmd -> had a non-zero return code of 1.
make: *** [/nightly/current_run/opentitan/hw/dv/tools/dvsim/sim.mk:58: sw_build] Error 1
rom_e2e_sigverify_always_a_bad_b_nothing_dev 46042830106040365837322480665095155734900861931017353311950867514487929194806 None
Another command (pid=557773) is running. Waiting for it to complete on the server (server_pid=196006)...
Another command (pid=590201) is running. Waiting for it to complete on the server (server_pid=196006)...
Another command (pid=593344) is running. Waiting for it to complete on the server (server_pid=196006)...
WARNING: Target pattern parsing failed.
ERROR: Skipping '//sw/device/silicon_creator/rom/e2e:otp_img_sigverify_always_dev': no such target '//sw/device/silicon_creator/rom/e2e:otp_img_sigverify_always_dev': target 'otp_img_sigverify_always_dev' not declared in package 'sw/device/silicon_creator/rom/e2e' defined by /nightly/current_run/opentitan/sw/device/silicon_creator/rom/e2e/BUILD
ERROR: no such target '//sw/device/silicon_creator/rom/e2e:otp_img_sigverify_always_dev': target 'otp_img_sigverify_always_dev' not declared in package 'sw/device/silicon_creator/rom/e2e' defined by /nightly/current_run/opentitan/sw/device/silicon_creator/rom/e2e/BUILD
ERROR: Build did NOT complete successfully
_run_cmd -> had a non-zero return code of 1.
make: *** [/nightly/current_run/opentitan/hw/dv/tools/dvsim/sim.mk:58: sw_build] Error 1
rom_e2e_sigverify_always_a_bad_b_nothing_prod 73348008032515060098722389680106066554530075741905456679079072414509741731605 None
Another command (pid=567600) is running. Waiting for it to complete on the server (server_pid=196006)...
Another command (pid=576707) is running. Waiting for it to complete on the server (server_pid=196006)...
Another command (pid=558798) is running. Waiting for it to complete on the server (server_pid=196006)...
WARNING: Target pattern parsing failed.
ERROR: Skipping '//sw/device/silicon_creator/rom/e2e:otp_img_sigverify_always_prod': no such target '//sw/device/silicon_creator/rom/e2e:otp_img_sigverify_always_prod': target 'otp_img_sigverify_always_prod' not declared in package 'sw/device/silicon_creator/rom/e2e' defined by /nightly/current_run/opentitan/sw/device/silicon_creator/rom/e2e/BUILD
ERROR: no such target '//sw/device/silicon_creator/rom/e2e:otp_img_sigverify_always_prod': target 'otp_img_sigverify_always_prod' not declared in package 'sw/device/silicon_creator/rom/e2e' defined by /nightly/current_run/opentitan/sw/device/silicon_creator/rom/e2e/BUILD
ERROR: Build did NOT complete successfully
_run_cmd -> had a non-zero return code of 1.
make: *** [/nightly/current_run/opentitan/hw/dv/tools/dvsim/sim.mk:58: sw_build] Error 1
rom_e2e_sigverify_always_a_bad_b_nothing_prod_end 57317309183837184516727188770143474351765052817907356693468386584699535572675 None
Another command (pid=525077) is running. Waiting for it to complete on the server (server_pid=196006)...
Another command (pid=574032) is running. Waiting for it to complete on the server (server_pid=196006)...
Another command (pid=547579) is running. Waiting for it to complete on the server (server_pid=196006)...
WARNING: Target pattern parsing failed.
ERROR: Skipping '//sw/device/silicon_creator/rom/e2e:otp_img_sigverify_always_prod_end': no such target '//sw/device/silicon_creator/rom/e2e:otp_img_sigverify_always_prod_end': target 'otp_img_sigverify_always_prod_end' not declared in package 'sw/device/silicon_creator/rom/e2e' defined by /nightly/current_run/opentitan/sw/device/silicon_creator/rom/e2e/BUILD
ERROR: no such target '//sw/device/silicon_creator/rom/e2e:otp_img_sigverify_always_prod_end': target 'otp_img_sigverify_always_prod_end' not declared in package 'sw/device/silicon_creator/rom/e2e' defined by /nightly/current_run/opentitan/sw/device/silicon_creator/rom/e2e/BUILD
ERROR: Build did NOT complete successfully
_run_cmd -> had a non-zero return code of 1.
make: *** [/nightly/current_run/opentitan/hw/dv/tools/dvsim/sim.mk:58: sw_build] Error 1
rom_e2e_sigverify_always_a_bad_b_nothing_rma 92357280851777005869016779800989361464825328086461033441600225476068491922942 None
Another command (pid=589166) is running. Waiting for it to complete on the server (server_pid=196006)...
Another command (pid=602898) is running. Waiting for it to complete on the server (server_pid=196006)...
Another command (pid=558237) is running. Waiting for it to complete on the server (server_pid=196006)...
WARNING: Target pattern parsing failed.
ERROR: Skipping '//sw/device/silicon_creator/rom/e2e:otp_img_sigverify_always_rma': no such target '//sw/device/silicon_creator/rom/e2e:otp_img_sigverify_always_rma': target 'otp_img_sigverify_always_rma' not declared in package 'sw/device/silicon_creator/rom/e2e' defined by /nightly/current_run/opentitan/sw/device/silicon_creator/rom/e2e/BUILD
ERROR: no such target '//sw/device/silicon_creator/rom/e2e:otp_img_sigverify_always_rma': target 'otp_img_sigverify_always_rma' not declared in package 'sw/device/silicon_creator/rom/e2e' defined by /nightly/current_run/opentitan/sw/device/silicon_creator/rom/e2e/BUILD
ERROR: Build did NOT complete successfully
_run_cmd -> had a non-zero return code of 1.
make: *** [/nightly/current_run/opentitan/hw/dv/tools/dvsim/sim.mk:58: sw_build] Error 1
rom_e2e_sigverify_always_a_nothing_b_bad_test_unlocked0 10339086450976363523013621975115549233082128055056514793282967869390096728172 None
Another command (pid=458091) is running. Waiting for it to complete on the server (server_pid=196006)...
Another command (pid=501077) is running. Waiting for it to complete on the server (server_pid=196006)...
Another command (pid=480269) is running. Waiting for it to complete on the server (server_pid=196006)...
WARNING: Target pattern parsing failed.
ERROR: Skipping '//sw/device/silicon_creator/rom/e2e:otp_img_sigverify_always_test_unlocked0': no such target '//sw/device/silicon_creator/rom/e2e:otp_img_sigverify_always_test_unlocked0': target 'otp_img_sigverify_always_test_unlocked0' not declared in package 'sw/device/silicon_creator/rom/e2e' defined by /nightly/current_run/opentitan/sw/device/silicon_creator/rom/e2e/BUILD
ERROR: no such target '//sw/device/silicon_creator/rom/e2e:otp_img_sigverify_always_test_unlocked0': target 'otp_img_sigverify_always_test_unlocked0' not declared in package 'sw/device/silicon_creator/rom/e2e' defined by /nightly/current_run/opentitan/sw/device/silicon_creator/rom/e2e/BUILD
ERROR: Build did NOT complete successfully
_run_cmd -> had a non-zero return code of 1.
make: *** [/nightly/current_run/opentitan/hw/dv/tools/dvsim/sim.mk:58: sw_build] Error 1
rom_e2e_sigverify_always_a_nothing_b_bad_dev 1852914812460148868998256810458579209416717669512373274853497762561707764112 None
Another command (pid=602660) is running. Waiting for it to complete on the server (server_pid=196006)...
Another command (pid=598905) is running. Waiting for it to complete on the server (server_pid=196006)...
Another command (pid=610552) is running. Waiting for it to complete on the server (server_pid=196006)...
WARNING: Target pattern parsing failed.
ERROR: Skipping '//sw/device/silicon_creator/rom/e2e:otp_img_sigverify_always_dev': no such target '//sw/device/silicon_creator/rom/e2e:otp_img_sigverify_always_dev': target 'otp_img_sigverify_always_dev' not declared in package 'sw/device/silicon_creator/rom/e2e' defined by /nightly/current_run/opentitan/sw/device/silicon_creator/rom/e2e/BUILD
ERROR: no such target '//sw/device/silicon_creator/rom/e2e:otp_img_sigverify_always_dev': target 'otp_img_sigverify_always_dev' not declared in package 'sw/device/silicon_creator/rom/e2e' defined by /nightly/current_run/opentitan/sw/device/silicon_creator/rom/e2e/BUILD
ERROR: Build did NOT complete successfully
_run_cmd -> had a non-zero return code of 1.
make: *** [/nightly/current_run/opentitan/hw/dv/tools/dvsim/sim.mk:58: sw_build] Error 1
rom_e2e_sigverify_always_a_nothing_b_bad_prod 95034879080185866214404994079915115137679839206931421366366442419719440046965 None
---- STDERR ----
Another command (pid=586510) is running. Waiting for it to complete on the server (server_pid=196006)...
WARNING: Target pattern parsing failed.
ERROR: Skipping '//sw/device/silicon_creator/rom/e2e:otp_img_sigverify_always_prod': no such target '//sw/device/silicon_creator/rom/e2e:otp_img_sigverify_always_prod': target 'otp_img_sigverify_always_prod' not declared in package 'sw/device/silicon_creator/rom/e2e' defined by /nightly/current_run/opentitan/sw/device/silicon_creator/rom/e2e/BUILD
ERROR: no such target '//sw/device/silicon_creator/rom/e2e:otp_img_sigverify_always_prod': target 'otp_img_sigverify_always_prod' not declared in package 'sw/device/silicon_creator/rom/e2e' defined by /nightly/current_run/opentitan/sw/device/silicon_creator/rom/e2e/BUILD
ERROR: Build did NOT complete successfully
_run_cmd -> had a non-zero return code of 1.
make: *** [/nightly/current_run/opentitan/hw/dv/tools/dvsim/sim.mk:58: sw_build] Error 1
rom_e2e_sigverify_always_a_nothing_b_bad_prod_end 20983005671681060625261011398667857157999772921553760793554860799230768651339 None
---- STDERR ----
Another command (pid=611193) is running. Waiting for it to complete on the server (server_pid=196006)...
WARNING: Target pattern parsing failed.
ERROR: Skipping '//sw/device/silicon_creator/rom/e2e:otp_img_sigverify_always_prod_end': no such target '//sw/device/silicon_creator/rom/e2e:otp_img_sigverify_always_prod_end': target 'otp_img_sigverify_always_prod_end' not declared in package 'sw/device/silicon_creator/rom/e2e' defined by /nightly/current_run/opentitan/sw/device/silicon_creator/rom/e2e/BUILD
ERROR: no such target '//sw/device/silicon_creator/rom/e2e:otp_img_sigverify_always_prod_end': target 'otp_img_sigverify_always_prod_end' not declared in package 'sw/device/silicon_creator/rom/e2e' defined by /nightly/current_run/opentitan/sw/device/silicon_creator/rom/e2e/BUILD
ERROR: Build did NOT complete successfully
_run_cmd -> had a non-zero return code of 1.
make: *** [/nightly/current_run/opentitan/hw/dv/tools/dvsim/sim.mk:58: sw_build] Error 1
rom_e2e_sigverify_always_a_nothing_b_bad_rma 24770812673100849892344615505724370638355029640274995995604015392034993873359 None
Another command (pid=597067) is running. Waiting for it to complete on the server (server_pid=196006)...
Another command (pid=611660) is running. Waiting for it to complete on the server (server_pid=196006)...
Another command (pid=598905) is running. Waiting for it to complete on the server (server_pid=196006)...
WARNING: Target pattern parsing failed.
ERROR: Skipping '//sw/device/silicon_creator/rom/e2e:otp_img_sigverify_always_rma': no such target '//sw/device/silicon_creator/rom/e2e:otp_img_sigverify_always_rma': target 'otp_img_sigverify_always_rma' not declared in package 'sw/device/silicon_creator/rom/e2e' defined by /nightly/current_run/opentitan/sw/device/silicon_creator/rom/e2e/BUILD
ERROR: no such target '//sw/device/silicon_creator/rom/e2e:otp_img_sigverify_always_rma': target 'otp_img_sigverify_always_rma' not declared in package 'sw/device/silicon_creator/rom/e2e' defined by /nightly/current_run/opentitan/sw/device/silicon_creator/rom/e2e/BUILD
ERROR: Build did NOT complete successfully
_run_cmd -> had a non-zero return code of 1.
make: *** [/nightly/current_run/opentitan/hw/dv/tools/dvsim/sim.mk:58: sw_build] Error 1
rom_e2e_asm_init_test_unlocked0 66360446100152930267891587757451463500783255367476433661683234181920425316712 None
Another command (pid=294434) is running. Waiting for it to complete on the server (server_pid=196006)...
Another command (pid=286039) is running. Waiting for it to complete on the server (server_pid=196006)...
Another command (pid=315164) is running. Waiting for it to complete on the server (server_pid=196006)...
WARNING: Target pattern parsing failed.
ERROR: Skipping '//sw/device/silicon_creator/rom/e2e:empty_test_slot_a_sim_dv': no such target '//sw/device/silicon_creator/rom/e2e:empty_test_slot_a_sim_dv': target 'empty_test_slot_a_sim_dv' not declared in package 'sw/device/silicon_creator/rom/e2e' defined by /nightly/current_run/opentitan/sw/device/silicon_creator/rom/e2e/BUILD
ERROR: no such target '//sw/device/silicon_creator/rom/e2e:empty_test_slot_a_sim_dv': target 'empty_test_slot_a_sim_dv' not declared in package 'sw/device/silicon_creator/rom/e2e' defined by /nightly/current_run/opentitan/sw/device/silicon_creator/rom/e2e/BUILD
ERROR: Build did NOT complete successfully
_run_cmd -> had a non-zero return code of 1.
make: *** [/nightly/current_run/opentitan/hw/dv/tools/dvsim/sim.mk:58: sw_build] Error 1
rom_e2e_asm_init_dev 76437853691419163783421136557878988065938868185112893388659775596799951172522 None
---- STDERR ----
Another command (pid=464881) is running. Waiting for it to complete on the server (server_pid=196006)...
Another command (pid=461847) is running. Waiting for it to complete on the server (server_pid=196006)...
WARNING: Target pattern parsing failed.
ERROR: Skipping '//sw/device/silicon_creator/rom/e2e:empty_test_slot_a_sim_dv': no such target '//sw/device/silicon_creator/rom/e2e:empty_test_slot_a_sim_dv': target 'empty_test_slot_a_sim_dv' not declared in package 'sw/device/silicon_creator/rom/e2e' defined by /nightly/current_run/opentitan/sw/device/silicon_creator/rom/e2e/BUILD
ERROR: no such target '//sw/device/silicon_creator/rom/e2e:empty_test_slot_a_sim_dv': target 'empty_test_slot_a_sim_dv' not declared in package 'sw/device/silicon_creator/rom/e2e' defined by /nightly/current_run/opentitan/sw/device/silicon_creator/rom/e2e/BUILD
ERROR: Build did NOT complete successfully
_run_cmd -> had a non-zero return code of 1.
make: *** [/nightly/current_run/opentitan/hw/dv/tools/dvsim/sim.mk:58: sw_build] Error 1
rom_e2e_asm_init_prod 84111543586238409259573918903841948669787673341823974061316265620752342892651 None
---- STDERR ----
Another command (pid=466802) is running. Waiting for it to complete on the server (server_pid=196006)...
WARNING: Target pattern parsing failed.
ERROR: Skipping '//sw/device/silicon_creator/rom/e2e:empty_test_slot_a_sim_dv': no such target '//sw/device/silicon_creator/rom/e2e:empty_test_slot_a_sim_dv': target 'empty_test_slot_a_sim_dv' not declared in package 'sw/device/silicon_creator/rom/e2e' defined by /nightly/current_run/opentitan/sw/device/silicon_creator/rom/e2e/BUILD
ERROR: no such target '//sw/device/silicon_creator/rom/e2e:empty_test_slot_a_sim_dv': target 'empty_test_slot_a_sim_dv' not declared in package 'sw/device/silicon_creator/rom/e2e' defined by /nightly/current_run/opentitan/sw/device/silicon_creator/rom/e2e/BUILD
ERROR: Build did NOT complete successfully
_run_cmd -> had a non-zero return code of 1.
make: *** [/nightly/current_run/opentitan/hw/dv/tools/dvsim/sim.mk:58: sw_build] Error 1
rom_e2e_asm_init_prod_end 99437764791109978516496211806337008076507397130576938048958681009240462872165 None
Another command (pid=477583) is running. Waiting for it to complete on the server (server_pid=196006)...
Another command (pid=467405) is running. Waiting for it to complete on the server (server_pid=196006)...
Another command (pid=483132) is running. Waiting for it to complete on the server (server_pid=196006)...
WARNING: Target pattern parsing failed.
ERROR: Skipping '//sw/device/silicon_creator/rom/e2e:empty_test_slot_a_sim_dv': no such target '//sw/device/silicon_creator/rom/e2e:empty_test_slot_a_sim_dv': target 'empty_test_slot_a_sim_dv' not declared in package 'sw/device/silicon_creator/rom/e2e' defined by /nightly/current_run/opentitan/sw/device/silicon_creator/rom/e2e/BUILD
ERROR: no such target '//sw/device/silicon_creator/rom/e2e:empty_test_slot_a_sim_dv': target 'empty_test_slot_a_sim_dv' not declared in package 'sw/device/silicon_creator/rom/e2e' defined by /nightly/current_run/opentitan/sw/device/silicon_creator/rom/e2e/BUILD
ERROR: Build did NOT complete successfully
_run_cmd -> had a non-zero return code of 1.
make: *** [/nightly/current_run/opentitan/hw/dv/tools/dvsim/sim.mk:58: sw_build] Error 1
rom_e2e_asm_init_rma 86775162368335411249619151465782914357548871773690375507117329270677864913113 None
Another command (pid=507244) is running. Waiting for it to complete on the server (server_pid=196006)...
Another command (pid=514209) is running. Waiting for it to complete on the server (server_pid=196006)...
Another command (pid=505402) is running. Waiting for it to complete on the server (server_pid=196006)...
WARNING: Target pattern parsing failed.
ERROR: Skipping '//sw/device/silicon_creator/rom/e2e:empty_test_slot_a_sim_dv': no such target '//sw/device/silicon_creator/rom/e2e:empty_test_slot_a_sim_dv': target 'empty_test_slot_a_sim_dv' not declared in package 'sw/device/silicon_creator/rom/e2e' defined by /nightly/current_run/opentitan/sw/device/silicon_creator/rom/e2e/BUILD
ERROR: no such target '//sw/device/silicon_creator/rom/e2e:empty_test_slot_a_sim_dv': target 'empty_test_slot_a_sim_dv' not declared in package 'sw/device/silicon_creator/rom/e2e' defined by /nightly/current_run/opentitan/sw/device/silicon_creator/rom/e2e/BUILD
ERROR: Build did NOT complete successfully
_run_cmd -> had a non-zero return code of 1.
make: *** [/nightly/current_run/opentitan/hw/dv/tools/dvsim/sim.mk:58: sw_build] Error 1
rom_e2e_jtag_debug_test_unlocked0 39386661441766162425434478030240545912074359099993297318249781993149541777900 None
Another command (pid=528778) is running. Waiting for it to complete on the server (server_pid=196006)...
Another command (pid=543268) is running. Waiting for it to complete on the server (server_pid=196006)...
Another command (pid=542772) is running. Waiting for it to complete on the server (server_pid=196006)...
WARNING: Target pattern parsing failed.
ERROR: Skipping '//sw/device/silicon_creator/rom/e2e:img_test_unlocked0_exec_disabled': no such target '//sw/device/silicon_creator/rom/e2e:img_test_unlocked0_exec_disabled': target 'img_test_unlocked0_exec_disabled' not declared in package 'sw/device/silicon_creator/rom/e2e' defined by /nightly/current_run/opentitan/sw/device/silicon_creator/rom/e2e/BUILD
ERROR: no such target '//sw/device/silicon_creator/rom/e2e:img_test_unlocked0_exec_disabled': target 'img_test_unlocked0_exec_disabled' not declared in package 'sw/device/silicon_creator/rom/e2e' defined by /nightly/current_run/opentitan/sw/device/silicon_creator/rom/e2e/BUILD
ERROR: Build did NOT complete successfully
_run_cmd -> had a non-zero return code of 1.
make: *** [/nightly/current_run/opentitan/hw/dv/tools/dvsim/sim.mk:58: sw_build] Error 1
rom_e2e_jtag_debug_dev 36507115419676816942554297759751613841306710188228828905851355956884907636053 None
Another command (pid=523094) is running. Waiting for it to complete on the server (server_pid=196006)...
Another command (pid=521632) is running. Waiting for it to complete on the server (server_pid=196006)...
Another command (pid=514801) is running. Waiting for it to complete on the server (server_pid=196006)...
WARNING: Target pattern parsing failed.
ERROR: Skipping '//sw/device/silicon_creator/rom/e2e:img_dev_exec_disabled': no such target '//sw/device/silicon_creator/rom/e2e:img_dev_exec_disabled': target 'img_dev_exec_disabled' not declared in package 'sw/device/silicon_creator/rom/e2e' defined by /nightly/current_run/opentitan/sw/device/silicon_creator/rom/e2e/BUILD
ERROR: no such target '//sw/device/silicon_creator/rom/e2e:img_dev_exec_disabled': target 'img_dev_exec_disabled' not declared in package 'sw/device/silicon_creator/rom/e2e' defined by /nightly/current_run/opentitan/sw/device/silicon_creator/rom/e2e/BUILD
ERROR: Build did NOT complete successfully
_run_cmd -> had a non-zero return code of 1.
make: *** [/nightly/current_run/opentitan/hw/dv/tools/dvsim/sim.mk:58: sw_build] Error 1
rom_e2e_jtag_debug_rma 90377504244570332479423834797787591507369742510482075794038851100411760463171 None
Another command (pid=530357) is running. Waiting for it to complete on the server (server_pid=196006)...
Another command (pid=542169) is running. Waiting for it to complete on the server (server_pid=196006)...
Another command (pid=502744) is running. Waiting for it to complete on the server (server_pid=196006)...
WARNING: Target pattern parsing failed.
ERROR: Skipping '//sw/device/silicon_creator/rom/e2e:img_rma_exec_disabled': no such target '//sw/device/silicon_creator/rom/e2e:img_rma_exec_disabled': target 'img_rma_exec_disabled' not declared in package 'sw/device/silicon_creator/rom/e2e' defined by /nightly/current_run/opentitan/sw/device/silicon_creator/rom/e2e/BUILD
ERROR: no such target '//sw/device/silicon_creator/rom/e2e:img_rma_exec_disabled': target 'img_rma_exec_disabled' not declared in package 'sw/device/silicon_creator/rom/e2e' defined by /nightly/current_run/opentitan/sw/device/silicon_creator/rom/e2e/BUILD
ERROR: Build did NOT complete successfully
_run_cmd -> had a non-zero return code of 1.
make: *** [/nightly/current_run/opentitan/hw/dv/tools/dvsim/sim.mk:58: sw_build] Error 1
rom_e2e_jtag_inject_test_unlocked0 26945712291256211228101745556546883680047332464016840964611211116674285830267 None
Another command (pid=488207) is running. Waiting for it to complete on the server (server_pid=196006)...
Another command (pid=491747) is running. Waiting for it to complete on the server (server_pid=196006)...
Another command (pid=487455) is running. Waiting for it to complete on the server (server_pid=196006)...
WARNING: Target pattern parsing failed.
ERROR: Skipping '//sw/device/silicon_creator/rom/e2e:img_dev_exec_disabled': no such target '//sw/device/silicon_creator/rom/e2e:img_dev_exec_disabled': target 'img_dev_exec_disabled' not declared in package 'sw/device/silicon_creator/rom/e2e' defined by /nightly/current_run/opentitan/sw/device/silicon_creator/rom/e2e/BUILD
ERROR: no such target '//sw/device/silicon_creator/rom/e2e:img_dev_exec_disabled': target 'img_dev_exec_disabled' not declared in package 'sw/device/silicon_creator/rom/e2e' defined by /nightly/current_run/opentitan/sw/device/silicon_creator/rom/e2e/BUILD
ERROR: Build did NOT complete successfully
_run_cmd -> had a non-zero return code of 1.
make: *** [/nightly/current_run/opentitan/hw/dv/tools/dvsim/sim.mk:58: sw_build] Error 1
rom_e2e_jtag_inject_dev 66089952673603750256942909224272745108440455048112900125109484353749704101982 None
Another command (pid=466529) is running. Waiting for it to complete on the server (server_pid=196006)...
Another command (pid=452256) is running. Waiting for it to complete on the server (server_pid=196006)...
Another command (pid=473331) is running. Waiting for it to complete on the server (server_pid=196006)...
WARNING: Target pattern parsing failed.
ERROR: Skipping '//sw/device/silicon_creator/rom/e2e:img_dev_exec_disabled': no such target '//sw/device/silicon_creator/rom/e2e:img_dev_exec_disabled': target 'img_dev_exec_disabled' not declared in package 'sw/device/silicon_creator/rom/e2e' defined by /nightly/current_run/opentitan/sw/device/silicon_creator/rom/e2e/BUILD
ERROR: no such target '//sw/device/silicon_creator/rom/e2e:img_dev_exec_disabled': target 'img_dev_exec_disabled' not declared in package 'sw/device/silicon_creator/rom/e2e' defined by /nightly/current_run/opentitan/sw/device/silicon_creator/rom/e2e/BUILD
ERROR: Build did NOT complete successfully
_run_cmd -> had a non-zero return code of 1.
make: *** [/nightly/current_run/opentitan/hw/dv/tools/dvsim/sim.mk:58: sw_build] Error 1
rom_e2e_jtag_inject_rma 56203866793840059249567511858499783608977662149015086224050258744738322901403 None
Another command (pid=370759) is running. Waiting for it to complete on the server (server_pid=196006)...
Another command (pid=368970) is running. Waiting for it to complete on the server (server_pid=196006)...
Another command (pid=370771) is running. Waiting for it to complete on the server (server_pid=196006)...
WARNING: Target pattern parsing failed.
ERROR: Skipping '//sw/device/silicon_creator/rom/e2e:img_dev_exec_disabled': no such target '//sw/device/silicon_creator/rom/e2e:img_dev_exec_disabled': target 'img_dev_exec_disabled' not declared in package 'sw/device/silicon_creator/rom/e2e' defined by /nightly/current_run/opentitan/sw/device/silicon_creator/rom/e2e/BUILD
ERROR: no such target '//sw/device/silicon_creator/rom/e2e:img_dev_exec_disabled': target 'img_dev_exec_disabled' not declared in package 'sw/device/silicon_creator/rom/e2e' defined by /nightly/current_run/opentitan/sw/device/silicon_creator/rom/e2e/BUILD
ERROR: Build did NOT complete successfully
_run_cmd -> had a non-zero return code of 1.
make: *** [/nightly/current_run/opentitan/hw/dv/tools/dvsim/sim.mk:58: sw_build] Error 1
rom_e2e_static_critical 4187352236100527112276665577883074373608614271327050310946996826989502912841 None
---- STDOUT ----
---- STDERR ----
WARNING: Target pattern parsing failed.
ERROR: Skipping '//sw/device/silicon_creator/rom:rom_with_fake_keys_sim_dv': no such target '//sw/device/silicon_creator/rom:rom_with_fake_keys_sim_dv': target 'rom_with_fake_keys_sim_dv' not declared in package 'sw/device/silicon_creator/rom' defined by /nightly/current_run/opentitan/sw/device/silicon_creator/rom/BUILD
ERROR: no such target '//sw/device/silicon_creator/rom:rom_with_fake_keys_sim_dv': target 'rom_with_fake_keys_sim_dv' not declared in package 'sw/device/silicon_creator/rom' defined by /nightly/current_run/opentitan/sw/device/silicon_creator/rom/BUILD
ERROR: Build did NOT complete successfully
_run_cmd -> had a non-zero return code of 1.
make: *** [/nightly/current_run/opentitan/hw/dv/tools/dvsim/sim.mk:58: sw_build] Error 1
rom_e2e_keymgr_init_rom_ext_meas 31371470299450597148196342789060871862166579073494122198021150027688036668392 None
Another command (pid=521632) is running. Waiting for it to complete on the server (server_pid=196006)...
Another command (pid=526746) is running. Waiting for it to complete on the server (server_pid=196006)...
Another command (pid=527215) is running. Waiting for it to complete on the server (server_pid=196006)...
WARNING: Target pattern parsing failed.
ERROR: Skipping '//sw/device/silicon_creator/rom/e2e:rom_e2e_keymgr_init_test_sim_dv': no such target '//sw/device/silicon_creator/rom/e2e:rom_e2e_keymgr_init_test_sim_dv': target 'rom_e2e_keymgr_init_test_sim_dv' not declared in package 'sw/device/silicon_creator/rom/e2e' defined by /nightly/current_run/opentitan/sw/device/silicon_creator/rom/e2e/BUILD
ERROR: no such target '//sw/device/silicon_creator/rom/e2e:rom_e2e_keymgr_init_test_sim_dv': target 'rom_e2e_keymgr_init_test_sim_dv' not declared in package 'sw/device/silicon_creator/rom/e2e' defined by /nightly/current_run/opentitan/sw/device/silicon_creator/rom/e2e/BUILD
ERROR: Build did NOT complete successfully
_run_cmd -> had a non-zero return code of 1.
make: *** [/nightly/current_run/opentitan/hw/dv/tools/dvsim/sim.mk:58: sw_build] Error 1
rom_e2e_keymgr_init_rom_ext_no_meas 53136660457387555245576976438390193705157785847962454037370841160988449686489 None
Another command (pid=597067) is running. Waiting for it to complete on the server (server_pid=196006)...
Another command (pid=576763) is running. Waiting for it to complete on the server (server_pid=196006)...
Another command (pid=598905) is running. Waiting for it to complete on the server (server_pid=196006)...
WARNING: Target pattern parsing failed.
ERROR: Skipping '//sw/device/silicon_creator/rom/e2e:rom_e2e_keymgr_init_test_sim_dv': no such target '//sw/device/silicon_creator/rom/e2e:rom_e2e_keymgr_init_test_sim_dv': target 'rom_e2e_keymgr_init_test_sim_dv' not declared in package 'sw/device/silicon_creator/rom/e2e' defined by /nightly/current_run/opentitan/sw/device/silicon_creator/rom/e2e/BUILD
ERROR: no such target '//sw/device/silicon_creator/rom/e2e:rom_e2e_keymgr_init_test_sim_dv': target 'rom_e2e_keymgr_init_test_sim_dv' not declared in package 'sw/device/silicon_creator/rom/e2e' defined by /nightly/current_run/opentitan/sw/device/silicon_creator/rom/e2e/BUILD
ERROR: Build did NOT complete successfully
_run_cmd -> had a non-zero return code of 1.
make: *** [/nightly/current_run/opentitan/hw/dv/tools/dvsim/sim.mk:58: sw_build] Error 1
rom_e2e_keymgr_init_rom_ext_invalid_meas 51716360555257453235787231522420462493386367549028586917396228273142011616556 None
Another command (pid=528967) is running. Waiting for it to complete on the server (server_pid=196006)...
Another command (pid=539373) is running. Waiting for it to complete on the server (server_pid=196006)...
Another command (pid=519488) is running. Waiting for it to complete on the server (server_pid=196006)...
WARNING: Target pattern parsing failed.
ERROR: Skipping '//sw/device/silicon_creator/rom/e2e:rom_e2e_keymgr_init_test_sim_dv': no such target '//sw/device/silicon_creator/rom/e2e:rom_e2e_keymgr_init_test_sim_dv': target 'rom_e2e_keymgr_init_test_sim_dv' not declared in package 'sw/device/silicon_creator/rom/e2e' defined by /nightly/current_run/opentitan/sw/device/silicon_creator/rom/e2e/BUILD
ERROR: no such target '//sw/device/silicon_creator/rom/e2e:rom_e2e_keymgr_init_test_sim_dv': target 'rom_e2e_keymgr_init_test_sim_dv' not declared in package 'sw/device/silicon_creator/rom/e2e' defined by /nightly/current_run/opentitan/sw/device/silicon_creator/rom/e2e/BUILD
ERROR: Build did NOT complete successfully
_run_cmd -> had a non-zero return code of 1.
make: *** [/nightly/current_run/opentitan/hw/dv/tools/dvsim/sim.mk:58: sw_build] Error 1
rom_e2e_sigverify_mod_exp_test_unlocked0_otbn 26451096041071743391806628738252870605866343393271800144461868756042728764262 None
Another command (pid=271645) is running. Waiting for it to complete on the server (server_pid=196006)...
Another command (pid=294434) is running. Waiting for it to complete on the server (server_pid=196006)...
Another command (pid=319739) is running. Waiting for it to complete on the server (server_pid=196006)...
WARNING: Target pattern parsing failed.
ERROR: Skipping '//sw/device/silicon_creator/rom/e2e:empty_test_sigverify_mod_exp_sim_dv': no such target '//sw/device/silicon_creator/rom/e2e:empty_test_sigverify_mod_exp_sim_dv': target 'empty_test_sigverify_mod_exp_sim_dv' not declared in package 'sw/device/silicon_creator/rom/e2e' defined by /nightly/current_run/opentitan/sw/device/silicon_creator/rom/e2e/BUILD
ERROR: no such target '//sw/device/silicon_creator/rom/e2e:empty_test_sigverify_mod_exp_sim_dv': target 'empty_test_sigverify_mod_exp_sim_dv' not declared in package 'sw/device/silicon_creator/rom/e2e' defined by /nightly/current_run/opentitan/sw/device/silicon_creator/rom/e2e/BUILD
ERROR: Build did NOT complete successfully
_run_cmd -> had a non-zero return code of 1.
make: *** [/nightly/current_run/opentitan/hw/dv/tools/dvsim/sim.mk:58: sw_build] Error 1
rom_e2e_sigverify_mod_exp_test_unlocked0_sw 66995163744606564061369707888197325693716931644089192520558055979022839757601 None
Another command (pid=271645) is running. Waiting for it to complete on the server (server_pid=196006)...
Another command (pid=294434) is running. Waiting for it to complete on the server (server_pid=196006)...
Another command (pid=307227) is running. Waiting for it to complete on the server (server_pid=196006)...
WARNING: Target pattern parsing failed.
ERROR: Skipping '//sw/device/silicon_creator/rom/e2e:empty_test_sigverify_mod_exp_sim_dv': no such target '//sw/device/silicon_creator/rom/e2e:empty_test_sigverify_mod_exp_sim_dv': target 'empty_test_sigverify_mod_exp_sim_dv' not declared in package 'sw/device/silicon_creator/rom/e2e' defined by /nightly/current_run/opentitan/sw/device/silicon_creator/rom/e2e/BUILD
ERROR: no such target '//sw/device/silicon_creator/rom/e2e:empty_test_sigverify_mod_exp_sim_dv': target 'empty_test_sigverify_mod_exp_sim_dv' not declared in package 'sw/device/silicon_creator/rom/e2e' defined by /nightly/current_run/opentitan/sw/device/silicon_creator/rom/e2e/BUILD
ERROR: Build did NOT complete successfully
_run_cmd -> had a non-zero return code of 1.
make: *** [/nightly/current_run/opentitan/hw/dv/tools/dvsim/sim.mk:58: sw_build] Error 1
rom_e2e_sigverify_mod_exp_dev_otbn 101410956836946117718275589036339632230915675269628184358566280204405550929000 None
Another command (pid=597067) is running. Waiting for it to complete on the server (server_pid=196006)...
Another command (pid=576763) is running. Waiting for it to complete on the server (server_pid=196006)...
Another command (pid=598905) is running. Waiting for it to complete on the server (server_pid=196006)...
WARNING: Target pattern parsing failed.
ERROR: Skipping '//sw/device/silicon_creator/rom/e2e:empty_test_sigverify_mod_exp_sim_dv': no such target '//sw/device/silicon_creator/rom/e2e:empty_test_sigverify_mod_exp_sim_dv': target 'empty_test_sigverify_mod_exp_sim_dv' not declared in package 'sw/device/silicon_creator/rom/e2e' defined by /nightly/current_run/opentitan/sw/device/silicon_creator/rom/e2e/BUILD
ERROR: no such target '//sw/device/silicon_creator/rom/e2e:empty_test_sigverify_mod_exp_sim_dv': target 'empty_test_sigverify_mod_exp_sim_dv' not declared in package 'sw/device/silicon_creator/rom/e2e' defined by /nightly/current_run/opentitan/sw/device/silicon_creator/rom/e2e/BUILD
ERROR: Build did NOT complete successfully
_run_cmd -> had a non-zero return code of 1.
make: *** [/nightly/current_run/opentitan/hw/dv/tools/dvsim/sim.mk:58: sw_build] Error 1
rom_e2e_sigverify_mod_exp_dev_sw 66852320610600840585190222632301049287756897858478385173518132815618016101793 None
---- STDERR ----
Another command (pid=575414) is running. Waiting for it to complete on the server (server_pid=196006)...
WARNING: Target pattern parsing failed.
ERROR: Skipping '//sw/device/silicon_creator/rom/e2e:empty_test_sigverify_mod_exp_sim_dv': no such target '//sw/device/silicon_creator/rom/e2e:empty_test_sigverify_mod_exp_sim_dv': target 'empty_test_sigverify_mod_exp_sim_dv' not declared in package 'sw/device/silicon_creator/rom/e2e' defined by /nightly/current_run/opentitan/sw/device/silicon_creator/rom/e2e/BUILD
ERROR: no such target '//sw/device/silicon_creator/rom/e2e:empty_test_sigverify_mod_exp_sim_dv': target 'empty_test_sigverify_mod_exp_sim_dv' not declared in package 'sw/device/silicon_creator/rom/e2e' defined by /nightly/current_run/opentitan/sw/device/silicon_creator/rom/e2e/BUILD
ERROR: Build did NOT complete successfully
_run_cmd -> had a non-zero return code of 1.
make: *** [/nightly/current_run/opentitan/hw/dv/tools/dvsim/sim.mk:58: sw_build] Error 1
rom_e2e_sigverify_mod_exp_prod_otbn 46826547435964203121643988128815755604063644050710924288006523970105722795232 None
---- STDOUT ----
---- STDERR ----
WARNING: Target pattern parsing failed.
ERROR: Skipping '//sw/device/silicon_creator/rom/e2e:empty_test_sigverify_mod_exp_sim_dv': no such target '//sw/device/silicon_creator/rom/e2e:empty_test_sigverify_mod_exp_sim_dv': target 'empty_test_sigverify_mod_exp_sim_dv' not declared in package 'sw/device/silicon_creator/rom/e2e' defined by /nightly/current_run/opentitan/sw/device/silicon_creator/rom/e2e/BUILD
ERROR: no such target '//sw/device/silicon_creator/rom/e2e:empty_test_sigverify_mod_exp_sim_dv': target 'empty_test_sigverify_mod_exp_sim_dv' not declared in package 'sw/device/silicon_creator/rom/e2e' defined by /nightly/current_run/opentitan/sw/device/silicon_creator/rom/e2e/BUILD
ERROR: Build did NOT complete successfully
_run_cmd -> had a non-zero return code of 1.
make: *** [/nightly/current_run/opentitan/hw/dv/tools/dvsim/sim.mk:58: sw_build] Error 1
rom_e2e_sigverify_mod_exp_prod_sw 111056600206453374814595993964806717769621808284195102923137803872654838887828 None
---- STDOUT ----
---- STDERR ----
WARNING: Target pattern parsing failed.
ERROR: Skipping '//sw/device/silicon_creator/rom/e2e:empty_test_sigverify_mod_exp_sim_dv': no such target '//sw/device/silicon_creator/rom/e2e:empty_test_sigverify_mod_exp_sim_dv': target 'empty_test_sigverify_mod_exp_sim_dv' not declared in package 'sw/device/silicon_creator/rom/e2e' defined by /nightly/current_run/opentitan/sw/device/silicon_creator/rom/e2e/BUILD
ERROR: no such target '//sw/device/silicon_creator/rom/e2e:empty_test_sigverify_mod_exp_sim_dv': target 'empty_test_sigverify_mod_exp_sim_dv' not declared in package 'sw/device/silicon_creator/rom/e2e' defined by /nightly/current_run/opentitan/sw/device/silicon_creator/rom/e2e/BUILD
ERROR: Build did NOT complete successfully
_run_cmd -> had a non-zero return code of 1.
make: *** [/nightly/current_run/opentitan/hw/dv/tools/dvsim/sim.mk:58: sw_build] Error 1
rom_e2e_sigverify_mod_exp_prod_end_otbn 40237715842555420144918401488513183258913658410311197644645097054222674872529 None
Waiting for it to complete...
Another command (pid=613170) is running. Waiting for it to complete on the server (server_pid=196006)...
WARNING: Target pattern parsing failed.
ERROR: Skipping '//sw/device/silicon_creator/rom/e2e:empty_test_sigverify_mod_exp_sim_dv': no such target '//sw/device/silicon_creator/rom/e2e:empty_test_sigverify_mod_exp_sim_dv': target 'empty_test_sigverify_mod_exp_sim_dv' not declared in package 'sw/device/silicon_creator/rom/e2e' defined by /nightly/current_run/opentitan/sw/device/silicon_creator/rom/e2e/BUILD
ERROR: no such target '//sw/device/silicon_creator/rom/e2e:empty_test_sigverify_mod_exp_sim_dv': target 'empty_test_sigverify_mod_exp_sim_dv' not declared in package 'sw/device/silicon_creator/rom/e2e' defined by /nightly/current_run/opentitan/sw/device/silicon_creator/rom/e2e/BUILD
ERROR: Build did NOT complete successfully
_run_cmd -> had a non-zero return code of 1.
make: *** [/nightly/current_run/opentitan/hw/dv/tools/dvsim/sim.mk:58: sw_build] Error 1
rom_e2e_sigverify_mod_exp_prod_end_sw 50835101464751269119296410220265226648986465282543630465142568486557427941587 None
---- STDERR ----
Another command (pid=618481) is running. Waiting for it to complete on the server (server_pid=196006)...
WARNING: Target pattern parsing failed.
ERROR: Skipping '//sw/device/silicon_creator/rom/e2e:empty_test_sigverify_mod_exp_sim_dv': no such target '//sw/device/silicon_creator/rom/e2e:empty_test_sigverify_mod_exp_sim_dv': target 'empty_test_sigverify_mod_exp_sim_dv' not declared in package 'sw/device/silicon_creator/rom/e2e' defined by /nightly/current_run/opentitan/sw/device/silicon_creator/rom/e2e/BUILD
ERROR: no such target '//sw/device/silicon_creator/rom/e2e:empty_test_sigverify_mod_exp_sim_dv': target 'empty_test_sigverify_mod_exp_sim_dv' not declared in package 'sw/device/silicon_creator/rom/e2e' defined by /nightly/current_run/opentitan/sw/device/silicon_creator/rom/e2e/BUILD
ERROR: Build did NOT complete successfully
_run_cmd -> had a non-zero return code of 1.
make: *** [/nightly/current_run/opentitan/hw/dv/tools/dvsim/sim.mk:58: sw_build] Error 1
rom_e2e_sigverify_mod_exp_rma_otbn 55243782602298952795067425267758424284269396681969470113482688893578751836850 None
---- STDOUT ----
---- STDERR ----
WARNING: Target pattern parsing failed.
ERROR: Skipping '//sw/device/silicon_creator/rom/e2e:empty_test_sigverify_mod_exp_sim_dv': no such target '//sw/device/silicon_creator/rom/e2e:empty_test_sigverify_mod_exp_sim_dv': target 'empty_test_sigverify_mod_exp_sim_dv' not declared in package 'sw/device/silicon_creator/rom/e2e' defined by /nightly/current_run/opentitan/sw/device/silicon_creator/rom/e2e/BUILD
ERROR: no such target '//sw/device/silicon_creator/rom/e2e:empty_test_sigverify_mod_exp_sim_dv': target 'empty_test_sigverify_mod_exp_sim_dv' not declared in package 'sw/device/silicon_creator/rom/e2e' defined by /nightly/current_run/opentitan/sw/device/silicon_creator/rom/e2e/BUILD
ERROR: Build did NOT complete successfully
_run_cmd -> had a non-zero return code of 1.
make: *** [/nightly/current_run/opentitan/hw/dv/tools/dvsim/sim.mk:58: sw_build] Error 1
rom_e2e_sigverify_mod_exp_rma_sw 61055571259758521119165743771818300811893803048416479202363417765363522486016 None
---- STDOUT ----
---- STDERR ----
WARNING: Target pattern parsing failed.
ERROR: Skipping '//sw/device/silicon_creator/rom/e2e:empty_test_sigverify_mod_exp_sim_dv': no such target '//sw/device/silicon_creator/rom/e2e:empty_test_sigverify_mod_exp_sim_dv': target 'empty_test_sigverify_mod_exp_sim_dv' not declared in package 'sw/device/silicon_creator/rom/e2e' defined by /nightly/current_run/opentitan/sw/device/silicon_creator/rom/e2e/BUILD
ERROR: no such target '//sw/device/silicon_creator/rom/e2e:empty_test_sigverify_mod_exp_sim_dv': target 'empty_test_sigverify_mod_exp_sim_dv' not declared in package 'sw/device/silicon_creator/rom/e2e' defined by /nightly/current_run/opentitan/sw/device/silicon_creator/rom/e2e/BUILD
ERROR: Build did NOT complete successfully
_run_cmd -> had a non-zero return code of 1.
make: *** [/nightly/current_run/opentitan/hw/dv/tools/dvsim/sim.mk:58: sw_build] Error 1
rom_volatile_raw_unlock 90295111086545675122865416373634391517341924752123742749028831573046798443945 None
---- STDERR ----
Another command (pid=349925) is running. Waiting for it to complete on the server (server_pid=196006)...
WARNING: Target pattern parsing failed.
ERROR: Skipping '//sw/device/silicon_creator/rom/e2e:empty_test_slot_a_sim_dv': no such target '//sw/device/silicon_creator/rom/e2e:empty_test_slot_a_sim_dv': target 'empty_test_slot_a_sim_dv' not declared in package 'sw/device/silicon_creator/rom/e2e' defined by /nightly/current_run/opentitan/sw/device/silicon_creator/rom/e2e/BUILD
ERROR: no such target '//sw/device/silicon_creator/rom/e2e:empty_test_slot_a_sim_dv': target 'empty_test_slot_a_sim_dv' not declared in package 'sw/device/silicon_creator/rom/e2e' defined by /nightly/current_run/opentitan/sw/device/silicon_creator/rom/e2e/BUILD
ERROR: Build did NOT complete successfully
_run_cmd -> had a non-zero return code of 1.
make: *** [/nightly/current_run/opentitan/hw/dv/tools/dvsim/sim.mk:58: sw_build] Error 1
rom_raw_unlock 65947057212858719286462338527686110552848638616166245846022295407659943728329 None
Another command (pid=319739) is running. Waiting for it to complete on the server (server_pid=196006)...
Another command (pid=349925) is running. Waiting for it to complete on the server (server_pid=196006)...
Another command (pid=351368) is running. Waiting for it to complete on the server (server_pid=196006)...
WARNING: Target pattern parsing failed.
ERROR: Skipping '//sw/device/silicon_creator/rom/e2e:empty_test_slot_a_sim_dv': no such target '//sw/device/silicon_creator/rom/e2e:empty_test_slot_a_sim_dv': target 'empty_test_slot_a_sim_dv' not declared in package 'sw/device/silicon_creator/rom/e2e' defined by /nightly/current_run/opentitan/sw/device/silicon_creator/rom/e2e/BUILD
ERROR: no such target '//sw/device/silicon_creator/rom/e2e:empty_test_slot_a_sim_dv': target 'empty_test_slot_a_sim_dv' not declared in package 'sw/device/silicon_creator/rom/e2e' defined by /nightly/current_run/opentitan/sw/device/silicon_creator/rom/e2e/BUILD
ERROR: Build did NOT complete successfully
_run_cmd -> had a non-zero return code of 1.
make: *** [/nightly/current_run/opentitan/hw/dv/tools/dvsim/sim.mk:58: sw_build] Error 1
rom_e2e_self_hash 58780984303222495160342332605946712693948646140121309473581232710377629777355 None
---- STDERR ----
Another command (pid=331780) is running. Waiting for it to complete on the server (server_pid=196006)...
WARNING: Target pattern parsing failed.
ERROR: Skipping '//sw/device/silicon_creator/rom/e2e:otp_img_sigverify_mod_exp_rma_otbn': no such target '//sw/device/silicon_creator/rom/e2e:otp_img_sigverify_mod_exp_rma_otbn': target 'otp_img_sigverify_mod_exp_rma_otbn' not declared in package 'sw/device/silicon_creator/rom/e2e' defined by /nightly/current_run/opentitan/sw/device/silicon_creator/rom/e2e/BUILD
ERROR: no such target '//sw/device/silicon_creator/rom/e2e:otp_img_sigverify_mod_exp_rma_otbn': target 'otp_img_sigverify_mod_exp_rma_otbn' not declared in package 'sw/device/silicon_creator/rom/e2e' defined by /nightly/current_run/opentitan/sw/device/silicon_creator/rom/e2e/BUILD
ERROR: Build did NOT complete successfully
_run_cmd -> had a non-zero return code of 1.
make: *** [/nightly/current_run/opentitan/hw/dv/tools/dvsim/sim.mk:58: sw_build] Error 1
chip_sw_uart_smoketest_signed 17488944464149219480406271120096148964281372018863093579788240034571981649044 None
---- STDERR ----
Another command (pid=371924) is running. Waiting for it to complete on the server (server_pid=196006)...
WARNING: Target pattern parsing failed.
ERROR: Skipping '//sw/device/tests:uart_smoketest_signed_sim_dv': no such target '//sw/device/tests:uart_smoketest_signed_sim_dv': target 'uart_smoketest_signed_sim_dv' not declared in package 'sw/device/tests' defined by /nightly/current_run/opentitan/sw/device/tests/BUILD
ERROR: no such target '//sw/device/tests:uart_smoketest_signed_sim_dv': target 'uart_smoketest_signed_sim_dv' not declared in package 'sw/device/tests' defined by /nightly/current_run/opentitan/sw/device/tests/BUILD
ERROR: Build did NOT complete successfully
_run_cmd -> had a non-zero return code of 1.
make: *** [/nightly/current_run/opentitan/hw/dv/tools/dvsim/sim.mk:58: sw_build] Error 1
rom_keymgr_functest 28453672573726705657270774240452139379775006057304490553121898430829549889089 None
Use --verbose_failures to see the command lines of failed build steps.
ERROR: Analysis of target '//sw/device/silicon_creator/lib/drivers:keymgr_functest_sim_dv' failed; build aborted: Target //sw/device/silicon_creator/lib/drivers:keymgr_functest_sim_dv is incompatible and cannot be built, but was explicitly requested.
Dependency chain:
//sw/device/silicon_creator/lib/drivers:keymgr_functest_sim_dv (f2055d) <-- target platform (//toolchain:opentitan_platform) didn't satisfy constraint @@platforms//:incompatible
INFO: Elapsed time: 0.287s, Critical Path: 0.03s
INFO: 1 process: 1 internal.
ERROR: Build did NOT complete successfully
_run_cmd -> had a non-zero return code of 1.
make: *** [/nightly/current_run/opentitan/hw/dv/tools/dvsim/sim.mk:58: sw_build] Error 1
UVM_FATAL @ * us: (dv_utils_pkg.sv:253) [dv_utils_pkg::sw_symbol_get_addr_size.unnamed$$_*] Check failed (ret) Failed to read line from "kJitterEnabled.dat" 12 test runs
chip_sw_otbn_ecdsa_op_irq_jitter_en 94146243013639913703143059708774002405397647574517701376411701356306612898900 312
UVM_INFO @ 10.100001 us: (uvm_report_catcher.svh:705) [UVM/REPORT/CATCHER]
--- UVM Report catcher Summary ---
chip_sw_aes_enc_jitter_en 82871629049469150816853180842058409255781663423021700336997911866108195038504 312
UVM_INFO @ 10.340001 us: (uvm_report_catcher.svh:705) [UVM/REPORT/CATCHER]
--- UVM Report catcher Summary ---
chip_sw_hmac_enc_jitter_en 43712359221974010010300597641099452139494888824353180934596881164419974251551 312
UVM_INFO @ 10.280001 us: (uvm_report_catcher.svh:705) [UVM/REPORT/CATCHER]
--- UVM Report catcher Summary ---
chip_sw_keymgr_dpe_key_derivation_jitter_en 45027025904528142361100896085603401626783896922607506001755980024399768557628 312
UVM_INFO @ 10.100001 us: (uvm_report_catcher.svh:705) [UVM/REPORT/CATCHER]
--- UVM Report catcher Summary ---
chip_sw_kmac_mode_kmac_jitter_en 57457320124765650015837131037440663048924280534081388096373757425805501867470 312
UVM_INFO @ 10.260001 us: (uvm_report_catcher.svh:705) [UVM/REPORT/CATCHER]
--- UVM Report catcher Summary ---
chip_sw_otbn_ecdsa_op_irq_jitter_en_reduced_freq 80313561673623651609920656120061011176778233235178616652684210260303584735130 312
UVM_INFO @ 10.360001 us: (uvm_report_catcher.svh:705) [UVM/REPORT/CATCHER]
--- UVM Report catcher Summary ---
chip_sw_aes_enc_jitter_en_reduced_freq 59906470416762851397373886187013408142672157573774531011961532920433182010648 312
UVM_INFO @ 10.360001 us: (uvm_report_catcher.svh:705) [UVM/REPORT/CATCHER]
--- UVM Report catcher Summary ---
chip_sw_hmac_enc_jitter_en_reduced_freq 112818125051284409812698426770765806740525692762489191317415280209448163665915 312
UVM_INFO @ 10.260001 us: (uvm_report_catcher.svh:705) [UVM/REPORT/CATCHER]
--- UVM Report catcher Summary ---
chip_sw_keymgr_dpe_key_derivation_jitter_en_reduced_freq 17009120153932004899060996020927671783790176762181103047450212026171933083462 312
UVM_INFO @ 10.320001 us: (uvm_report_catcher.svh:705) [UVM/REPORT/CATCHER]
--- UVM Report catcher Summary ---
chip_sw_kmac_mode_kmac_jitter_en_reduced_freq 100899985232125562668791869227464167253581587412799862041678088288349688542732 312
UVM_INFO @ 10.200001 us: (uvm_report_catcher.svh:705) [UVM/REPORT/CATCHER]
--- UVM Report catcher Summary ---
chip_sw_sram_ctrl_scrambled_access_jitter_en_reduced_freq 10087389546996838304571378675961226726579630509149251321825492071177898373730 312
UVM_INFO @ 10.400001 us: (uvm_report_catcher.svh:705) [UVM/REPORT/CATCHER]
--- UVM Report catcher Summary ---
chip_sw_csrng_edn_concurrency_reduced_freq 90176578283768849899214776712982489396823598931470509950378634238334752024482 312
UVM_INFO @ 10.180001 us: (uvm_report_catcher.svh:705) [UVM/REPORT/CATCHER]
--- UVM Report catcher Summary ---
Offending '((~rst_ni) === (~seed_en_q))' 10 test runs
chip_sw_lc_ctrl_rma_to_scrap 83769235413307877913944613653665445950413678656663618310916552856218412447691 333
UVM_ERROR @ 172.312000 us: (otbn_rnd.sv:233) [ASSERT FAILED] UrndNoReseedOnReset_A
UVM_INFO @ 172.312000 us: (uvm_report_catcher.svh:705) [UVM/REPORT/CATCHER]
--- UVM Report catcher Summary ---
chip_sw_lc_ctrl_raw_to_scrap 28166266147366786131472325896818632931249372714260963566946936129100907910872 322
UVM_ERROR @ 170.776000 us: (otbn_rnd.sv:233) [ASSERT FAILED] UrndNoReseedOnReset_A
UVM_INFO @ 170.776000 us: (uvm_report_catcher.svh:705) [UVM/REPORT/CATCHER]
--- UVM Report catcher Summary ---
chip_sw_lc_ctrl_test_locked0_to_scrap 72720816144130416766682713435885525615183230309163119876709864820050223426675 322
UVM_ERROR @ 168.824000 us: (otbn_rnd.sv:233) [ASSERT FAILED] UrndNoReseedOnReset_A
UVM_INFO @ 168.824000 us: (uvm_report_catcher.svh:705) [UVM/REPORT/CATCHER]
--- UVM Report catcher Summary ---
chip_sw_lc_ctrl_rand_to_scrap 111390330122487672358073698266968614261246389699833259301827990116929644877567 322
UVM_ERROR @ 171.112000 us: (otbn_rnd.sv:233) [ASSERT FAILED] UrndNoReseedOnReset_A
UVM_INFO @ 171.112000 us: (uvm_report_catcher.svh:705) [UVM/REPORT/CATCHER]
--- UVM Report catcher Summary ---
chip_sw_lc_ctrl_volatile_raw_unlock 1195344158534956747188261963925035518870448931961925140916470619444088361124 325
UVM_ERROR @ 453.976000 us: (otbn_rnd.sv:233) [ASSERT FAILED] UrndNoReseedOnReset_A
UVM_INFO @ 453.976000 us: (uvm_report_catcher.svh:705) [UVM/REPORT/CATCHER]
--- UVM Report catcher Summary ---
chip_sw_lc_ctrl_volatile_raw_unlock_ext_clk_48mhz 33083124883783050280314834338925130473766363620539059196824834242177018041889 328
UVM_ERROR @ 515.400000 us: (otbn_rnd.sv:233) [ASSERT FAILED] UrndNoReseedOnReset_A
UVM_INFO @ 515.400000 us: (uvm_report_catcher.svh:705) [UVM/REPORT/CATCHER]
--- UVM Report catcher Summary ---
chip_sw_pwrmgr_full_aon_reset 115545605381097036016438842725811900471074505822983872476228766126762066607597 316
UVM_ERROR @ 118.472000 us: (otbn_rnd.sv:233) [ASSERT FAILED] UrndNoReseedOnReset_A
UVM_INFO @ 118.472000 us: (uvm_report_catcher.svh:705) [UVM/REPORT/CATCHER]
--- UVM Report catcher Summary ---
chip_sw_rom_ctrl_integrity_check 5498216535290013265975250784987759673157290299003543864797202525921816243151 324
UVM_ERROR @ 157.272000 us: (otbn_rnd.sv:233) [ASSERT FAILED] UrndNoReseedOnReset_A
UVM_INFO @ 157.272000 us: (uvm_report_catcher.svh:705) [UVM/REPORT/CATCHER]
--- UVM Report catcher Summary ---
chip_prim_tl_access 87433487249633207160835037589899364593754065023972524232696785119550240949194 234
UVM_ERROR @ 118.328000 us: (otbn_rnd.sv:233) [ASSERT FAILED] UrndNoReseedOnReset_A
UVM_INFO @ 118.328000 us: (uvm_report_catcher.svh:705) [UVM/REPORT/CATCHER]
--- UVM Report catcher Summary ---
chip_rv_dm_lc_disabled 85327390393794645507911916945736572821178787540090410660778550438778054675038 211
UVM_ERROR @ 125.736000 us: (otbn_rnd.sv:233) [ASSERT FAILED] UrndNoReseedOnReset_A
UVM_INFO @ 125.736000 us: (uvm_report_catcher.svh:705) [UVM/REPORT/CATCHER]
--- UVM Report catcher Summary ---
Offending '((!rstreqs[*]) && (reset_cause != HwReq))' 5 test runs
chip_sw_rstmgr_cpu_info 35657351976292033173040379992426005414010995745905713583773172011635699225793 346
UVM_ERROR @ 412.064000 us: (pwrmgr_rstreqs_sva_if.sv:55) [ASSERT FAILED] HwResetOff_A
UVM_INFO @ 412.064000 us: (uvm_report_catcher.svh:705) [UVM/REPORT/CATCHER]
--- UVM Report catcher Summary ---
chip_sw_clkmgr_off_aes_trans 88188262255715349227971791032765053506401933539564779809466977156420402071556 323
UVM_ERROR @ 185.344000 us: (pwrmgr_rstreqs_sva_if.sv:55) [ASSERT FAILED] HwResetOff_A
UVM_INFO @ 185.344000 us: (uvm_report_catcher.svh:705) [UVM/REPORT/CATCHER]
--- UVM Report catcher Summary ---
chip_sw_clkmgr_off_hmac_trans 89994689842354435146569035003476817648412567951047687538380311335106564936567 323
UVM_ERROR @ 185.312000 us: (pwrmgr_rstreqs_sva_if.sv:55) [ASSERT FAILED] HwResetOff_A
UVM_INFO @ 185.312000 us: (uvm_report_catcher.svh:705) [UVM/REPORT/CATCHER]
--- UVM Report catcher Summary ---
chip_sw_clkmgr_off_kmac_trans 64886182846274083909206575518811865489765304987797447005972847048032202778358 323
UVM_ERROR @ 185.264000 us: (pwrmgr_rstreqs_sva_if.sv:55) [ASSERT FAILED] HwResetOff_A
UVM_INFO @ 185.264000 us: (uvm_report_catcher.svh:705) [UVM/REPORT/CATCHER]
--- UVM Report catcher Summary ---
chip_sw_clkmgr_off_otbn_trans 52571620102739402347944916221588377314315013061080374314238268320000693473913 323
UVM_ERROR @ 185.264000 us: (pwrmgr_rstreqs_sva_if.sv:55) [ASSERT FAILED] HwResetOff_A
UVM_INFO @ 185.264000 us: (uvm_report_catcher.svh:705) [UVM/REPORT/CATCHER]
--- UVM Report catcher Summary ---
UVM_FATAL @ * us: (mem_bkdr_util.sv:658) [mem_bkdr_util[Otp]] file otp_ctrl_img_rma.vmem could not be opened for r mode 3 test runs
chip_csr_bit_bash 25880485041781667532859943647035141767861840459640900202798625992208540765731 136
UVM_INFO @ 0.000000 us: (uvm_report_catcher.svh:705) [UVM/REPORT/CATCHER]
--- UVM Report catcher Summary ---
chip_csr_aliasing 9312029231363374273274679873405774998983794483631261970781421065070967908486 136
UVM_INFO @ 0.000000 us: (uvm_report_catcher.svh:705) [UVM/REPORT/CATCHER]
--- UVM Report catcher Summary ---
chip_same_csr_outstanding 18007974002119449990039173200312622527549776240714426661798107006064626848066 136
UVM_INFO @ 0.000000 us: (uvm_report_catcher.svh:705) [UVM/REPORT/CATCHER]
--- UVM Report catcher Summary ---
UVM_ERROR @ * us: (jtag_riscv_driver.sv:221) [jtag_riscv_agent_pkg] Check failed sbcs_val[SbAccess32] == * (* [*] vs * [*]) expect SBA width to be * bits! 2 test runs
chip_jtag_csr_rw 73071843217459946798733644372518313196688565276168818003829542967081520679404 5956
UVM_INFO @ 130.727000 us: (uvm_report_catcher.svh:705) [UVM/REPORT/CATCHER]
--- UVM Report catcher Summary ---
chip_jtag_mem_access 70194693657424541892727766056899098660835394940190074059274619786760109206013 5956
UVM_INFO @ 131.278000 us: (uvm_report_catcher.svh:705) [UVM/REPORT/CATCHER]
--- UVM Report catcher Summary ---
UVM_FATAL @ * us: (mem_bkdr_util.sv:658) [mem_bkdr_util[Rom0]] file example_test_from_rom_rom_prog_sim_dv.*.scr.vmem could not be opened for r mode 1 test run
chip_sw_example_rom 97547759644252261664946273880324186158873544248092906388854969922332405490794 284
UVM_INFO @ 10.320001 us: (uvm_report_catcher.svh:705) [UVM/REPORT/CATCHER]
--- UVM Report catcher Summary ---
UVM_ERROR @ * us: (sw_logger_if.sv:526) [all_escalation_resets_test_sim_dv(sw/device/lib/testing/alert_handler_testutils.c:78)] CHECK-fail: word_index < dump_size 1 test run
chip_sw_all_escalation_resets 479137952182295394387408360448818917385955018640337466039697712737097423975 350
UVM_INFO @ 943.602000 us: (uvm_report_catcher.svh:705) [UVM/REPORT/CATCHER]
--- UVM Report catcher Summary ---
UVM_FATAL @ * us: (sec_cm_pkg.sv:48) [sec_cm_pkg::find_sec_cm_if_proxy] no proxy with path *rstmgr.u_d0_spi_host*.leaf_rst_path 1 test run
chip_sw_rstmgr_rst_cnsty_escalation 52052969659738062744232761307412692733287556516919980724442182682997847961783 313
UVM_INFO @ 10.140001 us: (uvm_report_catcher.svh:705) [UVM/REPORT/CATCHER]
--- UVM Report catcher Summary ---
Job timed out after * minutes 1 test run
chip_sw_spi_device_pass_through_collision 54947288984463239202195701595792350881288829556105383211794529290967656736783 None
Offending '(!$fell(lc_ctrl_pkg::lc_tx_test_true_strict(lc_init_done_o)))' 1 test run
chip_sw_otp_ctrl_escalation 94722603075900153587831530658066975437596158727942230585604448399046895314422 328
UVM_ERROR @ 176.944000 us: (lc_ctrl.sv:884) [ASSERT FAILED] LcInitDoneSticky_A
UVM_INFO @ 176.944000 us: (uvm_report_catcher.svh:705) [UVM/REPORT/CATCHER]
--- UVM Report catcher Summary ---
UVM_ERROR @ * us: (sw_logger_if.sv:526) [rstmgr_alert_info_test_sim_dv(sw/device/lib/testing/alert_handler_testutils.c:78)] CHECK-fail: word_index < dump_size 1 test run
chip_sw_rstmgr_alert_info 68638301600010745092722728184169702842290548163439917689868531060280844264720 342
UVM_INFO @ 331.207000 us: (uvm_report_catcher.svh:705) [UVM/REPORT/CATCHER]
--- UVM Report catcher Summary ---
UVM_ERROR @ * us: (chip_sw_soc_proxy_smoke_vseq.sv:36) [chip_env_pkg::\chip_sw_soc_proxy_smoke_vseq::body ] Resets did not complete within required time! 1 test run
chip_sw_soc_proxy_smoketest 14937244957555415326110003767375737586011942080182885708912682980625858652266 321
UVM_INFO @ 156.160000 us: (uvm_report_catcher.svh:705) [UVM/REPORT/CATCHER]
--- UVM Report catcher Summary ---
UVM_ERROR @ * us: (sw_logger_if.sv:526) [soc_proxy_external_wakeup_sim_dv(sw/device/tests/soc_proxy_external_wakeup.c:50)] DIF-fail: dif_pwrmgr_get_request_sources(&pwrmgr, kDifPwrmgrReqTypeWakeup, &wakeup_req_srcs) returns * 1 test run
chip_sw_soc_proxy_external_wakeup 63144360377410134914247914258523998081703428368861518286693960234383619850055 319
UVM_INFO @ 157.833000 us: (uvm_report_catcher.svh:705) [UVM/REPORT/CATCHER]
--- UVM Report catcher Summary ---
UVM_ERROR @ * us: (sw_logger_if.sv:526) [aon_timer_irq_test_sim_dv(sw/device/tests/aon_timer_irq_test.c:139)] CHECK-fail: Timer took * usec which is not in the range * usec and * usec 1 test run
chip_sw_aon_timer_irq 65493913333560466545457576288872031834781772907035581006095545519083117548733 320
UVM_INFO @ 564.285000 us: (uvm_report_catcher.svh:705) [UVM/REPORT/CATCHER]
--- UVM Report catcher Summary ---
UVM_ERROR @ * us: (sw_logger_if.sv:526) [aon_timer_wdog_bite_reset_test_sim_dv(sw/device/tests/aon_timer_wdog_bite_reset_test.c:84)] CHECK-fail: Wdog bark irq did not rise after * microseconds 1 test run
chip_sw_aon_timer_wdog_bite_reset 87133864644942256252810287279416776679137086918529562476955042281598042400308 321
UVM_INFO @ 182.523000 us: (uvm_report_catcher.svh:705) [UVM/REPORT/CATCHER]
--- UVM Report catcher Summary ---
UVM_ERROR @ * us: (sw_logger_if.sv:526) [rv_core_ibex_nmi_irq_test_sim_dv(sw/device/tests/rv_core_ibex_nmi_irq_test.c:172)] CHECK-fail: Timed out after * usec (* CPU cycles) waiting for nmi_fired 1 test run
chip_sw_rv_core_ibex_nmi_irq 90360269835273763164394813217926585627212531766603637463978649407070709961502 322
UVM_INFO @ 269.312000 us: (uvm_report_catcher.svh:705) [UVM/REPORT/CATCHER]
--- UVM Report catcher Summary ---
Offending '(tl_h_i[*].a_source[(IDW - *)-:STIDW] == '0)' 1 test run
chip_tl_errors 89863665470050702104111319416366200813119615960633797411663093107832558327504 232
UVM_ERROR @ 117.811000 us: (tlul_socket_m1.sv:101) [ASSERT FAILED] idInRange
UVM_INFO @ 117.811000 us: (uvm_report_catcher.svh:705) [UVM/REPORT/CATCHER]
--- UVM Report catcher Summary ---
Error-[CNST-CIF] Constraints inconsistency failure 1 test run
chip_padctrl_attributes 58646171462842160844122505697517680308022563851088623575011714460136269647313 281
src/lowrisc_dv_dv_lib_0/dv_base_test.sv, 143
Constraints are inconsistent and cannot be solved.
Please check the inconsistent constraints being printed above and rewrite
them.
UVM_FATAL @ * us: sequencer [sequencer] Item_done() called with no outstanding requests. Each call to item_done() must be paired with a previous call to get_next_item(). 1 test run
chip_sw_dma_abort 47617148400857226847961519136413344768651195282812458038862542029195834432958 327
UVM_INFO @ 193.352000 us: (uvm_report_catcher.svh:705) [UVM/REPORT/CATCHER]
--- UVM Report catcher Summary ---