Simulation Results: chip

 
12/08/2026 19:42:27 DVSim: v1.50.1 sha: c96e07a json Branch: master Tool: vcs [unknown]
Coverage statistics
  • Total
  • 65.76 %
  • code
  • 61.13 %
  • assert
  • 76.58 %
  • func
  • 59.58 %
  • line
  • 67.11 %
  • branch
  • 73.24 %
  • cond
  • 63.12 %
  • toggle
  • 45.02 %
  • FSM
  • 57.14 %
Validation stages
V1
27.27%
V2
32.16%
V2S
100.00%
V3
0.00%
unmapped
40.00%
Testpoint Test Max Runtime Sim Time Pass Total %
chip_sw_uart_tx_rx 0 1 0.00
chip_sw_uart_tx_rx 8.929s 0.000us 0 1 0.00
chip_sw_uart_rx_overflow 0 1 0.00
chip_sw_uart_tx_rx 8.929s 0.000us 0 1 0.00
chip_sw_uart_rand_baudrate 0 1 0.00
chip_sw_uart_rand_baudrate 17.708s 0.000us 0 1 0.00
chip_sw_uart_tx_rx_alt_clk_freq 0 1 0.00
chip_sw_uart_tx_rx_alt_clk_freq 13.186s 0.000us 0 1 0.00
chip_sw_gpio_out 1 1 100.00
chip_sw_gpio 354.110s 298.429us 1 1 100.00
chip_sw_gpio_in 1 1 100.00
chip_sw_gpio 354.110s 298.429us 1 1 100.00
chip_sw_gpio_irq 1 1 100.00
chip_sw_gpio 354.110s 298.429us 1 1 100.00
chip_sw_example_tests 1 4 25.00
chip_sw_example_rom 36.680s 10.260us 0 1 0.00
chip_sw_example_manufacturer 10.807s 0.000us 0 1 0.00
chip_sw_example_concurrency 200.410s 168.719us 1 1 100.00
chip_sw_uart_smoketest_signed 8.773s 0.000us 0 1 0.00
csr_bit_bash 0 1 0.00
chip_csr_bit_bash 9.160s 0.000us 0 1 0.00
csr_aliasing 0 1 0.00
chip_csr_aliasing 9.270s 0.000us 0 1 0.00
regwen_csr_and_corresponding_lockable_csr 0 1 0.00
chip_csr_aliasing 9.270s 0.000us 0 1 0.00
xbar_smoke 1 1 100.00
xbar_smoke 18.900s 49.570us 1 1 100.00
Testpoint Test Max Runtime Sim Time Pass Total %
chip_sw_spi_device_flash_mode 0 1 0.00
chip_sw_uart_tx_rx_bootstrap 18.042s 0.000us 0 1 0.00
chip_sw_spi_device_pass_through 1 1 100.00
chip_sw_spi_device_pass_through 2413.220s 4352.209us 1 1 100.00
chip_sw_spi_device_pass_through_collision 0 1 0.00
chip_sw_spi_device_pass_through_collision 276.420s 226.418us 0 1 0.00
chip_sw_spi_device_tpm 0 1 0.00
chip_sw_spi_device_tpm 10.794s 0.000us 0 1 0.00
chip_sw_spi_host_tx_rx 0 1 0.00
chip_sw_spi_host_tx_rx 10.192s 0.000us 0 1 0.00
chip_sw_i2c_host_tx_rx 0 1 0.00
chip_sw_i2c_host_tx_rx 8.862s 0.000us 0 1 0.00
chip_sw_i2c_device_tx_rx 0 1 0.00
chip_sw_i2c_device_tx_rx 11.595s 0.000us 0 1 0.00
chip_pin_mux 0 1 0.00
chip_padctrl_attributes 2.730s 0.000us 0 1 0.00
chip_padctrl_attributes 0 1 0.00
chip_padctrl_attributes 2.730s 0.000us 0 1 0.00
chip_sw_sleep_pin_wake 0 1 0.00
chip_sw_sleep_pin_wake 11.549s 0.000us 0 1 0.00
chip_sw_sleep_pin_retention 0 1 0.00
chip_sw_sleep_pin_retention 12.313s 0.000us 0 1 0.00
chip_sw_data_integrity 0 1 0.00
chip_sw_data_integrity_escalation 25.727s 0.000us 0 1 0.00
chip_sw_instruction_integrity 0 1 0.00
chip_sw_data_integrity_escalation 25.727s 0.000us 0 1 0.00
chip_jtag_csr_rw 0 1 0.00
chip_jtag_csr_rw 116.360s 132.035us 0 1 0.00
chip_jtag_mem_access 0 1 0.00
chip_jtag_mem_access 118.840s 131.368us 0 1 0.00
chip_rv_dm_ndm_reset_req 1 1 100.00
chip_rv_dm_ndm_reset_req 319.670s 310.544us 1 1 100.00
chip_sw_rv_dm_ndm_reset_req_when_cpu_halted 0 1 0.00
chip_sw_rv_dm_ndm_reset_req_when_cpu_halted 8.957s 0.000us 0 1 0.00
chip_rv_dm_access_after_wakeup 0 1 0.00
chip_sw_rv_dm_access_after_wakeup 8.423s 0.000us 0 1 0.00
chip_rv_dm_lc_disabled 0 1 0.00
chip_rv_dm_lc_disabled 90.460s 120.744us 0 1 0.00
chip_sw_timer 1 1 100.00
chip_sw_rv_timer_irq 286.630s 266.935us 1 1 100.00
chip_sw_aon_timer_wakeup_irq 0 1 0.00
chip_sw_aon_timer_irq 455.260s 492.310us 0 1 0.00
chip_sw_aon_timer_wdog_bark_irq 0 1 0.00
chip_sw_aon_timer_irq 455.260s 492.310us 0 1 0.00
chip_sw_aon_timer_wdog_lc_escalate 1 1 100.00
chip_sw_aon_timer_wdog_lc_escalate 409.140s 386.450us 1 1 100.00
chip_sw_aon_timer_wdog_bite_reset 0 1 0.00
chip_sw_aon_timer_wdog_bite_reset 220.310s 182.503us 0 1 0.00
chip_sw_aon_timer_sleep_wdog_bite_reset 0 1 0.00
chip_sw_aon_timer_wdog_bite_reset 220.310s 182.503us 0 1 0.00
chip_sw_aon_timer_sleep_wdog_sleep_pause 1 1 100.00
chip_sw_aon_timer_sleep_wdog_sleep_pause 367.690s 2310.344us 1 1 100.00
chip_sw_plic_sw_irq 1 1 100.00
chip_sw_plic_sw_irq 198.110s 164.208us 1 1 100.00
chip_sw_clkmgr_idle_trans 4 4 100.00
chip_sw_otbn_randomness 287.470s 244.986us 1 1 100.00
chip_sw_aes_idle 208.580s 165.903us 1 1 100.00
chip_sw_hmac_enc_idle 213.870s 178.093us 1 1 100.00
chip_sw_kmac_idle 201.500s 164.014us 1 1 100.00
chip_sw_clkmgr_off_trans 0 4 0.00
chip_sw_clkmgr_off_aes_trans 196.710s 185.280us 0 1 0.00
chip_sw_clkmgr_off_hmac_trans 197.530s 185.200us 0 1 0.00
chip_sw_clkmgr_off_kmac_trans 202.410s 185.168us 0 1 0.00
chip_sw_clkmgr_off_otbn_trans 211.630s 185.280us 0 1 0.00
chip_sw_clkmgr_jitter 1 7 14.29
chip_sw_otbn_ecdsa_op_irq_jitter_en 41.060s 10.320us 0 1 0.00
chip_sw_aes_enc_jitter_en 43.950s 10.160us 0 1 0.00
chip_sw_hmac_enc_jitter_en 42.750s 10.220us 0 1 0.00
chip_sw_keymgr_dpe_key_derivation_jitter_en 40.550s 10.240us 0 1 0.00
chip_sw_kmac_mode_kmac_jitter_en 47.000s 10.160us 0 1 0.00
chip_sw_sram_ctrl_scrambled_access_jitter_en 11.431s 0.000us 0 1 0.00
chip_sw_clkmgr_jitter 176.320s 161.229us 1 1 100.00
chip_sw_clkmgr_extended_range 1 8 12.50
chip_sw_clkmgr_jitter_reduced_freq 385.770s 1962.805us 1 1 100.00
chip_sw_otbn_ecdsa_op_irq_jitter_en_reduced_freq 40.590s 10.240us 0 1 0.00
chip_sw_aes_enc_jitter_en_reduced_freq 43.940s 10.120us 0 1 0.00
chip_sw_hmac_enc_jitter_en_reduced_freq 44.060s 10.260us 0 1 0.00
chip_sw_keymgr_dpe_key_derivation_jitter_en_reduced_freq 43.300s 10.400us 0 1 0.00
chip_sw_kmac_mode_kmac_jitter_en_reduced_freq 42.230s 10.200us 0 1 0.00
chip_sw_sram_ctrl_scrambled_access_jitter_en_reduced_freq 40.170s 10.340us 0 1 0.00
chip_sw_csrng_edn_concurrency_reduced_freq 40.380s 10.120us 0 1 0.00
chip_sw_clkmgr_deep_sleep_frequency 0 1 0.00
chip_sw_ast_clk_outputs 8.666s 0.000us 0 1 0.00
chip_sw_clkmgr_sleep_frequency 0 1 0.00
chip_sw_clkmgr_sleep_frequency 9.451s 0.000us 0 1 0.00
chip_sw_clkmgr_reset_frequency 0 1 0.00
chip_sw_clkmgr_reset_frequency 10.129s 0.000us 0 1 0.00
chip_sw_clkmgr_escalation_reset 0 1 0.00
chip_sw_all_escalation_resets 1208.710s 943.835us 0 1 0.00
chip_sw_pwrmgr_external_full_reset 0 1 0.00
chip_sw_pwrmgr_full_aon_reset 126.790s 118.468us 0 1 0.00
chip_sw_pwrmgr_sleep_all_reset_reqs 0 1 0.00
chip_sw_aon_timer_wdog_bite_reset 220.310s 182.503us 0 1 0.00
chip_sw_pwrmgr_wdog_reset 0 1 0.00
chip_sw_pwrmgr_wdog_reset 9.083s 0.000us 0 1 0.00
chip_sw_pwrmgr_power_glitch_reset 0 1 0.00
chip_sw_pwrmgr_full_aon_reset 126.790s 118.468us 0 1 0.00
chip_sw_pwrmgr_main_power_glitch_reset 0 1 0.00
chip_sw_pwrmgr_main_power_glitch_reset 13.614s 0.000us 0 1 0.00
chip_sw_pwrmgr_random_sleep_power_glitch_reset 0 1 0.00
chip_sw_pwrmgr_random_sleep_power_glitch_reset 16.989s 0.000us 0 1 0.00
chip_sw_pwrmgr_deep_sleep_power_glitch_reset 0 1 0.00
chip_sw_pwrmgr_deep_sleep_power_glitch_reset 11.277s 0.000us 0 1 0.00
chip_sw_pwrmgr_sleep_power_glitch_reset 0 1 0.00
chip_sw_pwrmgr_sleep_power_glitch_reset 9.177s 0.000us 0 1 0.00
chip_sw_pwrmgr_sleep_disabled 0 1 0.00
chip_sw_pwrmgr_sleep_disabled 9.724s 0.000us 0 1 0.00
chip_sw_pwrmgr_escalation_reset 0 1 0.00
chip_sw_all_escalation_resets 1208.710s 943.835us 0 1 0.00
chip_sw_rstmgr_sys_reset_info 1 1 100.00
chip_rv_dm_ndm_reset_req 319.670s 310.544us 1 1 100.00
chip_sw_rstmgr_cpu_info 0 1 0.00
chip_sw_rstmgr_cpu_info 423.850s 412.016us 0 1 0.00
chip_sw_rstmgr_sw_req_reset 1 1 100.00
chip_sw_rstmgr_sw_req 351.980s 305.401us 1 1 100.00
chip_sw_rstmgr_alert_info 0 1 0.00
chip_sw_rstmgr_alert_info 363.300s 331.156us 0 1 0.00
chip_sw_rstmgr_sw_rst 1 1 100.00
chip_sw_rstmgr_sw_rst 208.240s 163.652us 1 1 100.00
chip_sw_rstmgr_escalation_reset 0 1 0.00
chip_sw_all_escalation_resets 1208.710s 943.835us 0 1 0.00
chip_sw_alert_handler_alerts 0 1 0.00
chip_sw_alert_test 9.560s 0.000us 0 1 0.00
chip_sw_alert_handler_escalations 0 1 0.00
chip_sw_alert_handler_escalation 12.253s 0.000us 0 1 0.00
chip_sw_all_escalation_resets 0 1 0.00
chip_sw_all_escalation_resets 1208.710s 943.835us 0 1 0.00
chip_sw_alert_handler_entropy 0 1 0.00
chip_sw_alert_handler_entropy 12.818s 0.000us 0 1 0.00
chip_sw_alert_handler_crashdump 0 1 0.00
chip_sw_rstmgr_alert_info 363.300s 331.156us 0 1 0.00
chip_sw_alert_handler_ping_timeout 1 1 100.00
chip_sw_alert_handler_ping_timeout 390.650s 398.595us 1 1 100.00
chip_sw_alert_handler_lpg_sleep_mode_alerts 0 1 0.00
chip_sw_alert_handler_lpg_sleep_mode_alerts 64.825s 0.000us 0 1 0.00
chip_sw_alert_handler_lpg_sleep_mode_pings 0 1 0.00
chip_sw_alert_handler_lpg_sleep_mode_pings 72.752s 0.000us 0 1 0.00
chip_sw_alert_handler_lpg_clock_off 0 1 0.00
chip_sw_alert_handler_lpg_clkoff 90.544s 0.000us 0 1 0.00
chip_sw_alert_handler_lpg_reset_toggle 0 1 0.00
chip_sw_alert_handler_lpg_reset_toggle 83.374s 0.000us 0 1 0.00
chip_sw_alert_handler_reverse_ping_in_deep_sleep 0 1 0.00
chip_sw_alert_handler_reverse_ping_in_deep_sleep 55.903s 0.000us 0 1 0.00
chip_sw_lc_ctrl_alert_handler_escalation 0 1 0.00
chip_sw_alert_handler_escalation 12.253s 0.000us 0 1 0.00
chip_sw_lc_ctrl_jtag_access 0 1 0.00
chip_sw_lc_ctrl_transition 10.330s 0.000us 0 1 0.00
chip_sw_lc_ctrl_otp_hw_cfg 0 1 0.00
chip_sw_lc_ctrl_otp_hw_cfg 9.763s 0.000us 0 1 0.00
chip_sw_lc_ctrl_init 0 1 0.00
chip_sw_lc_ctrl_transition 10.330s 0.000us 0 1 0.00
chip_sw_lc_ctrl_transitions 0 1 0.00
chip_sw_lc_ctrl_transition 10.330s 0.000us 0 1 0.00
chip_sw_lc_ctrl_kmac_req 0 1 0.00
chip_sw_lc_ctrl_transition 10.330s 0.000us 0 1 0.00
chip_sw_lc_ctrl_key_div 1 1 100.00
chip_sw_keymgr_dpe_key_derivation_prod 412.730s 351.298us 1 1 100.00
chip_sw_lc_ctrl_broadcast 1 10 10.00
chip_sw_otp_ctrl_lc_signals_test_unlocked0 10.248s 0.000us 0 1 0.00
chip_sw_otp_ctrl_lc_signals_dev 18.699s 0.000us 0 1 0.00
chip_sw_otp_ctrl_lc_signals_prod 13.651s 0.000us 0 1 0.00
chip_sw_otp_ctrl_lc_signals_rma 12.725s 0.000us 0 1 0.00
chip_sw_lc_ctrl_transition 10.330s 0.000us 0 1 0.00
chip_sw_keymgr_dpe_key_derivation 408.040s 359.693us 1 1 100.00
chip_sw_rom_ctrl_integrity_check 187.930s 157.256us 0 1 0.00
chip_sw_sram_ctrl_execution_main 9.451s 0.000us 0 1 0.00
chip_prim_tl_access 89.530s 118.840us 0 1 0.00
chip_rv_dm_lc_disabled 90.460s 120.744us 0 1 0.00
chip_sw_aes_enc 1 2 50.00
chip_sw_aes_enc 214.180s 173.112us 1 1 100.00
chip_sw_aes_enc_jitter_en 43.950s 10.160us 0 1 0.00
chip_sw_aes_gcm 1 2 50.00
chip_sw_aes_enc 214.180s 173.112us 1 1 100.00
chip_sw_aes_enc_jitter_en 43.950s 10.160us 0 1 0.00
chip_sw_aes_entropy 1 1 100.00
chip_sw_aes_entropy 210.010s 164.449us 1 1 100.00
chip_sw_aes_idle 1 1 100.00
chip_sw_aes_idle 208.580s 165.903us 1 1 100.00
chip_sw_hmac_enc 1 2 50.00
chip_sw_hmac_enc 202.680s 173.777us 1 1 100.00
chip_sw_hmac_enc_jitter_en 42.750s 10.220us 0 1 0.00
chip_sw_hmac_idle 1 1 100.00
chip_sw_hmac_enc_idle 213.870s 178.093us 1 1 100.00
chip_sw_kmac_enc 2 3 66.67
chip_sw_kmac_mode_cshake 220.050s 167.313us 1 1 100.00
chip_sw_kmac_mode_kmac 228.900s 188.933us 1 1 100.00
chip_sw_kmac_mode_kmac_jitter_en 47.000s 10.160us 0 1 0.00
chip_sw_kmac_app_keymgr 1 1 100.00
chip_sw_keymgr_dpe_key_derivation 408.040s 359.693us 1 1 100.00
chip_sw_kmac_app_lc 0 1 0.00
chip_sw_lc_ctrl_transition 10.330s 0.000us 0 1 0.00
chip_sw_kmac_app_rom 0 1 0.00
chip_sw_kmac_app_rom 13.055s 0.000us 0 1 0.00
chip_sw_kmac_entropy 1 1 100.00
chip_sw_kmac_entropy 276.310s 216.601us 1 1 100.00
chip_sw_kmac_idle 1 1 100.00
chip_sw_kmac_idle 201.500s 164.014us 1 1 100.00
chip_sw_entropy_src_csrng 1 1 100.00
chip_sw_entropy_src_csrng 1665.960s 2224.036us 1 1 100.00
chip_sw_csrng_edn_cmd 1 1 100.00
chip_sw_entropy_src_csrng 1665.960s 2224.036us 1 1 100.00
chip_sw_csrng_fuse_en_sw_app_read 0 1 0.00
chip_sw_csrng_fuse_en_sw_app_read_test 12.651s 0.000us 0 1 0.00
chip_sw_csrng_known_answer_tests 1 1 100.00
chip_sw_csrng_kat_test 202.630s 176.000us 1 1 100.00
chip_sw_edn_entropy_reqs 1 1 100.00
chip_sw_csrng_edn_concurrency 1867.010s 1235.920us 1 1 100.00
chip_sw_keymgr_dpe_key_derivation 1 2 50.00
chip_sw_keymgr_dpe_key_derivation 408.040s 359.693us 1 1 100.00
chip_sw_keymgr_dpe_key_derivation_jitter_en 40.550s 10.240us 0 1 0.00
chip_sw_otbn_op 1 2 50.00
chip_sw_otbn_ecdsa_op_irq 3099.630s 1500.273us 1 1 100.00
chip_sw_otbn_ecdsa_op_irq_jitter_en 41.060s 10.320us 0 1 0.00
chip_sw_otbn_rnd_entropy 1 1 100.00
chip_sw_otbn_randomness 287.470s 244.986us 1 1 100.00
chip_sw_otbn_urnd_entropy 1 1 100.00
chip_sw_otbn_randomness 287.470s 244.986us 1 1 100.00
chip_sw_otbn_idle 1 1 100.00
chip_sw_otbn_randomness 287.470s 244.986us 1 1 100.00
chip_sw_otbn_mem_scramble 1 1 100.00
chip_sw_otbn_mem_scramble 416.360s 280.670us 1 1 100.00
chip_sw_rom_access 0 1 0.00
chip_sw_rom_ctrl_integrity_check 187.930s 157.256us 0 1 0.00
chip_sw_rom_ctrl_integrity_check 0 1 0.00
chip_sw_rom_ctrl_integrity_check 187.930s 157.256us 0 1 0.00
chip_sw_sram_scrambled_access 1 2 50.00
chip_sw_sram_ctrl_scrambled_access 437.520s 358.487us 1 1 100.00
chip_sw_sram_ctrl_scrambled_access_jitter_en 11.431s 0.000us 0 1 0.00
chip_sw_sram_execution 0 1 0.00
chip_sw_sram_ctrl_execution_main 9.451s 0.000us 0 1 0.00
chip_sw_sram_lc_escalation 0 2 0.00
chip_sw_all_escalation_resets 1208.710s 943.835us 0 1 0.00
chip_sw_data_integrity_escalation 25.727s 0.000us 0 1 0.00
chip_otp_ctrl_init 0 1 0.00
chip_sw_lc_ctrl_transition 10.330s 0.000us 0 1 0.00
chip_sw_otp_ctrl_keys 4 4 100.00
chip_sw_otbn_mem_scramble 416.360s 280.670us 1 1 100.00
chip_sw_keymgr_dpe_key_derivation 408.040s 359.693us 1 1 100.00
chip_sw_sram_ctrl_scrambled_access 437.520s 358.487us 1 1 100.00
chip_sw_rv_core_ibex_icache_invalidate 205.300s 186.939us 1 1 100.00
chip_sw_otp_ctrl_entropy 4 4 100.00
chip_sw_otbn_mem_scramble 416.360s 280.670us 1 1 100.00
chip_sw_keymgr_dpe_key_derivation 408.040s 359.693us 1 1 100.00
chip_sw_sram_ctrl_scrambled_access 437.520s 358.487us 1 1 100.00
chip_sw_rv_core_ibex_icache_invalidate 205.300s 186.939us 1 1 100.00
chip_sw_otp_ctrl_program 0 1 0.00
chip_sw_lc_ctrl_transition 10.330s 0.000us 0 1 0.00
chip_sw_otp_ctrl_program_error 0 1 0.00
chip_sw_lc_ctrl_program_error 8.924s 0.000us 0 1 0.00
chip_sw_otp_ctrl_hw_cfg 0 1 0.00
chip_sw_lc_ctrl_otp_hw_cfg 9.763s 0.000us 0 1 0.00
chip_sw_otp_ctrl_lc_signals 0 6 0.00
chip_sw_otp_ctrl_lc_signals_test_unlocked0 10.248s 0.000us 0 1 0.00
chip_sw_otp_ctrl_lc_signals_dev 18.699s 0.000us 0 1 0.00
chip_sw_otp_ctrl_lc_signals_prod 13.651s 0.000us 0 1 0.00
chip_sw_otp_ctrl_lc_signals_rma 12.725s 0.000us 0 1 0.00
chip_sw_lc_ctrl_transition 10.330s 0.000us 0 1 0.00
chip_prim_tl_access 89.530s 118.840us 0 1 0.00
chip_sw_otp_prim_tl_access 0 1 0.00
chip_prim_tl_access 89.530s 118.840us 0 1 0.00
chip_sw_otp_ctrl_nvm_cnt 0 1 0.00
chip_sw_otp_ctrl_nvm_cnt 12.289s 0.000us 0 1 0.00
chip_sw_otp_ctrl_sw_parts 0 1 0.00
chip_sw_otp_ctrl_sw_parts 10.191s 0.000us 0 1 0.00
chip_sw_ast_clk_outputs 0 1 0.00
chip_sw_ast_clk_outputs 8.666s 0.000us 0 1 0.00
chip_sw_ast_sys_clk_jitter 1 7 14.29
chip_sw_otbn_ecdsa_op_irq_jitter_en 41.060s 10.320us 0 1 0.00
chip_sw_aes_enc_jitter_en 43.950s 10.160us 0 1 0.00
chip_sw_hmac_enc_jitter_en 42.750s 10.220us 0 1 0.00
chip_sw_keymgr_dpe_key_derivation_jitter_en 40.550s 10.240us 0 1 0.00
chip_sw_kmac_mode_kmac_jitter_en 47.000s 10.160us 0 1 0.00
chip_sw_sram_ctrl_scrambled_access_jitter_en 11.431s 0.000us 0 1 0.00
chip_sw_clkmgr_jitter 176.320s 161.229us 1 1 100.00
chip_sw_soc_proxy_external_reset_requests 0 1 0.00
chip_sw_soc_proxy_smoketest 171.680s 156.192us 0 1 0.00
chip_sw_soc_proxy_external_irqs 0 1 0.00
chip_sw_soc_proxy_smoketest 171.680s 156.192us 0 1 0.00
chip_sw_soc_proxy_external_wakeup_requests 0 1 0.00
chip_sw_soc_proxy_external_wakeup 182.950s 157.753us 0 1 0.00
chip_sw_soc_proxy_gpios 1 1 100.00
chip_sw_soc_proxy_gpios 215.660s 171.763us 1 1 100.00
chip_sw_nmi_irq 0 1 0.00
chip_sw_rv_core_ibex_nmi_irq 352.420s 269.300us 0 1 0.00
chip_sw_rv_core_ibex_rnd 1 1 100.00
chip_sw_rv_core_ibex_rnd 243.640s 195.557us 1 1 100.00
chip_sw_rv_core_ibex_address_translation 1 1 100.00
chip_sw_rv_core_ibex_address_translation 228.020s 179.899us 1 1 100.00
chip_sw_rv_core_ibex_icache_scrambled_access 1 1 100.00
chip_sw_rv_core_ibex_icache_invalidate 205.300s 186.939us 1 1 100.00
chip_sw_rv_core_ibex_fault_dump 0 1 0.00
chip_sw_rstmgr_cpu_info 423.850s 412.016us 0 1 0.00
chip_sw_rv_core_ibex_double_fault 0 1 0.00
chip_sw_rstmgr_cpu_info 423.850s 412.016us 0 1 0.00
chip_sw_smoketest 14 14 100.00
chip_sw_aes_smoketest 214.970s 173.217us 1 1 100.00
chip_sw_aon_timer_smoketest 231.540s 182.250us 1 1 100.00
chip_sw_clkmgr_smoketest 185.450s 162.229us 1 1 100.00
chip_sw_csrng_smoketest 200.150s 164.194us 1 1 100.00
chip_sw_gpio_smoketest 232.450s 184.553us 1 1 100.00
chip_sw_hmac_smoketest 235.190s 194.753us 1 1 100.00
chip_sw_kmac_smoketest 238.210s 185.492us 1 1 100.00
chip_sw_otbn_smoketest 330.350s 237.863us 1 1 100.00
chip_sw_otp_ctrl_smoketest 189.960s 165.824us 1 1 100.00
chip_sw_rv_plic_smoketest 200.620s 163.997us 1 1 100.00
chip_sw_rv_timer_smoketest 272.400s 266.923us 1 1 100.00
chip_sw_rstmgr_smoketest 165.270s 160.980us 1 1 100.00
chip_sw_sram_ctrl_smoketest 206.700s 164.437us 1 1 100.00
chip_sw_uart_smoketest 211.980s 175.184us 1 1 100.00
chip_sw_rom_functests 0 1 0.00
rom_keymgr_functest 10.827s 0.000us 0 1 0.00
chip_sw_signed 0 1 0.00
chip_sw_uart_smoketest_signed 8.773s 0.000us 0 1 0.00
chip_sw_boot 0 1 0.00
chip_sw_uart_tx_rx_bootstrap 18.042s 0.000us 0 1 0.00
chip_sw_secure_boot 0 1 0.00
base_rom_e2e_smoke 7.871s 0.000us 0 1 0.00
chip_lc_scrap 0 4 0.00
chip_sw_lc_ctrl_rma_to_scrap 192.450s 173.816us 0 1 0.00
chip_sw_lc_ctrl_raw_to_scrap 157.930s 172.216us 0 1 0.00
chip_sw_lc_ctrl_test_locked0_to_scrap 170.000s 169.000us 0 1 0.00
chip_sw_lc_ctrl_rand_to_scrap 195.680s 169.096us 0 1 0.00
chip_lc_test_locked 0 2 0.00
chip_sw_lc_walkthrough_testunlocks 9.062s 0.000us 0 1 0.00
chip_rv_dm_lc_disabled 90.460s 120.744us 0 1 0.00
chip_sw_lc_walkthrough 0 5 0.00
chip_sw_lc_walkthrough_dev 40.872s 0.000us 0 1 0.00
chip_sw_lc_walkthrough_prod 33.241s 0.000us 0 1 0.00
chip_sw_lc_walkthrough_prodend 9.643s 0.000us 0 1 0.00
chip_sw_lc_walkthrough_rma 26.051s 0.000us 0 1 0.00
chip_sw_lc_walkthrough_testunlocks 9.062s 0.000us 0 1 0.00
chip_sw_lc_ctrl_volatile_raw_unlock 0 3 0.00
chip_sw_lc_ctrl_volatile_raw_unlock 287.390s 348.888us 0 1 0.00
chip_sw_lc_ctrl_volatile_raw_unlock_ext_clk_48mhz 303.670s 366.504us 0 1 0.00
rom_volatile_raw_unlock 87.470s 0.000us 0 1 0.00
chip_sw_rom_raw_unlock 0 1 0.00
rom_raw_unlock 10.018s 0.000us 0 1 0.00
chip_sw_exit_test_unlocked_bootstrap 0 1 0.00
chip_sw_exit_test_unlocked_bootstrap 18.406s 0.000us 0 1 0.00
chip_sw_inject_scramble_seed 0 1 0.00
chip_sw_inject_scramble_seed 82.784s 0.000us 0 1 0.00
tl_d_oob_addr_access 0 1 0.00
chip_tl_errors 111.590s 117.744us 0 1 0.00
tl_d_illegal_access 0 1 0.00
chip_tl_errors 111.590s 117.744us 0 1 0.00
tl_d_outstanding_access 0 2 0.00
chip_csr_aliasing 9.270s 0.000us 0 1 0.00
chip_same_csr_outstanding 10.420s 0.000us 0 1 0.00
tl_d_partial_access 0 2 0.00
chip_csr_aliasing 9.270s 0.000us 0 1 0.00
chip_same_csr_outstanding 10.420s 0.000us 0 1 0.00
xbar_base_random_sequence 1 1 100.00
xbar_random 37.600s 33.327us 1 1 100.00
xbar_random_delay 6 6 100.00
xbar_smoke_zero_delays 8.250s 11.457us 1 1 100.00
xbar_smoke_large_delays 244.250s 2418.996us 1 1 100.00
xbar_smoke_slow_rsp 305.990s 1962.009us 1 1 100.00
xbar_random_zero_delays 45.820s 36.931us 1 1 100.00
xbar_random_large_delays 145.500s 1292.164us 1 1 100.00
xbar_random_slow_rsp 1861.320s 11530.100us 1 1 100.00
xbar_unmapped_address 2 2 100.00
xbar_unmapped_addr 141.680s 220.789us 1 1 100.00
xbar_error_and_unmapped_addr 28.490s 54.801us 1 1 100.00
xbar_error_cases 2 2 100.00
xbar_error_random 57.530s 152.375us 1 1 100.00
xbar_error_and_unmapped_addr 28.490s 54.801us 1 1 100.00
xbar_all_access_same_device 2 2 100.00
xbar_access_same_device 331.910s 663.906us 1 1 100.00
xbar_access_same_device_slow_rsp 3120.420s 21433.073us 1 1 100.00
xbar_all_hosts_use_same_source_id 1 1 100.00
xbar_same_source 92.590s 70.160us 1 1 100.00
xbar_stress_all 2 2 100.00
xbar_stress_all 400.120s 305.077us 1 1 100.00
xbar_stress_all_with_error 1038.410s 2653.398us 1 1 100.00
xbar_stress_with_reset 2 2 100.00
xbar_stress_all_with_rand_reset 530.260s 398.925us 1 1 100.00
xbar_stress_all_with_reset_error 279.630s 207.982us 1 1 100.00
rom_e2e_smoke 0 1 0.00
rom_e2e_smoke 9.131s 0.000us 0 1 0.00
rom_e2e_shutdown_output 0 1 0.00
rom_e2e_shutdown_output 12.528s 0.000us 0 1 0.00
rom_e2e_shutdown_exception_c 0 1 0.00
rom_e2e_shutdown_exception_c 19.044s 0.000us 0 1 0.00
rom_e2e_boot_policy_valid 0 15 0.00
rom_e2e_boot_policy_valid_a_good_b_good_test_unlocked0 30.470s 0.000us 0 1 0.00
rom_e2e_boot_policy_valid_a_good_b_good_dev 8.548s 0.000us 0 1 0.00
rom_e2e_boot_policy_valid_a_good_b_good_prod 8.383s 0.000us 0 1 0.00
rom_e2e_boot_policy_valid_a_good_b_good_prod_end 8.231s 0.000us 0 1 0.00
rom_e2e_boot_policy_valid_a_good_b_good_rma 16.913s 0.000us 0 1 0.00
rom_e2e_boot_policy_valid_a_good_b_bad_test_unlocked0 37.080s 0.000us 0 1 0.00
rom_e2e_boot_policy_valid_a_good_b_bad_dev 8.247s 0.000us 0 1 0.00
rom_e2e_boot_policy_valid_a_good_b_bad_prod 9.469s 0.000us 0 1 0.00
rom_e2e_boot_policy_valid_a_good_b_bad_prod_end 8.746s 0.000us 0 1 0.00
rom_e2e_boot_policy_valid_a_good_b_bad_rma 8.511s 0.000us 0 1 0.00
rom_e2e_boot_policy_valid_a_bad_b_good_test_unlocked0 41.335s 0.000us 0 1 0.00
rom_e2e_boot_policy_valid_a_bad_b_good_dev 8.974s 0.000us 0 1 0.00
rom_e2e_boot_policy_valid_a_bad_b_good_prod 8.669s 0.000us 0 1 0.00
rom_e2e_boot_policy_valid_a_bad_b_good_prod_end 8.552s 0.000us 0 1 0.00
rom_e2e_boot_policy_valid_a_bad_b_good_rma 8.549s 0.000us 0 1 0.00
rom_e2e_sigverify_always 0 15 0.00
rom_e2e_sigverify_always_a_bad_b_bad_test_unlocked0 131.689s 0.000us 0 1 0.00
rom_e2e_sigverify_always_a_bad_b_bad_dev 19.642s 0.000us 0 1 0.00
rom_e2e_sigverify_always_a_bad_b_bad_prod 25.744s 0.000us 0 1 0.00
rom_e2e_sigverify_always_a_bad_b_bad_prod_end 19.185s 0.000us 0 1 0.00
rom_e2e_sigverify_always_a_bad_b_bad_rma 21.362s 0.000us 0 1 0.00
rom_e2e_sigverify_always_a_bad_b_nothing_test_unlocked0 92.417s 0.000us 0 1 0.00
rom_e2e_sigverify_always_a_bad_b_nothing_dev 16.618s 0.000us 0 1 0.00
rom_e2e_sigverify_always_a_bad_b_nothing_prod 17.633s 0.000us 0 1 0.00
rom_e2e_sigverify_always_a_bad_b_nothing_prod_end 16.105s 0.000us 0 1 0.00
rom_e2e_sigverify_always_a_bad_b_nothing_rma 13.733s 0.000us 0 1 0.00
rom_e2e_sigverify_always_a_nothing_b_bad_test_unlocked0 89.862s 0.000us 0 1 0.00
rom_e2e_sigverify_always_a_nothing_b_bad_dev 9.213s 0.000us 0 1 0.00
rom_e2e_sigverify_always_a_nothing_b_bad_prod 11.605s 0.000us 0 1 0.00
rom_e2e_sigverify_always_a_nothing_b_bad_prod_end 9.061s 0.000us 0 1 0.00
rom_e2e_sigverify_always_a_nothing_b_bad_rma 8.345s 0.000us 0 1 0.00
rom_e2e_asm_init 0 5 0.00
rom_e2e_asm_init_test_unlocked0 47.277s 0.000us 0 1 0.00
rom_e2e_asm_init_dev 8.686s 0.000us 0 1 0.00
rom_e2e_asm_init_prod 8.826s 0.000us 0 1 0.00
rom_e2e_asm_init_prod_end 8.758s 0.000us 0 1 0.00
rom_e2e_asm_init_rma 8.372s 0.000us 0 1 0.00
rom_e2e_keymgr_init 0 3 0.00
rom_e2e_keymgr_init_rom_ext_meas 23.644s 0.000us 0 1 0.00
rom_e2e_keymgr_init_rom_ext_no_meas 8.290s 0.000us 0 1 0.00
rom_e2e_keymgr_init_rom_ext_invalid_meas 9.711s 0.000us 0 1 0.00
rom_e2e_static_critical 0 1 0.00
rom_e2e_static_critical 8.442s 0.000us 0 1 0.00
Testpoint Test Max Runtime Sim Time Pass Total %
chip_sw_aes_masking_off 1 1 100.00
chip_sw_aes_masking_off 262.290s 187.807us 1 1 100.00
chip_sw_rv_core_ibex_lockstep_glitch 1 1 100.00
chip_sw_rv_core_ibex_lockstep_glitch 156.500s 126.972us 1 1 100.00
Testpoint Test Max Runtime Sim Time Pass Total %
chip_rv_dm_perform_debug 0 3 0.00
rom_e2e_jtag_debug_test_unlocked0 9.667s 0.000us 0 1 0.00
rom_e2e_jtag_debug_dev 11.445s 0.000us 0 1 0.00
rom_e2e_jtag_debug_rma 9.765s 0.000us 0 1 0.00
chip_sw_rv_dm_access_after_hw_reset 0 1 0.00
chip_sw_rv_dm_access_after_escalation_reset 11.726s 0.000us 0 1 0.00
chip_sw_plic_alerts 0 1 0.00
chip_sw_all_escalation_resets 1208.710s 943.835us 0 1 0.00
chip_sw_otp_ctrl_vendor_test_csr_access 0 1 0.00
chip_sw_otp_ctrl_vendor_test_csr_access 8.868s 0.000us 0 1 0.00
chip_sw_otp_ctrl_escalation 0 1 0.00
chip_sw_otp_ctrl_escalation 209.490s 176.928us 0 1 0.00
chip_sw_coremark 0 1 0.00
chip_sw_coremark 10.001s 0.000us 0 1 0.00
chip_sw_power_max_load 0 1 0.00
chip_sw_power_virus 92.257s 0.000us 0 1 0.00
rom_e2e_debug 0 3 0.00
rom_e2e_jtag_debug_test_unlocked0 9.667s 0.000us 0 1 0.00
rom_e2e_jtag_debug_dev 11.445s 0.000us 0 1 0.00
rom_e2e_jtag_debug_rma 9.765s 0.000us 0 1 0.00
rom_e2e_jtag_inject 0 3 0.00
rom_e2e_jtag_inject_test_unlocked0 10.992s 0.000us 0 1 0.00
rom_e2e_jtag_inject_dev 12.975s 0.000us 0 1 0.00
rom_e2e_jtag_inject_rma 17.766s 0.000us 0 1 0.00
rom_e2e_self_hash 0 1 0.00
rom_e2e_self_hash 27.006s 0.000us 0 1 0.00
Testpoint Test Max Runtime Sim Time Pass Total %
Unmapped 8 20 40.00
chip_sw_rstmgr_rst_cnsty_escalation 47.350s 10.200us 0 1 0.00
chip_sw_aes_gcm 291.720s 203.586us 1 1 100.00
chip_sw_entropy_src_kat_test 201.440s 163.622us 1 1 100.00
chip_sw_entropy_src_ast_rng_req 173.970s 161.223us 1 1 100.00
chip_plic_all_irqs_0 448.080s 327.556us 1 1 100.00
chip_plic_all_irqs_10 426.310s 300.515us 1 1 100.00
chip_sw_dma_inline_hashing 266.950s 210.436us 1 1 100.00
chip_sw_dma_abort 287.070s 201.533us 0 1 0.00
rom_e2e_sigverify_mod_exp_test_unlocked0_otbn 20.335s 0.000us 0 1 0.00
rom_e2e_sigverify_mod_exp_test_unlocked0_sw 93.556s 0.000us 0 1 0.00
rom_e2e_sigverify_mod_exp_dev_otbn 7.945s 0.000us 0 1 0.00
rom_e2e_sigverify_mod_exp_dev_sw 7.976s 0.000us 0 1 0.00
rom_e2e_sigverify_mod_exp_prod_otbn 8.021s 0.000us 0 1 0.00
rom_e2e_sigverify_mod_exp_prod_sw 8.130s 0.000us 0 1 0.00
rom_e2e_sigverify_mod_exp_prod_end_otbn 8.067s 0.000us 0 1 0.00
rom_e2e_sigverify_mod_exp_prod_end_sw 7.998s 0.000us 0 1 0.00
rom_e2e_sigverify_mod_exp_rma_otbn 8.276s 0.000us 0 1 0.00
rom_e2e_sigverify_mod_exp_rma_sw 8.697s 0.000us 0 1 0.00
chip_sw_entropy_src_smoketest 276.680s 202.980us 1 1 100.00
chip_sw_mbx_smoketest 447.050s 395.032us 1 1 100.00

Error Messages

   Test seed line log context
Some pass patterns missing: ['^TEST PASSED (UVM_)?CHECKS$'] 119 test runs
chip_sw_example_manufacturer 14336811150761250986452962135487656931682947572276332840285403936092831335760 None
Use --verbose_failures to see the command lines of failed build steps.
ERROR: Analysis of target '@@+hooks+manufacturer_test_hooks//:example_test_sim_dv' failed; build aborted: Target @@+hooks+manufacturer_test_hooks//:example_test_sim_dv is incompatible and cannot be built, but was explicitly requested.
Dependency chain:
@@+hooks+manufacturer_test_hooks//:example_test_sim_dv (f2055d) <-- target platform (//toolchain:opentitan_platform) didn't satisfy constraint @@platforms//:incompatible
INFO: Elapsed time: 0.292s, Critical Path: 0.02s
INFO: 1 process: 1 internal.
ERROR: Build did NOT complete successfully
_run_cmd -> had a non-zero return code of 1.
make: *** [/nightly/current_run/opentitan/hw/dv/tools/dvsim/sim.mk:58: sw_build] Error 1
chip_sw_data_integrity_escalation 73754325856431179772153810086849454418131362598170471679670022399336850546665 None
Use --verbose_failures to see the command lines of failed build steps.
ERROR: Analysis of target '//sw/device/tests/sim_dv:data_integrity_escalation_reset_test_sim_dv' failed; build aborted: Target //sw/device/tests/sim_dv:data_integrity_escalation_reset_test_sim_dv is incompatible and cannot be built, but was explicitly requested.
Dependency chain:
//sw/device/tests/sim_dv:data_integrity_escalation_reset_test_sim_dv (f2055d) <-- target platform (//toolchain:opentitan_platform) didn't satisfy constraint @@platforms//:incompatible
INFO: Elapsed time: 1.384s, Critical Path: 0.02s
INFO: 1 process: 1 internal.
ERROR: Build did NOT complete successfully
_run_cmd -> had a non-zero return code of 1.
make: *** [/nightly/current_run/opentitan/hw/dv/tools/dvsim/sim.mk:58: sw_build] Error 1
chip_sw_sleep_pin_wake 18017759051890483016556228931673604835149461098515356802454501603639308409983 None
Use --verbose_failures to see the command lines of failed build steps.
ERROR: Analysis of target '//sw/device/tests:sleep_pin_wake_test_sim_dv' failed; build aborted: Target //sw/device/tests:sleep_pin_wake_test_sim_dv is incompatible and cannot be built, but was explicitly requested.
Dependency chain:
//sw/device/tests:sleep_pin_wake_test_sim_dv (f2055d) <-- target platform (//toolchain:opentitan_platform) didn't satisfy constraint @@platforms//:incompatible
INFO: Elapsed time: 0.215s, Critical Path: 0.02s
INFO: 1 process: 1 internal.
ERROR: Build did NOT complete successfully
_run_cmd -> had a non-zero return code of 1.
make: *** [/nightly/current_run/opentitan/hw/dv/tools/dvsim/sim.mk:58: sw_build] Error 1
chip_sw_sleep_pin_retention 40752470237727223114145198311996252917304764545922184623319847433562057209839 None
Use --verbose_failures to see the command lines of failed build steps.
ERROR: Analysis of target '//sw/device/tests:sleep_pin_retention_test_sim_dv' failed; build aborted: Target //sw/device/tests:sleep_pin_retention_test_sim_dv is incompatible and cannot be built, but was explicitly requested.
Dependency chain:
//sw/device/tests:sleep_pin_retention_test_sim_dv (f2055d) <-- target platform (//toolchain:opentitan_platform) didn't satisfy constraint @@platforms//:incompatible
INFO: Elapsed time: 1.153s, Critical Path: 0.02s
INFO: 1 process: 1 internal.
ERROR: Build did NOT complete successfully
_run_cmd -> had a non-zero return code of 1.
make: *** [/nightly/current_run/opentitan/hw/dv/tools/dvsim/sim.mk:58: sw_build] Error 1
chip_sw_uart_tx_rx 3983144617947213736784595603272769156537927928814708520395161615961015109245 None
Use --verbose_failures to see the command lines of failed build steps.
ERROR: Analysis of target '//sw/device/tests:uart_tx_rx_test_sim_dv' failed; build aborted: Target //sw/device/tests:uart_tx_rx_test_sim_dv is incompatible and cannot be built, but was explicitly requested.
Dependency chain:
//sw/device/tests:uart_tx_rx_test_sim_dv (f2055d) <-- target platform (//toolchain:opentitan_platform) didn't satisfy constraint @@platforms//:incompatible
INFO: Elapsed time: 0.259s, Critical Path: 0.02s
INFO: 1 process: 1 internal.
ERROR: Build did NOT complete successfully
_run_cmd -> had a non-zero return code of 1.
make: *** [/nightly/current_run/opentitan/hw/dv/tools/dvsim/sim.mk:58: sw_build] Error 1
chip_sw_uart_tx_rx_bootstrap 70014047768543185597530338377922877943649927661986260568957249350003516905519 None
ERROR: Analysis of target '//sw/device/tests:uart_tx_rx_test_sim_dv' failed; build aborted: Target //sw/device/tests:uart_tx_rx_test_sim_dv is incompatible and cannot be built, but was explicitly requested.
Dependency chain:
//sw/device/tests:uart_tx_rx_test_sim_dv (f2055d) <-- target platform (//toolchain:opentitan_platform) didn't satisfy constraint @@platforms//:incompatible
INFO: Elapsed time: 1.598s, Critical Path: 0.02s
INFO: 1 process: 1 internal.
ERROR: Build did NOT complete successfully
FAILED:
_run_cmd -> had a non-zero return code of 1.
make: *** [/nightly/current_run/opentitan/hw/dv/tools/dvsim/sim.mk:58: sw_build] Error 1
chip_sw_inject_scramble_seed 95793856934975063728869366140797054747398199188794727352533935399122820938051 None
Use --verbose_failures to see the command lines of failed build steps.
ERROR: Analysis of target '//sw/device/tests/sim_dv:inject_scramble_seed_sim_dv' failed; build aborted: Target //sw/device/tests/sim_dv:inject_scramble_seed_sim_dv is incompatible and cannot be built, but was explicitly requested.
Dependency chain:
//sw/device/tests/sim_dv:inject_scramble_seed_sim_dv (f2055d) <-- target platform (//toolchain:opentitan_platform) didn't satisfy constraint @@platforms//:incompatible
INFO: Elapsed time: 3.219s, Critical Path: 0.02s
INFO: 1 process: 1 internal.
ERROR: Build did NOT complete successfully
_run_cmd -> had a non-zero return code of 1.
make: *** [/nightly/current_run/opentitan/hw/dv/tools/dvsim/sim.mk:58: sw_build] Error 1
chip_sw_exit_test_unlocked_bootstrap 98330132610822270655121767015118855369658037757560366454462492610680769207651 None
ERROR: Analysis of target '//sw/device/tests/sim_dv:exit_test_unlocked_bootstrap_sim_dv' failed; build aborted: Target //sw/device/tests/sim_dv:exit_test_unlocked_bootstrap_sim_dv is incompatible and cannot be built, but was explicitly requested.
Dependency chain:
//sw/device/tests/sim_dv:exit_test_unlocked_bootstrap_sim_dv (f2055d) <-- target platform (//toolchain:opentitan_platform) didn't satisfy constraint @@platforms//:incompatible
INFO: Elapsed time: 0.853s, Critical Path: 0.02s
INFO: 1 process: 1 internal.
ERROR: Build did NOT complete successfully
FAILED:
_run_cmd -> had a non-zero return code of 1.
make: *** [/nightly/current_run/opentitan/hw/dv/tools/dvsim/sim.mk:58: sw_build] Error 1
chip_sw_uart_rand_baudrate 112762838547812128888096877523650029821021986599942457677407652244375718112604 None
Use --verbose_failures to see the command lines of failed build steps.
ERROR: Analysis of target '//sw/device/tests:uart_tx_rx_test_sim_dv' failed; build aborted: Target //sw/device/tests:uart_tx_rx_test_sim_dv is incompatible and cannot be built, but was explicitly requested.
Dependency chain:
//sw/device/tests:uart_tx_rx_test_sim_dv (f2055d) <-- target platform (//toolchain:opentitan_platform) didn't satisfy constraint @@platforms//:incompatible
INFO: Elapsed time: 2.151s, Critical Path: 0.02s
INFO: 1 process: 1 internal.
ERROR: Build did NOT complete successfully
_run_cmd -> had a non-zero return code of 1.
make: *** [/nightly/current_run/opentitan/hw/dv/tools/dvsim/sim.mk:58: sw_build] Error 1
chip_sw_uart_tx_rx_alt_clk_freq 48025821519676700696285476737153825568949664152123899503623106607784765094211 None
Use --verbose_failures to see the command lines of failed build steps.
ERROR: Analysis of target '//sw/device/tests:uart_tx_rx_test_sim_dv' failed; build aborted: Target //sw/device/tests:uart_tx_rx_test_sim_dv is incompatible and cannot be built, but was explicitly requested.
Dependency chain:
//sw/device/tests:uart_tx_rx_test_sim_dv (f2055d) <-- target platform (//toolchain:opentitan_platform) didn't satisfy constraint @@platforms//:incompatible
INFO: Elapsed time: 2.380s, Critical Path: 0.02s
INFO: 1 process: 1 internal.
ERROR: Build did NOT complete successfully
_run_cmd -> had a non-zero return code of 1.
make: *** [/nightly/current_run/opentitan/hw/dv/tools/dvsim/sim.mk:58: sw_build] Error 1
chip_sw_i2c_host_tx_rx 66898400670285535262979669472001892513324145783946906752099218626461502168065 None
Use --verbose_failures to see the command lines of failed build steps.
ERROR: Analysis of target '//sw/device/tests/sim_dv:i2c_host_tx_rx_test_sim_dv' failed; build aborted: Target //sw/device/tests/sim_dv:i2c_host_tx_rx_test_sim_dv is incompatible and cannot be built, but was explicitly requested.
Dependency chain:
//sw/device/tests/sim_dv:i2c_host_tx_rx_test_sim_dv (f2055d) <-- target platform (//toolchain:opentitan_platform) didn't satisfy constraint @@platforms//:incompatible
INFO: Elapsed time: 0.294s, Critical Path: 0.03s
INFO: 1 process: 1 internal.
ERROR: Build did NOT complete successfully
_run_cmd -> had a non-zero return code of 1.
make: *** [/nightly/current_run/opentitan/hw/dv/tools/dvsim/sim.mk:58: sw_build] Error 1
chip_sw_i2c_device_tx_rx 96777263572447539430097736056306985187629174794030417791656167747062017334180 None
Use --verbose_failures to see the command lines of failed build steps.
ERROR: Analysis of target '//sw/device/tests/sim_dv:i2c_device_tx_rx_test_sim_dv' failed; build aborted: Target //sw/device/tests/sim_dv:i2c_device_tx_rx_test_sim_dv is incompatible and cannot be built, but was explicitly requested.
Dependency chain:
//sw/device/tests/sim_dv:i2c_device_tx_rx_test_sim_dv (f2055d) <-- target platform (//toolchain:opentitan_platform) didn't satisfy constraint @@platforms//:incompatible
INFO: Elapsed time: 0.263s, Critical Path: 0.02s
INFO: 1 process: 1 internal.
ERROR: Build did NOT complete successfully
_run_cmd -> had a non-zero return code of 1.
make: *** [/nightly/current_run/opentitan/hw/dv/tools/dvsim/sim.mk:58: sw_build] Error 1
chip_sw_spi_device_tpm 37467656563152121839767419419252317776028003040463933791972659463424608336686 None
Use --verbose_failures to see the command lines of failed build steps.
ERROR: Analysis of target '//sw/device/tests:spi_device_tpm_tx_rx_test_sim_dv' failed; build aborted: Target //sw/device/tests:spi_device_tpm_tx_rx_test_sim_dv is incompatible and cannot be built, but was explicitly requested.
Dependency chain:
//sw/device/tests:spi_device_tpm_tx_rx_test_sim_dv (f2055d) <-- target platform (//toolchain:opentitan_platform) didn't satisfy constraint @@platforms//:incompatible
INFO: Elapsed time: 0.236s, Critical Path: 0.02s
INFO: 1 process: 1 internal.
ERROR: Build did NOT complete successfully
_run_cmd -> had a non-zero return code of 1.
make: *** [/nightly/current_run/opentitan/hw/dv/tools/dvsim/sim.mk:58: sw_build] Error 1
chip_sw_spi_host_tx_rx 15188553097539264043910361435989613098429302980248858263427771634915724208961 None
Use --verbose_failures to see the command lines of failed build steps.
ERROR: Analysis of target '//sw/device/tests/sim_dv:spi_host_tx_rx_test_sim_dv' failed; build aborted: Target //sw/device/tests/sim_dv:spi_host_tx_rx_test_sim_dv is incompatible and cannot be built, but was explicitly requested.
Dependency chain:
//sw/device/tests/sim_dv:spi_host_tx_rx_test_sim_dv (f2055d) <-- target platform (//toolchain:opentitan_platform) didn't satisfy constraint @@platforms//:incompatible
INFO: Elapsed time: 0.266s, Critical Path: 0.02s
INFO: 1 process: 1 internal.
ERROR: Build did NOT complete successfully
_run_cmd -> had a non-zero return code of 1.
make: *** [/nightly/current_run/opentitan/hw/dv/tools/dvsim/sim.mk:58: sw_build] Error 1
chip_sw_lc_ctrl_otp_hw_cfg 72950499690745757029623813323083105721028889824561637931873483601381713260464 None
---- STDERR ----
Another command (pid=1189471) is running. Waiting for it to complete on the server (server_pid=202285)...
WARNING: Target pattern parsing failed.
ERROR: Skipping '//sw/device/tests:lc_ctrl_otp_hw_cfg_test_sim_dv': no such target '//sw/device/tests:lc_ctrl_otp_hw_cfg_test_sim_dv': target 'lc_ctrl_otp_hw_cfg_test_sim_dv' not declared in package 'sw/device/tests' defined by /nightly/current_run/opentitan/sw/device/tests/BUILD (did you mean lc_ctrl_otp_hw_cfg0_test_sim_dv?)
ERROR: no such target '//sw/device/tests:lc_ctrl_otp_hw_cfg_test_sim_dv': target 'lc_ctrl_otp_hw_cfg_test_sim_dv' not declared in package 'sw/device/tests' defined by /nightly/current_run/opentitan/sw/device/tests/BUILD (did you mean lc_ctrl_otp_hw_cfg0_test_sim_dv?)
ERROR: Build did NOT complete successfully
_run_cmd -> had a non-zero return code of 1.
make: *** [/nightly/current_run/opentitan/hw/dv/tools/dvsim/sim.mk:58: sw_build] Error 1
chip_sw_otp_ctrl_lc_signals_test_unlocked0 50269325860441384158675650521786933329867568687072715090883415193689105691554 None
Use --verbose_failures to see the command lines of failed build steps.
ERROR: Analysis of target '//sw/device/tests/sim_dv:otp_ctrl_lc_signals_test_sim_dv' failed; build aborted: Target //sw/device/tests/sim_dv:otp_ctrl_lc_signals_test_sim_dv is incompatible and cannot be built, but was explicitly requested.
Dependency chain:
//sw/device/tests/sim_dv:otp_ctrl_lc_signals_test_sim_dv (f2055d) <-- target platform (//toolchain:opentitan_platform) didn't satisfy constraint @@platforms//:incompatible
INFO: Elapsed time: 0.255s, Critical Path: 0.03s
INFO: 1 process: 1 internal.
ERROR: Build did NOT complete successfully
_run_cmd -> had a non-zero return code of 1.
make: *** [/nightly/current_run/opentitan/hw/dv/tools/dvsim/sim.mk:58: sw_build] Error 1
chip_sw_otp_ctrl_lc_signals_dev 12873205909363060461491389808373984941536300883584726252176411451749460262525 None
Use --verbose_failures to see the command lines of failed build steps.
ERROR: Analysis of target '//sw/device/tests/sim_dv:otp_ctrl_lc_signals_test_sim_dv' failed; build aborted: Target //sw/device/tests/sim_dv:otp_ctrl_lc_signals_test_sim_dv is incompatible and cannot be built, but was explicitly requested.
Dependency chain:
//sw/device/tests/sim_dv:otp_ctrl_lc_signals_test_sim_dv (f2055d) <-- target platform (//toolchain:opentitan_platform) didn't satisfy constraint @@platforms//:incompatible
INFO: Elapsed time: 1.686s, Critical Path: 0.02s
INFO: 1 process: 1 internal.
ERROR: Build did NOT complete successfully
_run_cmd -> had a non-zero return code of 1.
make: *** [/nightly/current_run/opentitan/hw/dv/tools/dvsim/sim.mk:58: sw_build] Error 1
chip_sw_otp_ctrl_lc_signals_prod 82089405258663060727885715342319320213738083418675590057010679337864226196449 None
ERROR: Analysis of target '//sw/device/tests/sim_dv:otp_ctrl_lc_signals_test_sim_dv' failed; build aborted: Target //sw/device/tests/sim_dv:otp_ctrl_lc_signals_test_sim_dv is incompatible and cannot be built, but was explicitly requested.
Dependency chain:
//sw/device/tests/sim_dv:otp_ctrl_lc_signals_test_sim_dv (f2055d) <-- target platform (//toolchain:opentitan_platform) didn't satisfy constraint @@platforms//:incompatible
INFO: Elapsed time: 0.986s, Critical Path: 0.02s
INFO: 1 process: 1 internal.
ERROR: Build did NOT complete successfully
FAILED:
_run_cmd -> had a non-zero return code of 1.
make: *** [/nightly/current_run/opentitan/hw/dv/tools/dvsim/sim.mk:58: sw_build] Error 1
chip_sw_otp_ctrl_lc_signals_rma 889616410256162772044999802911120578084662401735803945680222658276323032799 None
Use --verbose_failures to see the command lines of failed build steps.
ERROR: Analysis of target '//sw/device/tests/sim_dv:otp_ctrl_lc_signals_test_sim_dv' failed; build aborted: Target //sw/device/tests/sim_dv:otp_ctrl_lc_signals_test_sim_dv is incompatible and cannot be built, but was explicitly requested.
Dependency chain:
//sw/device/tests/sim_dv:otp_ctrl_lc_signals_test_sim_dv (f2055d) <-- target platform (//toolchain:opentitan_platform) didn't satisfy constraint @@platforms//:incompatible
INFO: Elapsed time: 0.316s, Critical Path: 0.00s
INFO: 1 process: 1 internal.
ERROR: Build did NOT complete successfully
_run_cmd -> had a non-zero return code of 1.
make: *** [/nightly/current_run/opentitan/hw/dv/tools/dvsim/sim.mk:58: sw_build] Error 1
chip_sw_otp_ctrl_vendor_test_csr_access 26760560438001747753696430111217002537563870370836229546132555459450463483512 None
Use --verbose_failures to see the command lines of failed build steps.
ERROR: Analysis of target '//sw/device/tests/sim_dv:otp_ctrl_vendor_test_csr_access_test_sim_dv' failed; build aborted: Target //sw/device/tests/sim_dv:otp_ctrl_vendor_test_csr_access_test_sim_dv is incompatible and cannot be built, but was explicitly requested.
Dependency chain:
//sw/device/tests/sim_dv:otp_ctrl_vendor_test_csr_access_test_sim_dv (f2055d) <-- target platform (//toolchain:opentitan_platform) didn't satisfy constraint @@platforms//:incompatible
INFO: Elapsed time: 0.324s, Critical Path: 0.02s
INFO: 1 process: 1 internal.
ERROR: Build did NOT complete successfully
_run_cmd -> had a non-zero return code of 1.
make: *** [/nightly/current_run/opentitan/hw/dv/tools/dvsim/sim.mk:58: sw_build] Error 1
chip_sw_otp_ctrl_nvm_cnt 52361810450061547690764208966256671442778317444218062102544061511993063378873 None
Another command (pid=510023) is running. Waiting for it to complete on the server (server_pid=202285)...
Another command (pid=509108) is running. Waiting for it to complete on the server (server_pid=202285)...
Another command (pid=511304) is running. Waiting for it to complete on the server (server_pid=202285)...
WARNING: Target pattern parsing failed.
ERROR: Skipping '//sw/device/tests:otp_ctrl_nvm_cnt_test_sim_dv': no such target '//sw/device/tests:otp_ctrl_nvm_cnt_test_sim_dv': target 'otp_ctrl_nvm_cnt_test_sim_dv' not declared in package 'sw/device/tests' defined by /nightly/current_run/opentitan/sw/device/tests/BUILD
ERROR: no such target '//sw/device/tests:otp_ctrl_nvm_cnt_test_sim_dv': target 'otp_ctrl_nvm_cnt_test_sim_dv' not declared in package 'sw/device/tests' defined by /nightly/current_run/opentitan/sw/device/tests/BUILD
ERROR: Build did NOT complete successfully
_run_cmd -> had a non-zero return code of 1.
make: *** [/nightly/current_run/opentitan/hw/dv/tools/dvsim/sim.mk:58: sw_build] Error 1
chip_sw_otp_ctrl_sw_parts 93705055905249573237133853030800369497231108930935026193253935995349759484157 None
Another command (pid=510023) is running. Waiting for it to complete on the server (server_pid=202285)...
Another command (pid=509108) is running. Waiting for it to complete on the server (server_pid=202285)...
Another command (pid=511304) is running. Waiting for it to complete on the server (server_pid=202285)...
WARNING: Target pattern parsing failed.
ERROR: Skipping '//sw/device/tests:otp_ctrl_sw_parts_test_sim_dv': no such target '//sw/device/tests:otp_ctrl_sw_parts_test_sim_dv': target 'otp_ctrl_sw_parts_test_sim_dv' not declared in package 'sw/device/tests' defined by /nightly/current_run/opentitan/sw/device/tests/BUILD
ERROR: no such target '//sw/device/tests:otp_ctrl_sw_parts_test_sim_dv': target 'otp_ctrl_sw_parts_test_sim_dv' not declared in package 'sw/device/tests' defined by /nightly/current_run/opentitan/sw/device/tests/BUILD
ERROR: Build did NOT complete successfully
_run_cmd -> had a non-zero return code of 1.
make: *** [/nightly/current_run/opentitan/hw/dv/tools/dvsim/sim.mk:58: sw_build] Error 1
chip_sw_lc_ctrl_transition 86072504623597643849208287424484425907360632935146862120609626947644016405328 None
Use --verbose_failures to see the command lines of failed build steps.
ERROR: Analysis of target '//sw/device/tests/sim_dv:lc_ctrl_transition_test_sim_dv' failed; build aborted: Target //sw/device/tests/sim_dv:lc_ctrl_transition_test_sim_dv is incompatible and cannot be built, but was explicitly requested.
Dependency chain:
//sw/device/tests/sim_dv:lc_ctrl_transition_test_sim_dv (f2055d) <-- target platform (//toolchain:opentitan_platform) didn't satisfy constraint @@platforms//:incompatible
INFO: Elapsed time: 0.252s, Critical Path: 0.02s
INFO: 1 process: 1 internal.
ERROR: Build did NOT complete successfully
_run_cmd -> had a non-zero return code of 1.
make: *** [/nightly/current_run/opentitan/hw/dv/tools/dvsim/sim.mk:58: sw_build] Error 1
chip_sw_lc_walkthrough_dev 13174731485757803225225126822923295138879551761545114538422738838833306964582 None
Use --verbose_failures to see the command lines of failed build steps.
ERROR: Analysis of target '//sw/device/tests/sim_dv:lc_walkthrough_test_sim_dv' failed; build aborted: Target //sw/device/tests/sim_dv:lc_walkthrough_test_sim_dv is incompatible and cannot be built, but was explicitly requested.
Dependency chain:
//sw/device/tests/sim_dv:lc_walkthrough_test_sim_dv (f2055d) <-- target platform (//toolchain:opentitan_platform) didn't satisfy constraint @@platforms//:incompatible
INFO: Elapsed time: 0.682s, Critical Path: 0.02s
INFO: 1 process: 1 internal.
ERROR: Build did NOT complete successfully
_run_cmd -> had a non-zero return code of 1.
make: *** [/nightly/current_run/opentitan/hw/dv/tools/dvsim/sim.mk:58: sw_build] Error 1
chip_sw_lc_walkthrough_prod 11200417344851100884914291488071392890395577384570075195514370581585001782025 None
ERROR: Analysis of target '//sw/device/tests/sim_dv:lc_walkthrough_test_sim_dv' failed; build aborted: Target //sw/device/tests/sim_dv:lc_walkthrough_test_sim_dv is incompatible and cannot be built, but was explicitly requested.
Dependency chain:
//sw/device/tests/sim_dv:lc_walkthrough_test_sim_dv (f2055d) <-- target platform (//toolchain:opentitan_platform) didn't satisfy constraint @@platforms//:incompatible
INFO: Elapsed time: 15.132s, Critical Path: 0.02s
INFO: 1 process: 1 internal.
ERROR: Build did NOT complete successfully
FAILED:
_run_cmd -> had a non-zero return code of 1.
make: *** [/nightly/current_run/opentitan/hw/dv/tools/dvsim/sim.mk:58: sw_build] Error 1
chip_sw_lc_walkthrough_prodend 51354388247897772138105986636718583361348927617807846149131868204938415653530 None
Use --verbose_failures to see the command lines of failed build steps.
ERROR: Analysis of target '//sw/device/tests/sim_dv:lc_walkthrough_test_sim_dv' failed; build aborted: Target //sw/device/tests/sim_dv:lc_walkthrough_test_sim_dv is incompatible and cannot be built, but was explicitly requested.
Dependency chain:
//sw/device/tests/sim_dv:lc_walkthrough_test_sim_dv (f2055d) <-- target platform (//toolchain:opentitan_platform) didn't satisfy constraint @@platforms//:incompatible
INFO: Elapsed time: 0.194s, Critical Path: 0.02s
INFO: 1 process: 1 internal.
ERROR: Build did NOT complete successfully
_run_cmd -> had a non-zero return code of 1.
make: *** [/nightly/current_run/opentitan/hw/dv/tools/dvsim/sim.mk:58: sw_build] Error 1
chip_sw_lc_walkthrough_rma 103931342580428929844384295320029409278214661462135962412975185855178428649636 None
Use --verbose_failures to see the command lines of failed build steps.
ERROR: Analysis of target '//sw/device/tests/sim_dv:lc_walkthrough_test_sim_dv' failed; build aborted: Target //sw/device/tests/sim_dv:lc_walkthrough_test_sim_dv is incompatible and cannot be built, but was explicitly requested.
Dependency chain:
//sw/device/tests/sim_dv:lc_walkthrough_test_sim_dv (f2055d) <-- target platform (//toolchain:opentitan_platform) didn't satisfy constraint @@platforms//:incompatible
INFO: Elapsed time: 5.055s, Critical Path: 0.02s
INFO: 1 process: 1 internal.
ERROR: Build did NOT complete successfully
_run_cmd -> had a non-zero return code of 1.
make: *** [/nightly/current_run/opentitan/hw/dv/tools/dvsim/sim.mk:58: sw_build] Error 1
chip_sw_lc_walkthrough_testunlocks 96619923712894630794159051151473302770022993432755411256401547454217616039126 None
Use --verbose_failures to see the command lines of failed build steps.
ERROR: Analysis of target '//sw/device/tests/sim_dv:lc_walkthrough_testunlocks_test_sim_dv' failed; build aborted: Target //sw/device/tests/sim_dv:lc_walkthrough_testunlocks_test_sim_dv is incompatible and cannot be built, but was explicitly requested.
Dependency chain:
//sw/device/tests/sim_dv:lc_walkthrough_testunlocks_test_sim_dv (f2055d) <-- target platform (//toolchain:opentitan_platform) didn't satisfy constraint @@platforms//:incompatible
INFO: Elapsed time: 0.236s, Critical Path: 0.03s
INFO: 1 process: 1 internal.
ERROR: Build did NOT complete successfully
_run_cmd -> had a non-zero return code of 1.
make: *** [/nightly/current_run/opentitan/hw/dv/tools/dvsim/sim.mk:58: sw_build] Error 1
chip_sw_pwrmgr_main_power_glitch_reset 1463744778411411534615628272464474323216138387184765332482025893012536759170 None
Use --verbose_failures to see the command lines of failed build steps.
ERROR: Analysis of target '//sw/device/tests/sim_dv:pwrmgr_main_power_glitch_test_sim_dv' failed; build aborted: Target //sw/device/tests/sim_dv:pwrmgr_main_power_glitch_test_sim_dv is incompatible and cannot be built, but was explicitly requested.
Dependency chain:
//sw/device/tests/sim_dv:pwrmgr_main_power_glitch_test_sim_dv (f2055d) <-- target platform (//toolchain:opentitan_platform) didn't satisfy constraint @@platforms//:incompatible
INFO: Elapsed time: 1.461s, Critical Path: 0.02s
INFO: 1 process: 1 internal.
ERROR: Build did NOT complete successfully
_run_cmd -> had a non-zero return code of 1.
make: *** [/nightly/current_run/opentitan/hw/dv/tools/dvsim/sim.mk:58: sw_build] Error 1
chip_sw_pwrmgr_sleep_power_glitch_reset 61005032405223983043186545323068788132673240963892487625622086940935546871775 None
Use --verbose_failures to see the command lines of failed build steps.
ERROR: Analysis of target '//sw/device/tests/sim_dv:pwrmgr_sleep_power_glitch_test_sim_dv' failed; build aborted: Target //sw/device/tests/sim_dv:pwrmgr_sleep_power_glitch_test_sim_dv is incompatible and cannot be built, but was explicitly requested.
Dependency chain:
//sw/device/tests/sim_dv:pwrmgr_sleep_power_glitch_test_sim_dv (f2055d) <-- target platform (//toolchain:opentitan_platform) didn't satisfy constraint @@platforms//:incompatible
INFO: Elapsed time: 0.221s, Critical Path: 0.02s
INFO: 1 process: 1 internal.
ERROR: Build did NOT complete successfully
_run_cmd -> had a non-zero return code of 1.
make: *** [/nightly/current_run/opentitan/hw/dv/tools/dvsim/sim.mk:58: sw_build] Error 1
chip_sw_pwrmgr_deep_sleep_power_glitch_reset 83088105152202826129239955557631549457974579264687471442717845132212992276662 None
Use --verbose_failures to see the command lines of failed build steps.
ERROR: Analysis of target '//sw/device/tests/sim_dv:pwrmgr_deep_sleep_power_glitch_test_sim_dv' failed; build aborted: Target //sw/device/tests/sim_dv:pwrmgr_deep_sleep_power_glitch_test_sim_dv is incompatible and cannot be built, but was explicitly requested.
Dependency chain:
//sw/device/tests/sim_dv:pwrmgr_deep_sleep_power_glitch_test_sim_dv (f2055d) <-- target platform (//toolchain:opentitan_platform) didn't satisfy constraint @@platforms//:incompatible
INFO: Elapsed time: 0.588s, Critical Path: 0.03s
INFO: 1 process: 1 internal.
ERROR: Build did NOT complete successfully
_run_cmd -> had a non-zero return code of 1.
make: *** [/nightly/current_run/opentitan/hw/dv/tools/dvsim/sim.mk:58: sw_build] Error 1
chip_sw_pwrmgr_random_sleep_power_glitch_reset 54038909840000392372674672546015999767857995038908912502166430500600587832842 None
Use --verbose_failures to see the command lines of failed build steps.
ERROR: Analysis of target '//sw/device/tests/sim_dv:pwrmgr_random_sleep_power_glitch_reset_test_sim_dv' failed; build aborted: Target //sw/device/tests/sim_dv:pwrmgr_random_sleep_power_glitch_reset_test_sim_dv is incompatible and cannot be built, but was explicitly requested.
Dependency chain:
//sw/device/tests/sim_dv:pwrmgr_random_sleep_power_glitch_reset_test_sim_dv (f2055d) <-- target platform (//toolchain:opentitan_platform) didn't satisfy constraint @@platforms//:incompatible
INFO: Elapsed time: 1.185s, Critical Path: 0.02s
INFO: 1 process: 1 internal.
ERROR: Build did NOT complete successfully
_run_cmd -> had a non-zero return code of 1.
make: *** [/nightly/current_run/opentitan/hw/dv/tools/dvsim/sim.mk:58: sw_build] Error 1
chip_sw_pwrmgr_sleep_disabled 60510001223672623909267288325221303643596627224747157823748146121864078012167 None
Use --verbose_failures to see the command lines of failed build steps.
ERROR: Analysis of target '//sw/device/tests:pwrmgr_sleep_disabled_test_sim_dv' failed; build aborted: Target //sw/device/tests:pwrmgr_sleep_disabled_test_sim_dv is incompatible and cannot be built, but was explicitly requested.
Dependency chain:
//sw/device/tests:pwrmgr_sleep_disabled_test_sim_dv (f2055d) <-- target platform (//toolchain:opentitan_platform) didn't satisfy constraint @@platforms//:incompatible
INFO: Elapsed time: 0.217s, Critical Path: 0.02s
INFO: 1 process: 1 internal.
ERROR: Build did NOT complete successfully
_run_cmd -> had a non-zero return code of 1.
make: *** [/nightly/current_run/opentitan/hw/dv/tools/dvsim/sim.mk:58: sw_build] Error 1
chip_sw_pwrmgr_wdog_reset 8198568551184494178653271047192447368703876947052946869173103895592104563601 None
Use --verbose_failures to see the command lines of failed build steps.
ERROR: Analysis of target '//sw/device/tests:pwrmgr_wdog_reset_reqs_test_sim_dv' failed; build aborted: Target //sw/device/tests:pwrmgr_wdog_reset_reqs_test_sim_dv is incompatible and cannot be built, but was explicitly requested.
Dependency chain:
//sw/device/tests:pwrmgr_wdog_reset_reqs_test_sim_dv (f2055d) <-- target platform (//toolchain:opentitan_platform) didn't satisfy constraint @@platforms//:incompatible
INFO: Elapsed time: 0.228s, Critical Path: 0.02s
INFO: 1 process: 1 internal.
ERROR: Build did NOT complete successfully
_run_cmd -> had a non-zero return code of 1.
make: *** [/nightly/current_run/opentitan/hw/dv/tools/dvsim/sim.mk:58: sw_build] Error 1
chip_sw_alert_test 25670152733325456778654880916839685609141887489725780855929082829842656553198 None
Another command (pid=767273) is running. Waiting for it to complete on the server (server_pid=202285)...
WARNING: Target pattern parsing failed.
ERROR: Skipping '//sw/device/tests/autogen/top_darjeeling:alert_test_sim_dv': no such package 'sw/device/tests/autogen/top_darjeeling': BUILD file not found in any of the following directories. Add a BUILD file to a directory to mark it as a package.
- sw/device/tests/autogen/top_darjeeling
ERROR: no such package 'sw/device/tests/autogen/top_darjeeling': BUILD file not found in any of the following directories. Add a BUILD file to a directory to mark it as a package.
- sw/device/tests/autogen/top_darjeeling
ERROR: Build did NOT complete successfully
_run_cmd -> had a non-zero return code of 1.
make: *** [/nightly/current_run/opentitan/hw/dv/tools/dvsim/sim.mk:58: sw_build] Error 1
chip_sw_alert_handler_escalation 69040122478675287684945468902543724698724565373584808391273871010936555209397 None
Use --verbose_failures to see the command lines of failed build steps.
ERROR: Analysis of target '//sw/device/tests:alert_handler_escalation_test_sim_dv' failed; build aborted: Target //sw/device/tests:alert_handler_escalation_test_sim_dv is incompatible and cannot be built, but was explicitly requested.
Dependency chain:
//sw/device/tests:alert_handler_escalation_test_sim_dv (f2055d) <-- target platform (//toolchain:opentitan_platform) didn't satisfy constraint @@platforms//:incompatible
INFO: Elapsed time: 0.664s, Critical Path: 0.01s
INFO: 1 process: 1 internal.
ERROR: Build did NOT complete successfully
_run_cmd -> had a non-zero return code of 1.
make: *** [/nightly/current_run/opentitan/hw/dv/tools/dvsim/sim.mk:58: sw_build] Error 1
chip_sw_alert_handler_reverse_ping_in_deep_sleep 52744878507448185804524359880499173195826491265588513592077827054020841840157 None
Use --verbose_failures to see the command lines of failed build steps.
ERROR: Analysis of target '//sw/device/tests:alert_handler_reverse_ping_in_deep_sleep_test_sim_dv' failed; build aborted: Target //sw/device/tests:alert_handler_reverse_ping_in_deep_sleep_test_sim_dv is incompatible and cannot be built, but was explicitly requested.
Dependency chain:
//sw/device/tests:alert_handler_reverse_ping_in_deep_sleep_test_sim_dv (f2055d) <-- target platform (//toolchain:opentitan_platform) didn't satisfy constraint @@platforms//:incompatible
INFO: Elapsed time: 4.217s, Critical Path: 0.02s
INFO: 1 process: 1 internal.
ERROR: Build did NOT complete successfully
_run_cmd -> had a non-zero return code of 1.
make: *** [/nightly/current_run/opentitan/hw/dv/tools/dvsim/sim.mk:58: sw_build] Error 1
chip_sw_alert_handler_lpg_sleep_mode_alerts 30213994792674860833120695585949430741123397473956651216377080503834494967325 None
Another command (pid=355631) is running. Waiting for it to complete on the server (server_pid=202285)...
Another command (pid=369190) is running. Waiting for it to complete on the server (server_pid=202285)...
Another command (pid=358184) is running. Waiting for it to complete on the server (server_pid=202285)...
WARNING: Target pattern parsing failed.
ERROR: Skipping '//sw/device/tests:alert_handler_lpg_sleep_mode_alerts_test_sim_dv': no such target '//sw/device/tests:alert_handler_lpg_sleep_mode_alerts_test_sim_dv': target 'alert_handler_lpg_sleep_mode_alerts_test_sim_dv' not declared in package 'sw/device/tests' defined by /nightly/current_run/opentitan/sw/device/tests/BUILD
ERROR: no such target '//sw/device/tests:alert_handler_lpg_sleep_mode_alerts_test_sim_dv': target 'alert_handler_lpg_sleep_mode_alerts_test_sim_dv' not declared in package 'sw/device/tests' defined by /nightly/current_run/opentitan/sw/device/tests/BUILD
ERROR: Build did NOT complete successfully
_run_cmd -> had a non-zero return code of 1.
make: *** [/nightly/current_run/opentitan/hw/dv/tools/dvsim/sim.mk:58: sw_build] Error 1
chip_sw_alert_handler_lpg_sleep_mode_pings 29577910803906066194720451947303729016234822498246769354597223678784263390106 None
Use --verbose_failures to see the command lines of failed build steps.
ERROR: Analysis of target '//sw/device/tests:alert_handler_lpg_sleep_mode_pings_test_sim_dv' failed; build aborted: Target //sw/device/tests:alert_handler_lpg_sleep_mode_pings_test_sim_dv is incompatible and cannot be built, but was explicitly requested.
Dependency chain:
//sw/device/tests:alert_handler_lpg_sleep_mode_pings_test_sim_dv (f2055d) <-- target platform (//toolchain:opentitan_platform) didn't satisfy constraint @@platforms//:incompatible
INFO: Elapsed time: 6.241s, Critical Path: 0.02s
INFO: 1 process: 1 internal.
ERROR: Build did NOT complete successfully
_run_cmd -> had a non-zero return code of 1.
make: *** [/nightly/current_run/opentitan/hw/dv/tools/dvsim/sim.mk:58: sw_build] Error 1
chip_sw_alert_handler_lpg_clkoff 98362205514421541739609942393088617476785104317303982692542429868430202843847 None
Use --verbose_failures to see the command lines of failed build steps.
ERROR: Analysis of target '//sw/device/tests:alert_handler_lpg_clkoff_test_sim_dv' failed; build aborted: Target //sw/device/tests:alert_handler_lpg_clkoff_test_sim_dv is incompatible and cannot be built, but was explicitly requested.
Dependency chain:
//sw/device/tests:alert_handler_lpg_clkoff_test_sim_dv (f2055d) <-- target platform (//toolchain:opentitan_platform) didn't satisfy constraint @@platforms//:incompatible
INFO: Elapsed time: 1.099s, Critical Path: 0.02s
INFO: 1 process: 1 internal.
ERROR: Build did NOT complete successfully
_run_cmd -> had a non-zero return code of 1.
make: *** [/nightly/current_run/opentitan/hw/dv/tools/dvsim/sim.mk:58: sw_build] Error 1
chip_sw_alert_handler_lpg_reset_toggle 53475898700079066520445970400944139889197825762639104449049555311435029270286 None
Use --verbose_failures to see the command lines of failed build steps.
ERROR: Analysis of target '//sw/device/tests:alert_handler_lpg_reset_toggle_test_sim_dv' failed; build aborted: Target //sw/device/tests:alert_handler_lpg_reset_toggle_test_sim_dv is incompatible and cannot be built, but was explicitly requested.
Dependency chain:
//sw/device/tests:alert_handler_lpg_reset_toggle_test_sim_dv (f2055d) <-- target platform (//toolchain:opentitan_platform) didn't satisfy constraint @@platforms//:incompatible
INFO: Elapsed time: 1.161s, Critical Path: 0.02s
INFO: 1 process: 1 internal.
ERROR: Build did NOT complete successfully
_run_cmd -> had a non-zero return code of 1.
make: *** [/nightly/current_run/opentitan/hw/dv/tools/dvsim/sim.mk:58: sw_build] Error 1
chip_sw_alert_handler_entropy 17678831533907726660736496277828287662760108414060061882607629822739225361933 None
Use --verbose_failures to see the command lines of failed build steps.
ERROR: Analysis of target '//sw/device/tests/sim_dv:alert_handler_entropy_test_sim_dv' failed; build aborted: Target //sw/device/tests/sim_dv:alert_handler_entropy_test_sim_dv is incompatible and cannot be built, but was explicitly requested.
Dependency chain:
//sw/device/tests/sim_dv:alert_handler_entropy_test_sim_dv (f2055d) <-- target platform (//toolchain:opentitan_platform) didn't satisfy constraint @@platforms//:incompatible
INFO: Elapsed time: 1.075s, Critical Path: 0.02s
INFO: 1 process: 1 internal.
ERROR: Build did NOT complete successfully
_run_cmd -> had a non-zero return code of 1.
make: *** [/nightly/current_run/opentitan/hw/dv/tools/dvsim/sim.mk:58: sw_build] Error 1
chip_sw_csrng_fuse_en_sw_app_read_test 99053742434853280312855586202684928238843862371574529229817768892026781725822 None
Use --verbose_failures to see the command lines of failed build steps.
ERROR: Analysis of target '//sw/device/tests/sim_dv:csrng_fuse_en_sw_app_read_sim_dv' failed; build aborted: Target //sw/device/tests/sim_dv:csrng_fuse_en_sw_app_read_sim_dv is incompatible and cannot be built, but was explicitly requested.
Dependency chain:
//sw/device/tests/sim_dv:csrng_fuse_en_sw_app_read_sim_dv (f2055d) <-- target platform (//toolchain:opentitan_platform) didn't satisfy constraint @@platforms//:incompatible
INFO: Elapsed time: 1.020s, Critical Path: 0.03s
INFO: 1 process: 1 internal.
ERROR: Build did NOT complete successfully
_run_cmd -> had a non-zero return code of 1.
make: *** [/nightly/current_run/opentitan/hw/dv/tools/dvsim/sim.mk:58: sw_build] Error 1
chip_sw_kmac_app_rom 4293534642142359973979114507108605744273359887761092508665344175515865280921 None
INFO: [build_sw_collateral_for_sim.py:202] cquery_cmd = ./bazelisk.sh cquery labels(data, //sw/device/tests:kmac_app_rom_test_sim_dv) union labels(srcs, //sw/device/tests:kmac_app_rom_test_sim_dv) --ui_event_filters=-info --noshow_progress --//hw/top=darjeeling --//hw/top=darjeeling --output=starlark
---- STDOUT ----
---- STDERR ----
Another command (pid=1155840) is running. Waiting for it to complete on the server (server_pid=202285)...
ERROR: Error doing post analysis query: Evaluation of subquery "labels('data', //sw/device/tests:kmac_app_rom_test_sim_dv)" failed (did you want to use --keep_going?): in 'data' of rule //sw/device/tests:kmac_app_rom_test_sim_dv: configured target of type test_suite does not have attribute 'data'
ERROR: Build did NOT complete successfully
_run_cmd -> had a non-zero return code of 1.
make: *** [/nightly/current_run/opentitan/hw/dv/tools/dvsim/sim.mk:58: sw_build] Error 1
chip_sw_sram_ctrl_scrambled_access_jitter_en 110820636163015949063282651359158583506734400115698567441676888835575463670615 None
---- STDERR ----
Another command (pid=1374076) is running. Waiting for it to complete on the server (server_pid=202285)...
Another command (pid=1375442) is running. Waiting for it to complete on the server (server_pid=202285)...
WARNING: Target pattern parsing failed.
ERROR: Skipping '//sw/device/tests/sim_dv:sram_ctrl_scrambled_access_test_sim_dv': no such target '//sw/device/tests/sim_dv:sram_ctrl_scrambled_access_test_sim_dv': target 'sram_ctrl_scrambled_access_test_sim_dv' not declared in package 'sw/device/tests/sim_dv' defined by /nightly/current_run/opentitan/sw/device/tests/sim_dv/BUILD
ERROR: no such target '//sw/device/tests/sim_dv:sram_ctrl_scrambled_access_test_sim_dv': target 'sram_ctrl_scrambled_access_test_sim_dv' not declared in package 'sw/device/tests/sim_dv' defined by /nightly/current_run/opentitan/sw/device/tests/sim_dv/BUILD
ERROR: Build did NOT complete successfully
_run_cmd -> had a non-zero return code of 1.
make: *** [/nightly/current_run/opentitan/hw/dv/tools/dvsim/sim.mk:58: sw_build] Error 1
chip_sw_sram_ctrl_execution_main 40919022827164300966792287873470483232810452530602204148718835847828774160 None
Use --verbose_failures to see the command lines of failed build steps.
ERROR: Analysis of target '//sw/device/tests/sim_dv:sram_ctrl_execution_main_test_sim_dv' failed; build aborted: Target //sw/device/tests/sim_dv:sram_ctrl_execution_main_test_sim_dv is incompatible and cannot be built, but was explicitly requested.
Dependency chain:
//sw/device/tests/sim_dv:sram_ctrl_execution_main_test_sim_dv (f2055d) <-- target platform (//toolchain:opentitan_platform) didn't satisfy constraint @@platforms//:incompatible
INFO: Elapsed time: 0.220s, Critical Path: 0.02s
INFO: 1 process: 1 internal.
ERROR: Build did NOT complete successfully
_run_cmd -> had a non-zero return code of 1.
make: *** [/nightly/current_run/opentitan/hw/dv/tools/dvsim/sim.mk:58: sw_build] Error 1
chip_sw_coremark 28146945996550605878950544599601734102953943950366373599792189096190834540550 None
Another command (pid=484325) is running. Waiting for it to complete on the server (server_pid=202285)...
WARNING: Target pattern parsing failed.
ERROR: Skipping '//third_party/coremark/top_darjeeling:coremark_test_sim_dv': no such package 'third_party/coremark/top_darjeeling': BUILD file not found in any of the following directories. Add a BUILD file to a directory to mark it as a package.
- third_party/coremark/top_darjeeling
ERROR: no such package 'third_party/coremark/top_darjeeling': BUILD file not found in any of the following directories. Add a BUILD file to a directory to mark it as a package.
- third_party/coremark/top_darjeeling
ERROR: Build did NOT complete successfully
_run_cmd -> had a non-zero return code of 1.
make: *** [/nightly/current_run/opentitan/hw/dv/tools/dvsim/sim.mk:58: sw_build] Error 1
chip_sw_clkmgr_reset_frequency 42189071774364601139698571081469773606082075985316522695007630767425448269203 None
Use --verbose_failures to see the command lines of failed build steps.
ERROR: Analysis of target '//sw/device/tests:clkmgr_reset_frequency_test_sim_dv' failed; build aborted: Target //sw/device/tests:clkmgr_reset_frequency_test_sim_dv is incompatible and cannot be built, but was explicitly requested.
Dependency chain:
//sw/device/tests:clkmgr_reset_frequency_test_sim_dv (f2055d) <-- target platform (//toolchain:opentitan_platform) didn't satisfy constraint @@platforms//:incompatible
INFO: Elapsed time: 0.321s, Critical Path: 0.02s
INFO: 1 process: 1 internal.
ERROR: Build did NOT complete successfully
_run_cmd -> had a non-zero return code of 1.
make: *** [/nightly/current_run/opentitan/hw/dv/tools/dvsim/sim.mk:58: sw_build] Error 1
chip_sw_clkmgr_sleep_frequency 78975232033333913211220090984111057596773397400588038323735249392072943850991 None
Use --verbose_failures to see the command lines of failed build steps.
ERROR: Analysis of target '//sw/device/tests:clkmgr_sleep_frequency_test_sim_dv' failed; build aborted: Target //sw/device/tests:clkmgr_sleep_frequency_test_sim_dv is incompatible and cannot be built, but was explicitly requested.
Dependency chain:
//sw/device/tests:clkmgr_sleep_frequency_test_sim_dv (f2055d) <-- target platform (//toolchain:opentitan_platform) didn't satisfy constraint @@platforms//:incompatible
INFO: Elapsed time: 0.269s, Critical Path: 0.02s
INFO: 1 process: 1 internal.
ERROR: Build did NOT complete successfully
_run_cmd -> had a non-zero return code of 1.
make: *** [/nightly/current_run/opentitan/hw/dv/tools/dvsim/sim.mk:58: sw_build] Error 1
chip_sw_ast_clk_outputs 63457900061963985651566942792286950586612316100278472827811045439097788280707 None
Use --verbose_failures to see the command lines of failed build steps.
ERROR: Analysis of target '//sw/device/tests:ast_clk_outs_test_sim_dv' failed; build aborted: Target //sw/device/tests:ast_clk_outs_test_sim_dv is incompatible and cannot be built, but was explicitly requested.
Dependency chain:
//sw/device/tests:ast_clk_outs_test_sim_dv (f2055d) <-- target platform (//toolchain:opentitan_platform) didn't satisfy constraint @@platforms//:incompatible
INFO: Elapsed time: 0.296s, Critical Path: 0.02s
INFO: 1 process: 1 internal.
ERROR: Build did NOT complete successfully
_run_cmd -> had a non-zero return code of 1.
make: *** [/nightly/current_run/opentitan/hw/dv/tools/dvsim/sim.mk:58: sw_build] Error 1
chip_sw_lc_ctrl_program_error 64622603891237585728968587610601503801061445019125439447790596811393676950789 None
Use --verbose_failures to see the command lines of failed build steps.
ERROR: Analysis of target '//sw/device/tests/sim_dv:lc_ctrl_program_error_sim_dv' failed; build aborted: Target //sw/device/tests/sim_dv:lc_ctrl_program_error_sim_dv is incompatible and cannot be built, but was explicitly requested.
Dependency chain:
//sw/device/tests/sim_dv:lc_ctrl_program_error_sim_dv (f2055d) <-- target platform (//toolchain:opentitan_platform) didn't satisfy constraint @@platforms//:incompatible
INFO: Elapsed time: 0.290s, Critical Path: 0.02s
INFO: 1 process: 1 internal.
ERROR: Build did NOT complete successfully
_run_cmd -> had a non-zero return code of 1.
make: *** [/nightly/current_run/opentitan/hw/dv/tools/dvsim/sim.mk:58: sw_build] Error 1
chip_sw_rv_dm_ndm_reset_req_when_cpu_halted 48427251965930897849229387657942540310998241884737582988703739102455329012716 None
---- STDOUT ----
---- STDERR ----
WARNING: Target pattern parsing failed.
ERROR: Skipping '//sw/device/tests:rv_dm_ndm_reset_req_when_cpu_halted_sim_dv': no such target '//sw/device/tests:rv_dm_ndm_reset_req_when_cpu_halted_sim_dv': target 'rv_dm_ndm_reset_req_when_cpu_halted_sim_dv' not declared in package 'sw/device/tests' defined by /nightly/current_run/opentitan/sw/device/tests/BUILD (did you mean rv_dm_ndm_reset_req_when_cpu_halted_dev_sim_dv, or rv_dm_ndm_reset_req_when_cpu_halted_rma_sim_dv?)
ERROR: no such target '//sw/device/tests:rv_dm_ndm_reset_req_when_cpu_halted_sim_dv': target 'rv_dm_ndm_reset_req_when_cpu_halted_sim_dv' not declared in package 'sw/device/tests' defined by /nightly/current_run/opentitan/sw/device/tests/BUILD (did you mean rv_dm_ndm_reset_req_when_cpu_halted_dev_sim_dv, or rv_dm_ndm_reset_req_when_cpu_halted_rma_sim_dv?)
ERROR: Build did NOT complete successfully
_run_cmd -> had a non-zero return code of 1.
make: *** [/nightly/current_run/opentitan/hw/dv/tools/dvsim/sim.mk:58: sw_build] Error 1
chip_sw_rv_dm_access_after_wakeup 47211098343287229049891797878532718549619599584338600459840355709317943128584 None
---- STDOUT ----
---- STDERR ----
WARNING: Target pattern parsing failed.
ERROR: Skipping '//sw/device/tests:rv_dm_access_after_wakeup_sim_dv': no such target '//sw/device/tests:rv_dm_access_after_wakeup_sim_dv': target 'rv_dm_access_after_wakeup_sim_dv' not declared in package 'sw/device/tests' defined by /nightly/current_run/opentitan/sw/device/tests/BUILD (did you mean rv_dm_access_after_wakeup_dev_sim_dv, or rv_dm_access_after_wakeup_rma_sim_dv?)
ERROR: no such target '//sw/device/tests:rv_dm_access_after_wakeup_sim_dv': target 'rv_dm_access_after_wakeup_sim_dv' not declared in package 'sw/device/tests' defined by /nightly/current_run/opentitan/sw/device/tests/BUILD (did you mean rv_dm_access_after_wakeup_dev_sim_dv, or rv_dm_access_after_wakeup_rma_sim_dv?)
ERROR: Build did NOT complete successfully
_run_cmd -> had a non-zero return code of 1.
make: *** [/nightly/current_run/opentitan/hw/dv/tools/dvsim/sim.mk:58: sw_build] Error 1
chip_sw_rv_dm_access_after_escalation_reset 106983520497986706507377853423328177106773010533195430064591949954577064703505 None
Use --verbose_failures to see the command lines of failed build steps.
ERROR: Analysis of target '//sw/device/tests:alert_handler_escalation_test_sim_dv' failed; build aborted: Target //sw/device/tests:alert_handler_escalation_test_sim_dv is incompatible and cannot be built, but was explicitly requested.
Dependency chain:
//sw/device/tests:alert_handler_escalation_test_sim_dv (f2055d) <-- target platform (//toolchain:opentitan_platform) didn't satisfy constraint @@platforms//:incompatible
INFO: Elapsed time: 0.853s, Critical Path: 0.02s
INFO: 1 process: 1 internal.
ERROR: Build did NOT complete successfully
_run_cmd -> had a non-zero return code of 1.
make: *** [/nightly/current_run/opentitan/hw/dv/tools/dvsim/sim.mk:58: sw_build] Error 1
chip_sw_power_virus 97477037903768451276849029679508748169897001493926266616430013685610750304679 None
Use --verbose_failures to see the command lines of failed build steps.
ERROR: Analysis of target '//sw/device/tests:power_virus_systemtest_sim_dv' failed; build aborted: Target //sw/device/tests:power_virus_systemtest_sim_dv is incompatible and cannot be built, but was explicitly requested.
Dependency chain:
//sw/device/tests:power_virus_systemtest_sim_dv (f2055d) <-- target platform (//toolchain:opentitan_platform) didn't satisfy constraint @@platforms//:incompatible
INFO: Elapsed time: 4.497s, Critical Path: 0.02s
INFO: 1 process: 1 internal.
ERROR: Build did NOT complete successfully
_run_cmd -> had a non-zero return code of 1.
make: *** [/nightly/current_run/opentitan/hw/dv/tools/dvsim/sim.mk:58: sw_build] Error 1
base_rom_e2e_smoke 35225074496613665214470424459454669209951213667023722775401985600647167271697 None
_deploy_software_collateral(args)
~~~~~~~~~~~~~~~~~~~~~~~~~~~^^^^^^
File "/nightly/current_run/opentitan/util/py/scripts/build_sw_collateral_for_sim.py", line 324, in _deploy_software_collateral
image_string = ImageString(image)
File "<string>", line 4, in __init__
File "/nightly/current_run/opentitan/util/py/scripts/build_sw_collateral_for_sim.py", line 256, in __post_init__
assert flag in KNOWN_FLAGS, f"Unknown flag '{flag}' used in sw_image '{self.raw}'"
^^^^^^^^^^^^^^^^^^^
AssertionError: Unknown flag 'test_in_second_rom' used in sw_image '//sw/device/silicon_creator/rom/e2e:base_rom_e2e_smoke:7:test_in_second_rom'
make: *** [/nightly/current_run/opentitan/hw/dv/tools/dvsim/sim.mk:58: sw_build] Error 1
rom_e2e_smoke 88367790523584610475221834905998750518968335778417188645929861454046081426922 None
---- STDOUT ----
---- STDERR ----
WARNING: Target pattern parsing failed.
ERROR: Skipping '//sw/device/silicon_creator/rom/e2e:empty_test_slot_a_sim_dv': no such target '//sw/device/silicon_creator/rom/e2e:empty_test_slot_a_sim_dv': target 'empty_test_slot_a_sim_dv' not declared in package 'sw/device/silicon_creator/rom/e2e' defined by /nightly/current_run/opentitan/sw/device/silicon_creator/rom/e2e/BUILD
ERROR: no such target '//sw/device/silicon_creator/rom/e2e:empty_test_slot_a_sim_dv': target 'empty_test_slot_a_sim_dv' not declared in package 'sw/device/silicon_creator/rom/e2e' defined by /nightly/current_run/opentitan/sw/device/silicon_creator/rom/e2e/BUILD
ERROR: Build did NOT complete successfully
_run_cmd -> had a non-zero return code of 1.
make: *** [/nightly/current_run/opentitan/hw/dv/tools/dvsim/sim.mk:58: sw_build] Error 1
rom_e2e_shutdown_exception_c 82329872652801280436672802789745151783983368183678611053932711622215511028367 None
---- STDERR ----
Another command (pid=594539) is running. Waiting for it to complete on the server (server_pid=202285)...
Another command (pid=599010) is running. Waiting for it to complete on the server (server_pid=202285)...
WARNING: Target pattern parsing failed.
ERROR: Skipping '//sw/device/silicon_creator/rom:rom_with_fake_keys_sim_dv': no such target '//sw/device/silicon_creator/rom:rom_with_fake_keys_sim_dv': target 'rom_with_fake_keys_sim_dv' not declared in package 'sw/device/silicon_creator/rom' defined by /nightly/current_run/opentitan/sw/device/silicon_creator/rom/BUILD
ERROR: no such target '//sw/device/silicon_creator/rom:rom_with_fake_keys_sim_dv': target 'rom_with_fake_keys_sim_dv' not declared in package 'sw/device/silicon_creator/rom' defined by /nightly/current_run/opentitan/sw/device/silicon_creator/rom/BUILD
ERROR: Build did NOT complete successfully
_run_cmd -> had a non-zero return code of 1.
make: *** [/nightly/current_run/opentitan/hw/dv/tools/dvsim/sim.mk:58: sw_build] Error 1
rom_e2e_shutdown_output 19764057027088425316319146273187920468760150049375371424387566084540685034306 None
Another command (pid=572440) is running. Waiting for it to complete on the server (server_pid=202285)...
Another command (pid=580686) is running. Waiting for it to complete on the server (server_pid=202285)...
Another command (pid=557505) is running. Waiting for it to complete on the server (server_pid=202285)...
WARNING: Target pattern parsing failed.
ERROR: Skipping '//sw/device/silicon_creator/rom/e2e:empty_test_slot_a_sim_dv': no such target '//sw/device/silicon_creator/rom/e2e:empty_test_slot_a_sim_dv': target 'empty_test_slot_a_sim_dv' not declared in package 'sw/device/silicon_creator/rom/e2e' defined by /nightly/current_run/opentitan/sw/device/silicon_creator/rom/e2e/BUILD
ERROR: no such target '//sw/device/silicon_creator/rom/e2e:empty_test_slot_a_sim_dv': target 'empty_test_slot_a_sim_dv' not declared in package 'sw/device/silicon_creator/rom/e2e' defined by /nightly/current_run/opentitan/sw/device/silicon_creator/rom/e2e/BUILD
ERROR: Build did NOT complete successfully
_run_cmd -> had a non-zero return code of 1.
make: *** [/nightly/current_run/opentitan/hw/dv/tools/dvsim/sim.mk:58: sw_build] Error 1
rom_e2e_boot_policy_valid_a_good_b_good_test_unlocked0 66934079017645372293559895166397589606658501000481156205646538048763640966387 None
---- STDERR ----
Another command (pid=284400) is running. Waiting for it to complete on the server (server_pid=202285)...
WARNING: Target pattern parsing failed.
ERROR: Skipping '//sw/device/silicon_creator/rom/e2e:empty_test_slot_a_sim_dv': no such target '//sw/device/silicon_creator/rom/e2e:empty_test_slot_a_sim_dv': target 'empty_test_slot_a_sim_dv' not declared in package 'sw/device/silicon_creator/rom/e2e' defined by /nightly/current_run/opentitan/sw/device/silicon_creator/rom/e2e/BUILD
ERROR: no such target '//sw/device/silicon_creator/rom/e2e:empty_test_slot_a_sim_dv': target 'empty_test_slot_a_sim_dv' not declared in package 'sw/device/silicon_creator/rom/e2e' defined by /nightly/current_run/opentitan/sw/device/silicon_creator/rom/e2e/BUILD
ERROR: Build did NOT complete successfully
_run_cmd -> had a non-zero return code of 1.
make: *** [/nightly/current_run/opentitan/hw/dv/tools/dvsim/sim.mk:58: sw_build] Error 1
rom_e2e_boot_policy_valid_a_good_b_good_dev 49105444056863520180866046148371745676241392590694903065785482968269140364636 None
---- STDERR ----
Another command (pid=532506) is running. Waiting for it to complete on the server (server_pid=202285)...
WARNING: Target pattern parsing failed.
ERROR: Skipping '//sw/device/silicon_creator/rom/e2e:empty_test_slot_a_sim_dv': no such target '//sw/device/silicon_creator/rom/e2e:empty_test_slot_a_sim_dv': target 'empty_test_slot_a_sim_dv' not declared in package 'sw/device/silicon_creator/rom/e2e' defined by /nightly/current_run/opentitan/sw/device/silicon_creator/rom/e2e/BUILD
ERROR: no such target '//sw/device/silicon_creator/rom/e2e:empty_test_slot_a_sim_dv': target 'empty_test_slot_a_sim_dv' not declared in package 'sw/device/silicon_creator/rom/e2e' defined by /nightly/current_run/opentitan/sw/device/silicon_creator/rom/e2e/BUILD
ERROR: Build did NOT complete successfully
_run_cmd -> had a non-zero return code of 1.
make: *** [/nightly/current_run/opentitan/hw/dv/tools/dvsim/sim.mk:58: sw_build] Error 1
rom_e2e_boot_policy_valid_a_good_b_good_prod 106458076950339373176645295232594269286010886200319464899981830244398771325521 None
---- STDOUT ----
---- STDERR ----
WARNING: Target pattern parsing failed.
ERROR: Skipping '//sw/device/silicon_creator/rom/e2e:empty_test_slot_a_sim_dv': no such target '//sw/device/silicon_creator/rom/e2e:empty_test_slot_a_sim_dv': target 'empty_test_slot_a_sim_dv' not declared in package 'sw/device/silicon_creator/rom/e2e' defined by /nightly/current_run/opentitan/sw/device/silicon_creator/rom/e2e/BUILD
ERROR: no such target '//sw/device/silicon_creator/rom/e2e:empty_test_slot_a_sim_dv': target 'empty_test_slot_a_sim_dv' not declared in package 'sw/device/silicon_creator/rom/e2e' defined by /nightly/current_run/opentitan/sw/device/silicon_creator/rom/e2e/BUILD
ERROR: Build did NOT complete successfully
_run_cmd -> had a non-zero return code of 1.
make: *** [/nightly/current_run/opentitan/hw/dv/tools/dvsim/sim.mk:58: sw_build] Error 1
rom_e2e_boot_policy_valid_a_good_b_good_prod_end 102588891117642454292622601390219214159472585371033187767717462231055687484511 None
---- STDERR ----
Another command (pid=534023) is running. Waiting for it to complete on the server (server_pid=202285)...
WARNING: Target pattern parsing failed.
ERROR: Skipping '//sw/device/silicon_creator/rom/e2e:empty_test_slot_a_sim_dv': no such target '//sw/device/silicon_creator/rom/e2e:empty_test_slot_a_sim_dv': target 'empty_test_slot_a_sim_dv' not declared in package 'sw/device/silicon_creator/rom/e2e' defined by /nightly/current_run/opentitan/sw/device/silicon_creator/rom/e2e/BUILD
ERROR: no such target '//sw/device/silicon_creator/rom/e2e:empty_test_slot_a_sim_dv': target 'empty_test_slot_a_sim_dv' not declared in package 'sw/device/silicon_creator/rom/e2e' defined by /nightly/current_run/opentitan/sw/device/silicon_creator/rom/e2e/BUILD
ERROR: Build did NOT complete successfully
_run_cmd -> had a non-zero return code of 1.
make: *** [/nightly/current_run/opentitan/hw/dv/tools/dvsim/sim.mk:58: sw_build] Error 1
rom_e2e_boot_policy_valid_a_good_b_good_rma 72474043537361889630983073789513635182277849517612586838947538518292223906478 None
Another command (pid=538956) is running. Waiting for it to complete on the server (server_pid=202285)...
Another command (pid=546590) is running. Waiting for it to complete on the server (server_pid=202285)...
Another command (pid=539112) is running. Waiting for it to complete on the server (server_pid=202285)...
WARNING: Target pattern parsing failed.
ERROR: Skipping '//sw/device/silicon_creator/rom/e2e:empty_test_slot_a_sim_dv': no such target '//sw/device/silicon_creator/rom/e2e:empty_test_slot_a_sim_dv': target 'empty_test_slot_a_sim_dv' not declared in package 'sw/device/silicon_creator/rom/e2e' defined by /nightly/current_run/opentitan/sw/device/silicon_creator/rom/e2e/BUILD
ERROR: no such target '//sw/device/silicon_creator/rom/e2e:empty_test_slot_a_sim_dv': target 'empty_test_slot_a_sim_dv' not declared in package 'sw/device/silicon_creator/rom/e2e' defined by /nightly/current_run/opentitan/sw/device/silicon_creator/rom/e2e/BUILD
ERROR: Build did NOT complete successfully
_run_cmd -> had a non-zero return code of 1.
make: *** [/nightly/current_run/opentitan/hw/dv/tools/dvsim/sim.mk:58: sw_build] Error 1
rom_e2e_boot_policy_valid_a_good_b_bad_test_unlocked0 72483715555770967935633994066011737973314641110460255414506497756631129635234 None
Another command (pid=284400) is running. Waiting for it to complete on the server (server_pid=202285)...
Another command (pid=303512) is running. Waiting for it to complete on the server (server_pid=202285)...
Another command (pid=312717) is running. Waiting for it to complete on the server (server_pid=202285)...
WARNING: Target pattern parsing failed.
ERROR: Skipping '//sw/device/silicon_creator/rom/e2e:empty_test_slot_a_sim_dv': no such target '//sw/device/silicon_creator/rom/e2e:empty_test_slot_a_sim_dv': target 'empty_test_slot_a_sim_dv' not declared in package 'sw/device/silicon_creator/rom/e2e' defined by /nightly/current_run/opentitan/sw/device/silicon_creator/rom/e2e/BUILD
ERROR: no such target '//sw/device/silicon_creator/rom/e2e:empty_test_slot_a_sim_dv': target 'empty_test_slot_a_sim_dv' not declared in package 'sw/device/silicon_creator/rom/e2e' defined by /nightly/current_run/opentitan/sw/device/silicon_creator/rom/e2e/BUILD
ERROR: Build did NOT complete successfully
_run_cmd -> had a non-zero return code of 1.
make: *** [/nightly/current_run/opentitan/hw/dv/tools/dvsim/sim.mk:58: sw_build] Error 1
rom_e2e_boot_policy_valid_a_good_b_bad_dev 44685744654418098040108785342796014729204761601005093025543146492094359584401 None
---- STDOUT ----
---- STDERR ----
WARNING: Target pattern parsing failed.
ERROR: Skipping '//sw/device/silicon_creator/rom/e2e:empty_test_slot_a_sim_dv': no such target '//sw/device/silicon_creator/rom/e2e:empty_test_slot_a_sim_dv': target 'empty_test_slot_a_sim_dv' not declared in package 'sw/device/silicon_creator/rom/e2e' defined by /nightly/current_run/opentitan/sw/device/silicon_creator/rom/e2e/BUILD
ERROR: no such target '//sw/device/silicon_creator/rom/e2e:empty_test_slot_a_sim_dv': target 'empty_test_slot_a_sim_dv' not declared in package 'sw/device/silicon_creator/rom/e2e' defined by /nightly/current_run/opentitan/sw/device/silicon_creator/rom/e2e/BUILD
ERROR: Build did NOT complete successfully
_run_cmd -> had a non-zero return code of 1.
make: *** [/nightly/current_run/opentitan/hw/dv/tools/dvsim/sim.mk:58: sw_build] Error 1
rom_e2e_boot_policy_valid_a_good_b_bad_prod 112810609366452863046510176287084891694772508603018802541134524331729581357661 None
---- STDOUT ----
---- STDERR ----
WARNING: Target pattern parsing failed.
ERROR: Skipping '//sw/device/silicon_creator/rom/e2e:empty_test_slot_a_sim_dv': no such target '//sw/device/silicon_creator/rom/e2e:empty_test_slot_a_sim_dv': target 'empty_test_slot_a_sim_dv' not declared in package 'sw/device/silicon_creator/rom/e2e' defined by /nightly/current_run/opentitan/sw/device/silicon_creator/rom/e2e/BUILD
ERROR: no such target '//sw/device/silicon_creator/rom/e2e:empty_test_slot_a_sim_dv': target 'empty_test_slot_a_sim_dv' not declared in package 'sw/device/silicon_creator/rom/e2e' defined by /nightly/current_run/opentitan/sw/device/silicon_creator/rom/e2e/BUILD
ERROR: Build did NOT complete successfully
_run_cmd -> had a non-zero return code of 1.
make: *** [/nightly/current_run/opentitan/hw/dv/tools/dvsim/sim.mk:58: sw_build] Error 1
rom_e2e_boot_policy_valid_a_good_b_bad_prod_end 48807865993320640362899960814850660060975613118351309396104746670538137400915 None
---- STDERR ----
Another command (pid=532840) is running. Waiting for it to complete on the server (server_pid=202285)...
WARNING: Target pattern parsing failed.
ERROR: Skipping '//sw/device/silicon_creator/rom/e2e:empty_test_slot_a_sim_dv': no such target '//sw/device/silicon_creator/rom/e2e:empty_test_slot_a_sim_dv': target 'empty_test_slot_a_sim_dv' not declared in package 'sw/device/silicon_creator/rom/e2e' defined by /nightly/current_run/opentitan/sw/device/silicon_creator/rom/e2e/BUILD
ERROR: no such target '//sw/device/silicon_creator/rom/e2e:empty_test_slot_a_sim_dv': target 'empty_test_slot_a_sim_dv' not declared in package 'sw/device/silicon_creator/rom/e2e' defined by /nightly/current_run/opentitan/sw/device/silicon_creator/rom/e2e/BUILD
ERROR: Build did NOT complete successfully
_run_cmd -> had a non-zero return code of 1.
make: *** [/nightly/current_run/opentitan/hw/dv/tools/dvsim/sim.mk:58: sw_build] Error 1
rom_e2e_boot_policy_valid_a_good_b_bad_rma 16692303773994236443941408451410269297331962533832150515365565718510832731797 None
---- STDOUT ----
---- STDERR ----
WARNING: Target pattern parsing failed.
ERROR: Skipping '//sw/device/silicon_creator/rom/e2e:empty_test_slot_a_sim_dv': no such target '//sw/device/silicon_creator/rom/e2e:empty_test_slot_a_sim_dv': target 'empty_test_slot_a_sim_dv' not declared in package 'sw/device/silicon_creator/rom/e2e' defined by /nightly/current_run/opentitan/sw/device/silicon_creator/rom/e2e/BUILD
ERROR: no such target '//sw/device/silicon_creator/rom/e2e:empty_test_slot_a_sim_dv': target 'empty_test_slot_a_sim_dv' not declared in package 'sw/device/silicon_creator/rom/e2e' defined by /nightly/current_run/opentitan/sw/device/silicon_creator/rom/e2e/BUILD
ERROR: Build did NOT complete successfully
_run_cmd -> had a non-zero return code of 1.
make: *** [/nightly/current_run/opentitan/hw/dv/tools/dvsim/sim.mk:58: sw_build] Error 1
rom_e2e_boot_policy_valid_a_bad_b_good_test_unlocked0 77167157446726140054585659902669744939692613521190141110342504340343512505003 None
---- STDERR ----
Another command (pid=349791) is running. Waiting for it to complete on the server (server_pid=202285)...
Another command (pid=350460) is running. Waiting for it to complete on the server (server_pid=202285)...
WARNING: Target pattern parsing failed.
ERROR: Skipping '//sw/device/silicon_creator/rom/e2e:empty_test_slot_b_sim_dv': no such target '//sw/device/silicon_creator/rom/e2e:empty_test_slot_b_sim_dv': target 'empty_test_slot_b_sim_dv' not declared in package 'sw/device/silicon_creator/rom/e2e' defined by /nightly/current_run/opentitan/sw/device/silicon_creator/rom/e2e/BUILD
ERROR: no such target '//sw/device/silicon_creator/rom/e2e:empty_test_slot_b_sim_dv': target 'empty_test_slot_b_sim_dv' not declared in package 'sw/device/silicon_creator/rom/e2e' defined by /nightly/current_run/opentitan/sw/device/silicon_creator/rom/e2e/BUILD
ERROR: Build did NOT complete successfully
_run_cmd -> had a non-zero return code of 1.
make: *** [/nightly/current_run/opentitan/hw/dv/tools/dvsim/sim.mk:58: sw_build] Error 1
rom_e2e_boot_policy_valid_a_bad_b_good_dev 55328976828243570808407028941735361501732013345927150306870552259596243488078 None
---- STDERR ----
Another command (pid=525479) is running. Waiting for it to complete on the server (server_pid=202285)...
WARNING: Target pattern parsing failed.
ERROR: Skipping '//sw/device/silicon_creator/rom/e2e:empty_test_slot_b_sim_dv': no such target '//sw/device/silicon_creator/rom/e2e:empty_test_slot_b_sim_dv': target 'empty_test_slot_b_sim_dv' not declared in package 'sw/device/silicon_creator/rom/e2e' defined by /nightly/current_run/opentitan/sw/device/silicon_creator/rom/e2e/BUILD
ERROR: no such target '//sw/device/silicon_creator/rom/e2e:empty_test_slot_b_sim_dv': target 'empty_test_slot_b_sim_dv' not declared in package 'sw/device/silicon_creator/rom/e2e' defined by /nightly/current_run/opentitan/sw/device/silicon_creator/rom/e2e/BUILD
ERROR: Build did NOT complete successfully
_run_cmd -> had a non-zero return code of 1.
make: *** [/nightly/current_run/opentitan/hw/dv/tools/dvsim/sim.mk:58: sw_build] Error 1
rom_e2e_boot_policy_valid_a_bad_b_good_prod 72953672137177688599875565873929702414834276447426392647174575858447271343504 None
---- STDERR ----
Another command (pid=525069) is running. Waiting for it to complete on the server (server_pid=202285)...
WARNING: Target pattern parsing failed.
ERROR: Skipping '//sw/device/silicon_creator/rom/e2e:empty_test_slot_b_sim_dv': no such target '//sw/device/silicon_creator/rom/e2e:empty_test_slot_b_sim_dv': target 'empty_test_slot_b_sim_dv' not declared in package 'sw/device/silicon_creator/rom/e2e' defined by /nightly/current_run/opentitan/sw/device/silicon_creator/rom/e2e/BUILD
ERROR: no such target '//sw/device/silicon_creator/rom/e2e:empty_test_slot_b_sim_dv': target 'empty_test_slot_b_sim_dv' not declared in package 'sw/device/silicon_creator/rom/e2e' defined by /nightly/current_run/opentitan/sw/device/silicon_creator/rom/e2e/BUILD
ERROR: Build did NOT complete successfully
_run_cmd -> had a non-zero return code of 1.
make: *** [/nightly/current_run/opentitan/hw/dv/tools/dvsim/sim.mk:58: sw_build] Error 1
rom_e2e_boot_policy_valid_a_bad_b_good_prod_end 81423464208079879024538141735578614051874102555954587273853841068577134965074 None
---- STDOUT ----
---- STDERR ----
WARNING: Target pattern parsing failed.
ERROR: Skipping '//sw/device/silicon_creator/rom/e2e:empty_test_slot_b_sim_dv': no such target '//sw/device/silicon_creator/rom/e2e:empty_test_slot_b_sim_dv': target 'empty_test_slot_b_sim_dv' not declared in package 'sw/device/silicon_creator/rom/e2e' defined by /nightly/current_run/opentitan/sw/device/silicon_creator/rom/e2e/BUILD
ERROR: no such target '//sw/device/silicon_creator/rom/e2e:empty_test_slot_b_sim_dv': target 'empty_test_slot_b_sim_dv' not declared in package 'sw/device/silicon_creator/rom/e2e' defined by /nightly/current_run/opentitan/sw/device/silicon_creator/rom/e2e/BUILD
ERROR: Build did NOT complete successfully
_run_cmd -> had a non-zero return code of 1.
make: *** [/nightly/current_run/opentitan/hw/dv/tools/dvsim/sim.mk:58: sw_build] Error 1
rom_e2e_boot_policy_valid_a_bad_b_good_rma 21897071347509736256075352950328134622249478170987550071063494684429058999044 None
---- STDOUT ----
---- STDERR ----
WARNING: Target pattern parsing failed.
ERROR: Skipping '//sw/device/silicon_creator/rom/e2e:empty_test_slot_b_sim_dv': no such target '//sw/device/silicon_creator/rom/e2e:empty_test_slot_b_sim_dv': target 'empty_test_slot_b_sim_dv' not declared in package 'sw/device/silicon_creator/rom/e2e' defined by /nightly/current_run/opentitan/sw/device/silicon_creator/rom/e2e/BUILD
ERROR: no such target '//sw/device/silicon_creator/rom/e2e:empty_test_slot_b_sim_dv': target 'empty_test_slot_b_sim_dv' not declared in package 'sw/device/silicon_creator/rom/e2e' defined by /nightly/current_run/opentitan/sw/device/silicon_creator/rom/e2e/BUILD
ERROR: Build did NOT complete successfully
_run_cmd -> had a non-zero return code of 1.
make: *** [/nightly/current_run/opentitan/hw/dv/tools/dvsim/sim.mk:58: sw_build] Error 1
rom_e2e_sigverify_always_a_bad_b_bad_test_unlocked0 100800717886734167270087984320232820286560347057662304575278424649823291333332 None
Another command (pid=448671) is running. Waiting for it to complete on the server (server_pid=202285)...
Another command (pid=399951) is running. Waiting for it to complete on the server (server_pid=202285)...
Another command (pid=453414) is running. Waiting for it to complete on the server (server_pid=202285)...
WARNING: Target pattern parsing failed.
ERROR: Skipping '//sw/device/silicon_creator/rom/e2e:otp_img_sigverify_always_test_unlocked0': no such target '//sw/device/silicon_creator/rom/e2e:otp_img_sigverify_always_test_unlocked0': target 'otp_img_sigverify_always_test_unlocked0' not declared in package 'sw/device/silicon_creator/rom/e2e' defined by /nightly/current_run/opentitan/sw/device/silicon_creator/rom/e2e/BUILD
ERROR: no such target '//sw/device/silicon_creator/rom/e2e:otp_img_sigverify_always_test_unlocked0': target 'otp_img_sigverify_always_test_unlocked0' not declared in package 'sw/device/silicon_creator/rom/e2e' defined by /nightly/current_run/opentitan/sw/device/silicon_creator/rom/e2e/BUILD
ERROR: Build did NOT complete successfully
_run_cmd -> had a non-zero return code of 1.
make: *** [/nightly/current_run/opentitan/hw/dv/tools/dvsim/sim.mk:58: sw_build] Error 1
rom_e2e_sigverify_always_a_bad_b_bad_dev 70306219438931767740482105874237678525158497748217392247084609802929953352803 None
Another command (pid=593259) is running. Waiting for it to complete on the server (server_pid=202285)...
Another command (pid=599010) is running. Waiting for it to complete on the server (server_pid=202285)...
Another command (pid=587666) is running. Waiting for it to complete on the server (server_pid=202285)...
WARNING: Target pattern parsing failed.
ERROR: Skipping '//sw/device/silicon_creator/rom/e2e:otp_img_sigverify_always_dev': no such target '//sw/device/silicon_creator/rom/e2e:otp_img_sigverify_always_dev': target 'otp_img_sigverify_always_dev' not declared in package 'sw/device/silicon_creator/rom/e2e' defined by /nightly/current_run/opentitan/sw/device/silicon_creator/rom/e2e/BUILD
ERROR: no such target '//sw/device/silicon_creator/rom/e2e:otp_img_sigverify_always_dev': target 'otp_img_sigverify_always_dev' not declared in package 'sw/device/silicon_creator/rom/e2e' defined by /nightly/current_run/opentitan/sw/device/silicon_creator/rom/e2e/BUILD
ERROR: Build did NOT complete successfully
_run_cmd -> had a non-zero return code of 1.
make: *** [/nightly/current_run/opentitan/hw/dv/tools/dvsim/sim.mk:58: sw_build] Error 1
rom_e2e_sigverify_always_a_bad_b_bad_prod 29508431331316206698927586873393836225718973728554669037579215478090532437369 None
Another command (pid=600373) is running. Waiting for it to complete on the server (server_pid=202285)...
Another command (pid=568196) is running. Waiting for it to complete on the server (server_pid=202285)...
Another command (pid=620088) is running. Waiting for it to complete on the server (server_pid=202285)...
WARNING: Target pattern parsing failed.
ERROR: Skipping '//sw/device/silicon_creator/rom/e2e:otp_img_sigverify_always_prod': no such target '//sw/device/silicon_creator/rom/e2e:otp_img_sigverify_always_prod': target 'otp_img_sigverify_always_prod' not declared in package 'sw/device/silicon_creator/rom/e2e' defined by /nightly/current_run/opentitan/sw/device/silicon_creator/rom/e2e/BUILD
ERROR: no such target '//sw/device/silicon_creator/rom/e2e:otp_img_sigverify_always_prod': target 'otp_img_sigverify_always_prod' not declared in package 'sw/device/silicon_creator/rom/e2e' defined by /nightly/current_run/opentitan/sw/device/silicon_creator/rom/e2e/BUILD
ERROR: Build did NOT complete successfully
_run_cmd -> had a non-zero return code of 1.
make: *** [/nightly/current_run/opentitan/hw/dv/tools/dvsim/sim.mk:58: sw_build] Error 1
rom_e2e_sigverify_always_a_bad_b_bad_prod_end 97634887341902263391754556905706836152771598268978223573261754206526146219600 None
Another command (pid=587666) is running. Waiting for it to complete on the server (server_pid=202285)...
Another command (pid=599969) is running. Waiting for it to complete on the server (server_pid=202285)...
Another command (pid=606776) is running. Waiting for it to complete on the server (server_pid=202285)...
WARNING: Target pattern parsing failed.
ERROR: Skipping '//sw/device/silicon_creator/rom/e2e:otp_img_sigverify_always_prod_end': no such target '//sw/device/silicon_creator/rom/e2e:otp_img_sigverify_always_prod_end': target 'otp_img_sigverify_always_prod_end' not declared in package 'sw/device/silicon_creator/rom/e2e' defined by /nightly/current_run/opentitan/sw/device/silicon_creator/rom/e2e/BUILD
ERROR: no such target '//sw/device/silicon_creator/rom/e2e:otp_img_sigverify_always_prod_end': target 'otp_img_sigverify_always_prod_end' not declared in package 'sw/device/silicon_creator/rom/e2e' defined by /nightly/current_run/opentitan/sw/device/silicon_creator/rom/e2e/BUILD
ERROR: Build did NOT complete successfully
_run_cmd -> had a non-zero return code of 1.
make: *** [/nightly/current_run/opentitan/hw/dv/tools/dvsim/sim.mk:58: sw_build] Error 1
rom_e2e_sigverify_always_a_bad_b_bad_rma 88240578743919241823500279600288959181481581374353289395136478002134917717586 None
Another command (pid=595366) is running. Waiting for it to complete on the server (server_pid=202285)...
Another command (pid=614271) is running. Waiting for it to complete on the server (server_pid=202285)...
Another command (pid=598524) is running. Waiting for it to complete on the server (server_pid=202285)...
WARNING: Target pattern parsing failed.
ERROR: Skipping '//sw/device/silicon_creator/rom/e2e:otp_img_sigverify_always_rma': no such target '//sw/device/silicon_creator/rom/e2e:otp_img_sigverify_always_rma': target 'otp_img_sigverify_always_rma' not declared in package 'sw/device/silicon_creator/rom/e2e' defined by /nightly/current_run/opentitan/sw/device/silicon_creator/rom/e2e/BUILD
ERROR: no such target '//sw/device/silicon_creator/rom/e2e:otp_img_sigverify_always_rma': target 'otp_img_sigverify_always_rma' not declared in package 'sw/device/silicon_creator/rom/e2e' defined by /nightly/current_run/opentitan/sw/device/silicon_creator/rom/e2e/BUILD
ERROR: Build did NOT complete successfully
_run_cmd -> had a non-zero return code of 1.
make: *** [/nightly/current_run/opentitan/hw/dv/tools/dvsim/sim.mk:58: sw_build] Error 1
rom_e2e_sigverify_always_a_bad_b_nothing_test_unlocked0 106207547807182628903373679210773622280424885710201925401019081356602763575727 None
Another command (pid=369190) is running. Waiting for it to complete on the server (server_pid=202285)...
Another command (pid=373911) is running. Waiting for it to complete on the server (server_pid=202285)...
Another command (pid=373268) is running. Waiting for it to complete on the server (server_pid=202285)...
WARNING: Target pattern parsing failed.
ERROR: Skipping '//sw/device/silicon_creator/rom/e2e:otp_img_sigverify_always_test_unlocked0': no such target '//sw/device/silicon_creator/rom/e2e:otp_img_sigverify_always_test_unlocked0': target 'otp_img_sigverify_always_test_unlocked0' not declared in package 'sw/device/silicon_creator/rom/e2e' defined by /nightly/current_run/opentitan/sw/device/silicon_creator/rom/e2e/BUILD
ERROR: no such target '//sw/device/silicon_creator/rom/e2e:otp_img_sigverify_always_test_unlocked0': target 'otp_img_sigverify_always_test_unlocked0' not declared in package 'sw/device/silicon_creator/rom/e2e' defined by /nightly/current_run/opentitan/sw/device/silicon_creator/rom/e2e/BUILD
ERROR: Build did NOT complete successfully
_run_cmd -> had a non-zero return code of 1.
make: *** [/nightly/current_run/opentitan/hw/dv/tools/dvsim/sim.mk:58: sw_build] Error 1
rom_e2e_sigverify_always_a_bad_b_nothing_dev 90287487735306484966489330416913129626787285251235068847444624417876891910015 None
Another command (pid=587666) is running. Waiting for it to complete on the server (server_pid=202285)...
Another command (pid=599969) is running. Waiting for it to complete on the server (server_pid=202285)...
Another command (pid=606776) is running. Waiting for it to complete on the server (server_pid=202285)...
WARNING: Target pattern parsing failed.
ERROR: Skipping '//sw/device/silicon_creator/rom/e2e:otp_img_sigverify_always_dev': no such target '//sw/device/silicon_creator/rom/e2e:otp_img_sigverify_always_dev': target 'otp_img_sigverify_always_dev' not declared in package 'sw/device/silicon_creator/rom/e2e' defined by /nightly/current_run/opentitan/sw/device/silicon_creator/rom/e2e/BUILD
ERROR: no such target '//sw/device/silicon_creator/rom/e2e:otp_img_sigverify_always_dev': target 'otp_img_sigverify_always_dev' not declared in package 'sw/device/silicon_creator/rom/e2e' defined by /nightly/current_run/opentitan/sw/device/silicon_creator/rom/e2e/BUILD
ERROR: Build did NOT complete successfully
_run_cmd -> had a non-zero return code of 1.
make: *** [/nightly/current_run/opentitan/hw/dv/tools/dvsim/sim.mk:58: sw_build] Error 1
rom_e2e_sigverify_always_a_bad_b_nothing_prod 54376060870222835131961648674462040671457462533406643202582878420903155549567 None
Another command (pid=606776) is running. Waiting for it to complete on the server (server_pid=202285)...
Another command (pid=600831) is running. Waiting for it to complete on the server (server_pid=202285)...
Another command (pid=608809) is running. Waiting for it to complete on the server (server_pid=202285)...
WARNING: Target pattern parsing failed.
ERROR: Skipping '//sw/device/silicon_creator/rom/e2e:otp_img_sigverify_always_prod': no such target '//sw/device/silicon_creator/rom/e2e:otp_img_sigverify_always_prod': target 'otp_img_sigverify_always_prod' not declared in package 'sw/device/silicon_creator/rom/e2e' defined by /nightly/current_run/opentitan/sw/device/silicon_creator/rom/e2e/BUILD
ERROR: no such target '//sw/device/silicon_creator/rom/e2e:otp_img_sigverify_always_prod': target 'otp_img_sigverify_always_prod' not declared in package 'sw/device/silicon_creator/rom/e2e' defined by /nightly/current_run/opentitan/sw/device/silicon_creator/rom/e2e/BUILD
ERROR: Build did NOT complete successfully
_run_cmd -> had a non-zero return code of 1.
make: *** [/nightly/current_run/opentitan/hw/dv/tools/dvsim/sim.mk:58: sw_build] Error 1
rom_e2e_sigverify_always_a_bad_b_nothing_prod_end 22315638531356246929491155656515904972663790560346345156857075537747359207935 None
Another command (pid=606776) is running. Waiting for it to complete on the server (server_pid=202285)...
Another command (pid=605126) is running. Waiting for it to complete on the server (server_pid=202285)...
Another command (pid=608809) is running. Waiting for it to complete on the server (server_pid=202285)...
WARNING: Target pattern parsing failed.
ERROR: Skipping '//sw/device/silicon_creator/rom/e2e:otp_img_sigverify_always_prod_end': no such target '//sw/device/silicon_creator/rom/e2e:otp_img_sigverify_always_prod_end': target 'otp_img_sigverify_always_prod_end' not declared in package 'sw/device/silicon_creator/rom/e2e' defined by /nightly/current_run/opentitan/sw/device/silicon_creator/rom/e2e/BUILD
ERROR: no such target '//sw/device/silicon_creator/rom/e2e:otp_img_sigverify_always_prod_end': target 'otp_img_sigverify_always_prod_end' not declared in package 'sw/device/silicon_creator/rom/e2e' defined by /nightly/current_run/opentitan/sw/device/silicon_creator/rom/e2e/BUILD
ERROR: Build did NOT complete successfully
_run_cmd -> had a non-zero return code of 1.
make: *** [/nightly/current_run/opentitan/hw/dv/tools/dvsim/sim.mk:58: sw_build] Error 1
rom_e2e_sigverify_always_a_bad_b_nothing_rma 87983138817472446407145112337017989947506872074907479550210362863924259590067 None
Another command (pid=568196) is running. Waiting for it to complete on the server (server_pid=202285)...
Another command (pid=611448) is running. Waiting for it to complete on the server (server_pid=202285)...
Another command (pid=591234) is running. Waiting for it to complete on the server (server_pid=202285)...
WARNING: Target pattern parsing failed.
ERROR: Skipping '//sw/device/silicon_creator/rom/e2e:otp_img_sigverify_always_rma': no such target '//sw/device/silicon_creator/rom/e2e:otp_img_sigverify_always_rma': target 'otp_img_sigverify_always_rma' not declared in package 'sw/device/silicon_creator/rom/e2e' defined by /nightly/current_run/opentitan/sw/device/silicon_creator/rom/e2e/BUILD
ERROR: no such target '//sw/device/silicon_creator/rom/e2e:otp_img_sigverify_always_rma': target 'otp_img_sigverify_always_rma' not declared in package 'sw/device/silicon_creator/rom/e2e' defined by /nightly/current_run/opentitan/sw/device/silicon_creator/rom/e2e/BUILD
ERROR: Build did NOT complete successfully
_run_cmd -> had a non-zero return code of 1.
make: *** [/nightly/current_run/opentitan/hw/dv/tools/dvsim/sim.mk:58: sw_build] Error 1
rom_e2e_sigverify_always_a_nothing_b_bad_test_unlocked0 59700450297395289497803301835373025123317831641568023581849140369616438572774 None
Another command (pid=372115) is running. Waiting for it to complete on the server (server_pid=202285)...
Another command (pid=356088) is running. Waiting for it to complete on the server (server_pid=202285)...
Another command (pid=448671) is running. Waiting for it to complete on the server (server_pid=202285)...
WARNING: Target pattern parsing failed.
ERROR: Skipping '//sw/device/silicon_creator/rom/e2e:otp_img_sigverify_always_test_unlocked0': no such target '//sw/device/silicon_creator/rom/e2e:otp_img_sigverify_always_test_unlocked0': target 'otp_img_sigverify_always_test_unlocked0' not declared in package 'sw/device/silicon_creator/rom/e2e' defined by /nightly/current_run/opentitan/sw/device/silicon_creator/rom/e2e/BUILD
ERROR: no such target '//sw/device/silicon_creator/rom/e2e:otp_img_sigverify_always_test_unlocked0': target 'otp_img_sigverify_always_test_unlocked0' not declared in package 'sw/device/silicon_creator/rom/e2e' defined by /nightly/current_run/opentitan/sw/device/silicon_creator/rom/e2e/BUILD
ERROR: Build did NOT complete successfully
_run_cmd -> had a non-zero return code of 1.
make: *** [/nightly/current_run/opentitan/hw/dv/tools/dvsim/sim.mk:58: sw_build] Error 1
rom_e2e_sigverify_always_a_nothing_b_bad_dev 90182955208497322159513657718201565146417839318335333465877885804579025267015 None
---- STDERR ----
Another command (pid=609864) is running. Waiting for it to complete on the server (server_pid=202285)...
Another command (pid=598524) is running. Waiting for it to complete on the server (server_pid=202285)...
WARNING: Target pattern parsing failed.
ERROR: Skipping '//sw/device/silicon_creator/rom/e2e:otp_img_sigverify_always_dev': no such target '//sw/device/silicon_creator/rom/e2e:otp_img_sigverify_always_dev': target 'otp_img_sigverify_always_dev' not declared in package 'sw/device/silicon_creator/rom/e2e' defined by /nightly/current_run/opentitan/sw/device/silicon_creator/rom/e2e/BUILD
ERROR: no such target '//sw/device/silicon_creator/rom/e2e:otp_img_sigverify_always_dev': target 'otp_img_sigverify_always_dev' not declared in package 'sw/device/silicon_creator/rom/e2e' defined by /nightly/current_run/opentitan/sw/device/silicon_creator/rom/e2e/BUILD
ERROR: Build did NOT complete successfully
_run_cmd -> had a non-zero return code of 1.
make: *** [/nightly/current_run/opentitan/hw/dv/tools/dvsim/sim.mk:58: sw_build] Error 1
rom_e2e_sigverify_always_a_nothing_b_bad_prod 76376282799150404688551311365802269611864336777656093878885858706688071808522 None
---- STDERR ----
Another command (pid=618753) is running. Waiting for it to complete on the server (server_pid=202285)...
WARNING: Target pattern parsing failed.
ERROR: Skipping '//sw/device/silicon_creator/rom/e2e:otp_img_sigverify_always_prod': no such target '//sw/device/silicon_creator/rom/e2e:otp_img_sigverify_always_prod': target 'otp_img_sigverify_always_prod' not declared in package 'sw/device/silicon_creator/rom/e2e' defined by /nightly/current_run/opentitan/sw/device/silicon_creator/rom/e2e/BUILD
ERROR: no such target '//sw/device/silicon_creator/rom/e2e:otp_img_sigverify_always_prod': target 'otp_img_sigverify_always_prod' not declared in package 'sw/device/silicon_creator/rom/e2e' defined by /nightly/current_run/opentitan/sw/device/silicon_creator/rom/e2e/BUILD
ERROR: Build did NOT complete successfully
_run_cmd -> had a non-zero return code of 1.
make: *** [/nightly/current_run/opentitan/hw/dv/tools/dvsim/sim.mk:58: sw_build] Error 1
rom_e2e_sigverify_always_a_nothing_b_bad_prod_end 28920413342497051824474835993120137748528967948181396282428197841728849823839 None
---- STDOUT ----
---- STDERR ----
WARNING: Target pattern parsing failed.
ERROR: Skipping '//sw/device/silicon_creator/rom/e2e:otp_img_sigverify_always_prod_end': no such target '//sw/device/silicon_creator/rom/e2e:otp_img_sigverify_always_prod_end': target 'otp_img_sigverify_always_prod_end' not declared in package 'sw/device/silicon_creator/rom/e2e' defined by /nightly/current_run/opentitan/sw/device/silicon_creator/rom/e2e/BUILD
ERROR: no such target '//sw/device/silicon_creator/rom/e2e:otp_img_sigverify_always_prod_end': target 'otp_img_sigverify_always_prod_end' not declared in package 'sw/device/silicon_creator/rom/e2e' defined by /nightly/current_run/opentitan/sw/device/silicon_creator/rom/e2e/BUILD
ERROR: Build did NOT complete successfully
_run_cmd -> had a non-zero return code of 1.
make: *** [/nightly/current_run/opentitan/hw/dv/tools/dvsim/sim.mk:58: sw_build] Error 1
rom_e2e_sigverify_always_a_nothing_b_bad_rma 18542012166898584665792639465139709720330353227793460303861944146405899197406 None
---- STDOUT ----
---- STDERR ----
WARNING: Target pattern parsing failed.
ERROR: Skipping '//sw/device/silicon_creator/rom/e2e:otp_img_sigverify_always_rma': no such target '//sw/device/silicon_creator/rom/e2e:otp_img_sigverify_always_rma': target 'otp_img_sigverify_always_rma' not declared in package 'sw/device/silicon_creator/rom/e2e' defined by /nightly/current_run/opentitan/sw/device/silicon_creator/rom/e2e/BUILD
ERROR: no such target '//sw/device/silicon_creator/rom/e2e:otp_img_sigverify_always_rma': target 'otp_img_sigverify_always_rma' not declared in package 'sw/device/silicon_creator/rom/e2e' defined by /nightly/current_run/opentitan/sw/device/silicon_creator/rom/e2e/BUILD
ERROR: Build did NOT complete successfully
_run_cmd -> had a non-zero return code of 1.
make: *** [/nightly/current_run/opentitan/hw/dv/tools/dvsim/sim.mk:58: sw_build] Error 1
rom_e2e_asm_init_test_unlocked0 74847578646777781478416229451247271267059265882311429714043519474676778526509 None
---- STDERR ----
Another command (pid=284400) is running. Waiting for it to complete on the server (server_pid=202285)...
WARNING: Target pattern parsing failed.
ERROR: Skipping '//sw/device/silicon_creator/rom/e2e:empty_test_slot_a_sim_dv': no such target '//sw/device/silicon_creator/rom/e2e:empty_test_slot_a_sim_dv': target 'empty_test_slot_a_sim_dv' not declared in package 'sw/device/silicon_creator/rom/e2e' defined by /nightly/current_run/opentitan/sw/device/silicon_creator/rom/e2e/BUILD
ERROR: no such target '//sw/device/silicon_creator/rom/e2e:empty_test_slot_a_sim_dv': target 'empty_test_slot_a_sim_dv' not declared in package 'sw/device/silicon_creator/rom/e2e' defined by /nightly/current_run/opentitan/sw/device/silicon_creator/rom/e2e/BUILD
ERROR: Build did NOT complete successfully
_run_cmd -> had a non-zero return code of 1.
make: *** [/nightly/current_run/opentitan/hw/dv/tools/dvsim/sim.mk:58: sw_build] Error 1
rom_e2e_asm_init_dev 51312236148458020268000893683381860981613625183060044562181469574009937172336 None
---- STDERR ----
Another command (pid=518771) is running. Waiting for it to complete on the server (server_pid=202285)...
WARNING: Target pattern parsing failed.
ERROR: Skipping '//sw/device/silicon_creator/rom/e2e:empty_test_slot_a_sim_dv': no such target '//sw/device/silicon_creator/rom/e2e:empty_test_slot_a_sim_dv': target 'empty_test_slot_a_sim_dv' not declared in package 'sw/device/silicon_creator/rom/e2e' defined by /nightly/current_run/opentitan/sw/device/silicon_creator/rom/e2e/BUILD
ERROR: no such target '//sw/device/silicon_creator/rom/e2e:empty_test_slot_a_sim_dv': target 'empty_test_slot_a_sim_dv' not declared in package 'sw/device/silicon_creator/rom/e2e' defined by /nightly/current_run/opentitan/sw/device/silicon_creator/rom/e2e/BUILD
ERROR: Build did NOT complete successfully
_run_cmd -> had a non-zero return code of 1.
make: *** [/nightly/current_run/opentitan/hw/dv/tools/dvsim/sim.mk:58: sw_build] Error 1
rom_e2e_asm_init_prod 5618668503761869325400253242700158868982147683830353668097597929082370027199 None
---- STDOUT ----
---- STDERR ----
WARNING: Target pattern parsing failed.
ERROR: Skipping '//sw/device/silicon_creator/rom/e2e:empty_test_slot_a_sim_dv': no such target '//sw/device/silicon_creator/rom/e2e:empty_test_slot_a_sim_dv': target 'empty_test_slot_a_sim_dv' not declared in package 'sw/device/silicon_creator/rom/e2e' defined by /nightly/current_run/opentitan/sw/device/silicon_creator/rom/e2e/BUILD
ERROR: no such target '//sw/device/silicon_creator/rom/e2e:empty_test_slot_a_sim_dv': target 'empty_test_slot_a_sim_dv' not declared in package 'sw/device/silicon_creator/rom/e2e' defined by /nightly/current_run/opentitan/sw/device/silicon_creator/rom/e2e/BUILD
ERROR: Build did NOT complete successfully
_run_cmd -> had a non-zero return code of 1.
make: *** [/nightly/current_run/opentitan/hw/dv/tools/dvsim/sim.mk:58: sw_build] Error 1
rom_e2e_asm_init_prod_end 86171914230322790920118050765843833342250800373433771435606955198581415959579 None
---- STDERR ----
Another command (pid=523057) is running. Waiting for it to complete on the server (server_pid=202285)...
WARNING: Target pattern parsing failed.
ERROR: Skipping '//sw/device/silicon_creator/rom/e2e:empty_test_slot_a_sim_dv': no such target '//sw/device/silicon_creator/rom/e2e:empty_test_slot_a_sim_dv': target 'empty_test_slot_a_sim_dv' not declared in package 'sw/device/silicon_creator/rom/e2e' defined by /nightly/current_run/opentitan/sw/device/silicon_creator/rom/e2e/BUILD
ERROR: no such target '//sw/device/silicon_creator/rom/e2e:empty_test_slot_a_sim_dv': target 'empty_test_slot_a_sim_dv' not declared in package 'sw/device/silicon_creator/rom/e2e' defined by /nightly/current_run/opentitan/sw/device/silicon_creator/rom/e2e/BUILD
ERROR: Build did NOT complete successfully
_run_cmd -> had a non-zero return code of 1.
make: *** [/nightly/current_run/opentitan/hw/dv/tools/dvsim/sim.mk:58: sw_build] Error 1
rom_e2e_asm_init_rma 98625716843854212549511387447462002597794827874629865683250563877765660386158 None
---- STDOUT ----
---- STDERR ----
WARNING: Target pattern parsing failed.
ERROR: Skipping '//sw/device/silicon_creator/rom/e2e:empty_test_slot_a_sim_dv': no such target '//sw/device/silicon_creator/rom/e2e:empty_test_slot_a_sim_dv': target 'empty_test_slot_a_sim_dv' not declared in package 'sw/device/silicon_creator/rom/e2e' defined by /nightly/current_run/opentitan/sw/device/silicon_creator/rom/e2e/BUILD
ERROR: no such target '//sw/device/silicon_creator/rom/e2e:empty_test_slot_a_sim_dv': target 'empty_test_slot_a_sim_dv' not declared in package 'sw/device/silicon_creator/rom/e2e' defined by /nightly/current_run/opentitan/sw/device/silicon_creator/rom/e2e/BUILD
ERROR: Build did NOT complete successfully
_run_cmd -> had a non-zero return code of 1.
make: *** [/nightly/current_run/opentitan/hw/dv/tools/dvsim/sim.mk:58: sw_build] Error 1
rom_e2e_jtag_debug_test_unlocked0 46648663417523254738068983549012471085717187070504039552244605951126563510342 None
---- STDERR ----
Another command (pid=546590) is running. Waiting for it to complete on the server (server_pid=202285)...
Another command (pid=539112) is running. Waiting for it to complete on the server (server_pid=202285)...
WARNING: Target pattern parsing failed.
ERROR: Skipping '//sw/device/silicon_creator/rom/e2e:img_test_unlocked0_exec_disabled': no such target '//sw/device/silicon_creator/rom/e2e:img_test_unlocked0_exec_disabled': target 'img_test_unlocked0_exec_disabled' not declared in package 'sw/device/silicon_creator/rom/e2e' defined by /nightly/current_run/opentitan/sw/device/silicon_creator/rom/e2e/BUILD
ERROR: no such target '//sw/device/silicon_creator/rom/e2e:img_test_unlocked0_exec_disabled': target 'img_test_unlocked0_exec_disabled' not declared in package 'sw/device/silicon_creator/rom/e2e' defined by /nightly/current_run/opentitan/sw/device/silicon_creator/rom/e2e/BUILD
ERROR: Build did NOT complete successfully
_run_cmd -> had a non-zero return code of 1.
make: *** [/nightly/current_run/opentitan/hw/dv/tools/dvsim/sim.mk:58: sw_build] Error 1
rom_e2e_jtag_debug_dev 5633050603946440782240171870755123439939020783876761451944073715294801368783 None
Another command (pid=550202) is running. Waiting for it to complete on the server (server_pid=202285)...
Another command (pid=543394) is running. Waiting for it to complete on the server (server_pid=202285)...
Another command (pid=542228) is running. Waiting for it to complete on the server (server_pid=202285)...
WARNING: Target pattern parsing failed.
ERROR: Skipping '//sw/device/silicon_creator/rom/e2e:img_dev_exec_disabled': no such target '//sw/device/silicon_creator/rom/e2e:img_dev_exec_disabled': target 'img_dev_exec_disabled' not declared in package 'sw/device/silicon_creator/rom/e2e' defined by /nightly/current_run/opentitan/sw/device/silicon_creator/rom/e2e/BUILD
ERROR: no such target '//sw/device/silicon_creator/rom/e2e:img_dev_exec_disabled': target 'img_dev_exec_disabled' not declared in package 'sw/device/silicon_creator/rom/e2e' defined by /nightly/current_run/opentitan/sw/device/silicon_creator/rom/e2e/BUILD
ERROR: Build did NOT complete successfully
_run_cmd -> had a non-zero return code of 1.
make: *** [/nightly/current_run/opentitan/hw/dv/tools/dvsim/sim.mk:58: sw_build] Error 1
rom_e2e_jtag_debug_rma 113504896427915082711526115101506954164805998505249456087288692720279631136973 None
---- STDERR ----
Another command (pid=546590) is running. Waiting for it to complete on the server (server_pid=202285)...
Another command (pid=539112) is running. Waiting for it to complete on the server (server_pid=202285)...
WARNING: Target pattern parsing failed.
ERROR: Skipping '//sw/device/silicon_creator/rom/e2e:img_rma_exec_disabled': no such target '//sw/device/silicon_creator/rom/e2e:img_rma_exec_disabled': target 'img_rma_exec_disabled' not declared in package 'sw/device/silicon_creator/rom/e2e' defined by /nightly/current_run/opentitan/sw/device/silicon_creator/rom/e2e/BUILD
ERROR: no such target '//sw/device/silicon_creator/rom/e2e:img_rma_exec_disabled': target 'img_rma_exec_disabled' not declared in package 'sw/device/silicon_creator/rom/e2e' defined by /nightly/current_run/opentitan/sw/device/silicon_creator/rom/e2e/BUILD
ERROR: Build did NOT complete successfully
_run_cmd -> had a non-zero return code of 1.
make: *** [/nightly/current_run/opentitan/hw/dv/tools/dvsim/sim.mk:58: sw_build] Error 1
rom_e2e_jtag_inject_test_unlocked0 61365095646649778831432872716502730386851542165687436753196863733586346986275 None
Another command (pid=489238) is running. Waiting for it to complete on the server (server_pid=202285)...
Another command (pid=491617) is running. Waiting for it to complete on the server (server_pid=202285)...
Another command (pid=491002) is running. Waiting for it to complete on the server (server_pid=202285)...
WARNING: Target pattern parsing failed.
ERROR: Skipping '//sw/device/silicon_creator/rom/e2e:img_dev_exec_disabled': no such target '//sw/device/silicon_creator/rom/e2e:img_dev_exec_disabled': target 'img_dev_exec_disabled' not declared in package 'sw/device/silicon_creator/rom/e2e' defined by /nightly/current_run/opentitan/sw/device/silicon_creator/rom/e2e/BUILD
ERROR: no such target '//sw/device/silicon_creator/rom/e2e:img_dev_exec_disabled': target 'img_dev_exec_disabled' not declared in package 'sw/device/silicon_creator/rom/e2e' defined by /nightly/current_run/opentitan/sw/device/silicon_creator/rom/e2e/BUILD
ERROR: Build did NOT complete successfully
_run_cmd -> had a non-zero return code of 1.
make: *** [/nightly/current_run/opentitan/hw/dv/tools/dvsim/sim.mk:58: sw_build] Error 1
rom_e2e_jtag_inject_dev 48315624261562897519730361154822539920004534039424069579641398280909839812979 None
Another command (pid=489238) is running. Waiting for it to complete on the server (server_pid=202285)...
Another command (pid=491617) is running. Waiting for it to complete on the server (server_pid=202285)...
Another command (pid=490244) is running. Waiting for it to complete on the server (server_pid=202285)...
WARNING: Target pattern parsing failed.
ERROR: Skipping '//sw/device/silicon_creator/rom/e2e:img_dev_exec_disabled': no such target '//sw/device/silicon_creator/rom/e2e:img_dev_exec_disabled': target 'img_dev_exec_disabled' not declared in package 'sw/device/silicon_creator/rom/e2e' defined by /nightly/current_run/opentitan/sw/device/silicon_creator/rom/e2e/BUILD
ERROR: no such target '//sw/device/silicon_creator/rom/e2e:img_dev_exec_disabled': target 'img_dev_exec_disabled' not declared in package 'sw/device/silicon_creator/rom/e2e' defined by /nightly/current_run/opentitan/sw/device/silicon_creator/rom/e2e/BUILD
ERROR: Build did NOT complete successfully
_run_cmd -> had a non-zero return code of 1.
make: *** [/nightly/current_run/opentitan/hw/dv/tools/dvsim/sim.mk:58: sw_build] Error 1
rom_e2e_jtag_inject_rma 81282435311808690608591177609791699860711285810003818678311083246979411657157 None
Another command (pid=509108) is running. Waiting for it to complete on the server (server_pid=202285)...
Another command (pid=511304) is running. Waiting for it to complete on the server (server_pid=202285)...
Another command (pid=512422) is running. Waiting for it to complete on the server (server_pid=202285)...
WARNING: Target pattern parsing failed.
ERROR: Skipping '//sw/device/silicon_creator/rom/e2e:img_dev_exec_disabled': no such target '//sw/device/silicon_creator/rom/e2e:img_dev_exec_disabled': target 'img_dev_exec_disabled' not declared in package 'sw/device/silicon_creator/rom/e2e' defined by /nightly/current_run/opentitan/sw/device/silicon_creator/rom/e2e/BUILD
ERROR: no such target '//sw/device/silicon_creator/rom/e2e:img_dev_exec_disabled': target 'img_dev_exec_disabled' not declared in package 'sw/device/silicon_creator/rom/e2e' defined by /nightly/current_run/opentitan/sw/device/silicon_creator/rom/e2e/BUILD
ERROR: Build did NOT complete successfully
_run_cmd -> had a non-zero return code of 1.
make: *** [/nightly/current_run/opentitan/hw/dv/tools/dvsim/sim.mk:58: sw_build] Error 1
rom_e2e_static_critical 68181681470493541159304937943098484838753714269801593891582131646981406392824 None
---- STDOUT ----
---- STDERR ----
WARNING: Target pattern parsing failed.
ERROR: Skipping '//sw/device/silicon_creator/rom:rom_with_fake_keys_sim_dv': no such target '//sw/device/silicon_creator/rom:rom_with_fake_keys_sim_dv': target 'rom_with_fake_keys_sim_dv' not declared in package 'sw/device/silicon_creator/rom' defined by /nightly/current_run/opentitan/sw/device/silicon_creator/rom/BUILD
ERROR: no such target '//sw/device/silicon_creator/rom:rom_with_fake_keys_sim_dv': target 'rom_with_fake_keys_sim_dv' not declared in package 'sw/device/silicon_creator/rom' defined by /nightly/current_run/opentitan/sw/device/silicon_creator/rom/BUILD
ERROR: Build did NOT complete successfully
_run_cmd -> had a non-zero return code of 1.
make: *** [/nightly/current_run/opentitan/hw/dv/tools/dvsim/sim.mk:58: sw_build] Error 1
rom_e2e_keymgr_init_rom_ext_meas 8377311212662142449158822512926351287085521460176666348624709654539589816651 None
Another command (pid=579581) is running. Waiting for it to complete on the server (server_pid=202285)...
Another command (pid=576896) is running. Waiting for it to complete on the server (server_pid=202285)...
Another command (pid=583149) is running. Waiting for it to complete on the server (server_pid=202285)...
WARNING: Target pattern parsing failed.
ERROR: Skipping '//sw/device/silicon_creator/rom/e2e:rom_e2e_keymgr_init_test_sim_dv': no such target '//sw/device/silicon_creator/rom/e2e:rom_e2e_keymgr_init_test_sim_dv': target 'rom_e2e_keymgr_init_test_sim_dv' not declared in package 'sw/device/silicon_creator/rom/e2e' defined by /nightly/current_run/opentitan/sw/device/silicon_creator/rom/e2e/BUILD
ERROR: no such target '//sw/device/silicon_creator/rom/e2e:rom_e2e_keymgr_init_test_sim_dv': target 'rom_e2e_keymgr_init_test_sim_dv' not declared in package 'sw/device/silicon_creator/rom/e2e' defined by /nightly/current_run/opentitan/sw/device/silicon_creator/rom/e2e/BUILD
ERROR: Build did NOT complete successfully
_run_cmd -> had a non-zero return code of 1.
make: *** [/nightly/current_run/opentitan/hw/dv/tools/dvsim/sim.mk:58: sw_build] Error 1
rom_e2e_keymgr_init_rom_ext_no_meas 45271655205325562228995339561739903826675761278485428254760257547925134672172 None
---- STDERR ----
Another command (pid=559384) is running. Waiting for it to complete on the server (server_pid=202285)...
WARNING: Target pattern parsing failed.
ERROR: Skipping '//sw/device/silicon_creator/rom/e2e:rom_e2e_keymgr_init_test_sim_dv': no such target '//sw/device/silicon_creator/rom/e2e:rom_e2e_keymgr_init_test_sim_dv': target 'rom_e2e_keymgr_init_test_sim_dv' not declared in package 'sw/device/silicon_creator/rom/e2e' defined by /nightly/current_run/opentitan/sw/device/silicon_creator/rom/e2e/BUILD
ERROR: no such target '//sw/device/silicon_creator/rom/e2e:rom_e2e_keymgr_init_test_sim_dv': target 'rom_e2e_keymgr_init_test_sim_dv' not declared in package 'sw/device/silicon_creator/rom/e2e' defined by /nightly/current_run/opentitan/sw/device/silicon_creator/rom/e2e/BUILD
ERROR: Build did NOT complete successfully
_run_cmd -> had a non-zero return code of 1.
make: *** [/nightly/current_run/opentitan/hw/dv/tools/dvsim/sim.mk:58: sw_build] Error 1
rom_e2e_keymgr_init_rom_ext_invalid_meas 22419863006670769302664178703031221797495281632820037483280450494376981213189 None
Another command (pid=546590) is running. Waiting for it to complete on the server (server_pid=202285)...
Another command (pid=539112) is running. Waiting for it to complete on the server (server_pid=202285)...
Another command (pid=537755) is running. Waiting for it to complete on the server (server_pid=202285)...
WARNING: Target pattern parsing failed.
ERROR: Skipping '//sw/device/silicon_creator/rom/e2e:rom_e2e_keymgr_init_test_sim_dv': no such target '//sw/device/silicon_creator/rom/e2e:rom_e2e_keymgr_init_test_sim_dv': target 'rom_e2e_keymgr_init_test_sim_dv' not declared in package 'sw/device/silicon_creator/rom/e2e' defined by /nightly/current_run/opentitan/sw/device/silicon_creator/rom/e2e/BUILD
ERROR: no such target '//sw/device/silicon_creator/rom/e2e:rom_e2e_keymgr_init_test_sim_dv': target 'rom_e2e_keymgr_init_test_sim_dv' not declared in package 'sw/device/silicon_creator/rom/e2e' defined by /nightly/current_run/opentitan/sw/device/silicon_creator/rom/e2e/BUILD
ERROR: Build did NOT complete successfully
_run_cmd -> had a non-zero return code of 1.
make: *** [/nightly/current_run/opentitan/hw/dv/tools/dvsim/sim.mk:58: sw_build] Error 1
rom_e2e_sigverify_mod_exp_test_unlocked0_otbn 79084718815465271424394115092876487377879116551907100800934821872023687804539 None
Another command (pid=303512) is running. Waiting for it to complete on the server (server_pid=202285)...
Another command (pid=312717) is running. Waiting for it to complete on the server (server_pid=202285)...
Another command (pid=329684) is running. Waiting for it to complete on the server (server_pid=202285)...
WARNING: Target pattern parsing failed.
ERROR: Skipping '//sw/device/silicon_creator/rom/e2e:empty_test_sigverify_mod_exp_sim_dv': no such target '//sw/device/silicon_creator/rom/e2e:empty_test_sigverify_mod_exp_sim_dv': target 'empty_test_sigverify_mod_exp_sim_dv' not declared in package 'sw/device/silicon_creator/rom/e2e' defined by /nightly/current_run/opentitan/sw/device/silicon_creator/rom/e2e/BUILD
ERROR: no such target '//sw/device/silicon_creator/rom/e2e:empty_test_sigverify_mod_exp_sim_dv': target 'empty_test_sigverify_mod_exp_sim_dv' not declared in package 'sw/device/silicon_creator/rom/e2e' defined by /nightly/current_run/opentitan/sw/device/silicon_creator/rom/e2e/BUILD
ERROR: Build did NOT complete successfully
_run_cmd -> had a non-zero return code of 1.
make: *** [/nightly/current_run/opentitan/hw/dv/tools/dvsim/sim.mk:58: sw_build] Error 1
rom_e2e_sigverify_mod_exp_test_unlocked0_sw 45680224511114260800288959451272722041287229689921411203020225686440934833938 None
Another command (pid=408074) is running. Waiting for it to complete on the server (server_pid=202285)...
Another command (pid=461236) is running. Waiting for it to complete on the server (server_pid=202285)...
Another command (pid=471132) is running. Waiting for it to complete on the server (server_pid=202285)...
WARNING: Target pattern parsing failed.
ERROR: Skipping '//sw/device/silicon_creator/rom/e2e:empty_test_sigverify_mod_exp_sim_dv': no such target '//sw/device/silicon_creator/rom/e2e:empty_test_sigverify_mod_exp_sim_dv': target 'empty_test_sigverify_mod_exp_sim_dv' not declared in package 'sw/device/silicon_creator/rom/e2e' defined by /nightly/current_run/opentitan/sw/device/silicon_creator/rom/e2e/BUILD
ERROR: no such target '//sw/device/silicon_creator/rom/e2e:empty_test_sigverify_mod_exp_sim_dv': target 'empty_test_sigverify_mod_exp_sim_dv' not declared in package 'sw/device/silicon_creator/rom/e2e' defined by /nightly/current_run/opentitan/sw/device/silicon_creator/rom/e2e/BUILD
ERROR: Build did NOT complete successfully
_run_cmd -> had a non-zero return code of 1.
make: *** [/nightly/current_run/opentitan/hw/dv/tools/dvsim/sim.mk:58: sw_build] Error 1
rom_e2e_sigverify_mod_exp_dev_otbn 12086846798047366364927542278821244305501715438464633854722665918584973982160 None
---- STDOUT ----
---- STDERR ----
WARNING: Target pattern parsing failed.
ERROR: Skipping '//sw/device/silicon_creator/rom/e2e:empty_test_sigverify_mod_exp_sim_dv': no such target '//sw/device/silicon_creator/rom/e2e:empty_test_sigverify_mod_exp_sim_dv': target 'empty_test_sigverify_mod_exp_sim_dv' not declared in package 'sw/device/silicon_creator/rom/e2e' defined by /nightly/current_run/opentitan/sw/device/silicon_creator/rom/e2e/BUILD
ERROR: no such target '//sw/device/silicon_creator/rom/e2e:empty_test_sigverify_mod_exp_sim_dv': target 'empty_test_sigverify_mod_exp_sim_dv' not declared in package 'sw/device/silicon_creator/rom/e2e' defined by /nightly/current_run/opentitan/sw/device/silicon_creator/rom/e2e/BUILD
ERROR: Build did NOT complete successfully
_run_cmd -> had a non-zero return code of 1.
make: *** [/nightly/current_run/opentitan/hw/dv/tools/dvsim/sim.mk:58: sw_build] Error 1
rom_e2e_sigverify_mod_exp_dev_sw 62321534065130713787436770028443705278917678186990198500348291229563482316696 None
---- STDOUT ----
---- STDERR ----
WARNING: Target pattern parsing failed.
ERROR: Skipping '//sw/device/silicon_creator/rom/e2e:empty_test_sigverify_mod_exp_sim_dv': no such target '//sw/device/silicon_creator/rom/e2e:empty_test_sigverify_mod_exp_sim_dv': target 'empty_test_sigverify_mod_exp_sim_dv' not declared in package 'sw/device/silicon_creator/rom/e2e' defined by /nightly/current_run/opentitan/sw/device/silicon_creator/rom/e2e/BUILD
ERROR: no such target '//sw/device/silicon_creator/rom/e2e:empty_test_sigverify_mod_exp_sim_dv': target 'empty_test_sigverify_mod_exp_sim_dv' not declared in package 'sw/device/silicon_creator/rom/e2e' defined by /nightly/current_run/opentitan/sw/device/silicon_creator/rom/e2e/BUILD
ERROR: Build did NOT complete successfully
_run_cmd -> had a non-zero return code of 1.
make: *** [/nightly/current_run/opentitan/hw/dv/tools/dvsim/sim.mk:58: sw_build] Error 1
rom_e2e_sigverify_mod_exp_prod_otbn 104483065131732494095334310834966362462771237894177535231827496362915052671698 None
---- STDOUT ----
---- STDERR ----
WARNING: Target pattern parsing failed.
ERROR: Skipping '//sw/device/silicon_creator/rom/e2e:empty_test_sigverify_mod_exp_sim_dv': no such target '//sw/device/silicon_creator/rom/e2e:empty_test_sigverify_mod_exp_sim_dv': target 'empty_test_sigverify_mod_exp_sim_dv' not declared in package 'sw/device/silicon_creator/rom/e2e' defined by /nightly/current_run/opentitan/sw/device/silicon_creator/rom/e2e/BUILD
ERROR: no such target '//sw/device/silicon_creator/rom/e2e:empty_test_sigverify_mod_exp_sim_dv': target 'empty_test_sigverify_mod_exp_sim_dv' not declared in package 'sw/device/silicon_creator/rom/e2e' defined by /nightly/current_run/opentitan/sw/device/silicon_creator/rom/e2e/BUILD
ERROR: Build did NOT complete successfully
_run_cmd -> had a non-zero return code of 1.
make: *** [/nightly/current_run/opentitan/hw/dv/tools/dvsim/sim.mk:58: sw_build] Error 1
rom_e2e_sigverify_mod_exp_prod_sw 53060559191748561696636966596092435887829860240314747241198609799067294497312 None
---- STDOUT ----
---- STDERR ----
WARNING: Target pattern parsing failed.
ERROR: Skipping '//sw/device/silicon_creator/rom/e2e:empty_test_sigverify_mod_exp_sim_dv': no such target '//sw/device/silicon_creator/rom/e2e:empty_test_sigverify_mod_exp_sim_dv': target 'empty_test_sigverify_mod_exp_sim_dv' not declared in package 'sw/device/silicon_creator/rom/e2e' defined by /nightly/current_run/opentitan/sw/device/silicon_creator/rom/e2e/BUILD
ERROR: no such target '//sw/device/silicon_creator/rom/e2e:empty_test_sigverify_mod_exp_sim_dv': target 'empty_test_sigverify_mod_exp_sim_dv' not declared in package 'sw/device/silicon_creator/rom/e2e' defined by /nightly/current_run/opentitan/sw/device/silicon_creator/rom/e2e/BUILD
ERROR: Build did NOT complete successfully
_run_cmd -> had a non-zero return code of 1.
make: *** [/nightly/current_run/opentitan/hw/dv/tools/dvsim/sim.mk:58: sw_build] Error 1
rom_e2e_sigverify_mod_exp_prod_end_otbn 48296281121647451808380706394809713437311443525010041484012982105174067924614 None
---- STDERR ----
Another command (pid=632491) is running. Waiting for it to complete on the server (server_pid=202285)...
WARNING: Target pattern parsing failed.
ERROR: Skipping '//sw/device/silicon_creator/rom/e2e:empty_test_sigverify_mod_exp_sim_dv': no such target '//sw/device/silicon_creator/rom/e2e:empty_test_sigverify_mod_exp_sim_dv': target 'empty_test_sigverify_mod_exp_sim_dv' not declared in package 'sw/device/silicon_creator/rom/e2e' defined by /nightly/current_run/opentitan/sw/device/silicon_creator/rom/e2e/BUILD
ERROR: no such target '//sw/device/silicon_creator/rom/e2e:empty_test_sigverify_mod_exp_sim_dv': target 'empty_test_sigverify_mod_exp_sim_dv' not declared in package 'sw/device/silicon_creator/rom/e2e' defined by /nightly/current_run/opentitan/sw/device/silicon_creator/rom/e2e/BUILD
ERROR: Build did NOT complete successfully
_run_cmd -> had a non-zero return code of 1.
make: *** [/nightly/current_run/opentitan/hw/dv/tools/dvsim/sim.mk:58: sw_build] Error 1
rom_e2e_sigverify_mod_exp_prod_end_sw 98353412077539014641553905200567696458696084451759729573616112282076258064612 None
---- STDOUT ----
---- STDERR ----
WARNING: Target pattern parsing failed.
ERROR: Skipping '//sw/device/silicon_creator/rom/e2e:empty_test_sigverify_mod_exp_sim_dv': no such target '//sw/device/silicon_creator/rom/e2e:empty_test_sigverify_mod_exp_sim_dv': target 'empty_test_sigverify_mod_exp_sim_dv' not declared in package 'sw/device/silicon_creator/rom/e2e' defined by /nightly/current_run/opentitan/sw/device/silicon_creator/rom/e2e/BUILD
ERROR: no such target '//sw/device/silicon_creator/rom/e2e:empty_test_sigverify_mod_exp_sim_dv': target 'empty_test_sigverify_mod_exp_sim_dv' not declared in package 'sw/device/silicon_creator/rom/e2e' defined by /nightly/current_run/opentitan/sw/device/silicon_creator/rom/e2e/BUILD
ERROR: Build did NOT complete successfully
_run_cmd -> had a non-zero return code of 1.
make: *** [/nightly/current_run/opentitan/hw/dv/tools/dvsim/sim.mk:58: sw_build] Error 1
rom_e2e_sigverify_mod_exp_rma_otbn 89964843289226069594862065444176935814126536440325036664101571989852363870913 None
---- STDOUT ----
---- STDERR ----
WARNING: Target pattern parsing failed.
ERROR: Skipping '//sw/device/silicon_creator/rom/e2e:empty_test_sigverify_mod_exp_sim_dv': no such target '//sw/device/silicon_creator/rom/e2e:empty_test_sigverify_mod_exp_sim_dv': target 'empty_test_sigverify_mod_exp_sim_dv' not declared in package 'sw/device/silicon_creator/rom/e2e' defined by /nightly/current_run/opentitan/sw/device/silicon_creator/rom/e2e/BUILD
ERROR: no such target '//sw/device/silicon_creator/rom/e2e:empty_test_sigverify_mod_exp_sim_dv': target 'empty_test_sigverify_mod_exp_sim_dv' not declared in package 'sw/device/silicon_creator/rom/e2e' defined by /nightly/current_run/opentitan/sw/device/silicon_creator/rom/e2e/BUILD
ERROR: Build did NOT complete successfully
_run_cmd -> had a non-zero return code of 1.
make: *** [/nightly/current_run/opentitan/hw/dv/tools/dvsim/sim.mk:58: sw_build] Error 1
rom_e2e_sigverify_mod_exp_rma_sw 85401284883830925972136877613426485654656144590504377759449969763829523101430 None
---- STDOUT ----
---- STDERR ----
WARNING: Target pattern parsing failed.
ERROR: Skipping '//sw/device/silicon_creator/rom/e2e:empty_test_sigverify_mod_exp_sim_dv': no such target '//sw/device/silicon_creator/rom/e2e:empty_test_sigverify_mod_exp_sim_dv': target 'empty_test_sigverify_mod_exp_sim_dv' not declared in package 'sw/device/silicon_creator/rom/e2e' defined by /nightly/current_run/opentitan/sw/device/silicon_creator/rom/e2e/BUILD
ERROR: no such target '//sw/device/silicon_creator/rom/e2e:empty_test_sigverify_mod_exp_sim_dv': target 'empty_test_sigverify_mod_exp_sim_dv' not declared in package 'sw/device/silicon_creator/rom/e2e' defined by /nightly/current_run/opentitan/sw/device/silicon_creator/rom/e2e/BUILD
ERROR: Build did NOT complete successfully
_run_cmd -> had a non-zero return code of 1.
make: *** [/nightly/current_run/opentitan/hw/dv/tools/dvsim/sim.mk:58: sw_build] Error 1
rom_volatile_raw_unlock 2022958576306468217298645403159804078987631975097466530301822877147325950864 None
Another command (pid=475909) is running. Waiting for it to complete on the server (server_pid=202285)...
Another command (pid=451406) is running. Waiting for it to complete on the server (server_pid=202285)...
Another command (pid=449483) is running. Waiting for it to complete on the server (server_pid=202285)...
WARNING: Target pattern parsing failed.
ERROR: Skipping '//sw/device/silicon_creator/rom/e2e:empty_test_slot_a_sim_dv': no such target '//sw/device/silicon_creator/rom/e2e:empty_test_slot_a_sim_dv': target 'empty_test_slot_a_sim_dv' not declared in package 'sw/device/silicon_creator/rom/e2e' defined by /nightly/current_run/opentitan/sw/device/silicon_creator/rom/e2e/BUILD
ERROR: no such target '//sw/device/silicon_creator/rom/e2e:empty_test_slot_a_sim_dv': target 'empty_test_slot_a_sim_dv' not declared in package 'sw/device/silicon_creator/rom/e2e' defined by /nightly/current_run/opentitan/sw/device/silicon_creator/rom/e2e/BUILD
ERROR: Build did NOT complete successfully
_run_cmd -> had a non-zero return code of 1.
make: *** [/nightly/current_run/opentitan/hw/dv/tools/dvsim/sim.mk:58: sw_build] Error 1
rom_raw_unlock 83986181042831988209017907215664049895843077107668905272489866444992623855881 None
Another command (pid=284400) is running. Waiting for it to complete on the server (server_pid=202285)...
Another command (pid=303512) is running. Waiting for it to complete on the server (server_pid=202285)...
Another command (pid=312717) is running. Waiting for it to complete on the server (server_pid=202285)...
WARNING: Target pattern parsing failed.
ERROR: Skipping '//sw/device/silicon_creator/rom/e2e:empty_test_slot_a_sim_dv': no such target '//sw/device/silicon_creator/rom/e2e:empty_test_slot_a_sim_dv': target 'empty_test_slot_a_sim_dv' not declared in package 'sw/device/silicon_creator/rom/e2e' defined by /nightly/current_run/opentitan/sw/device/silicon_creator/rom/e2e/BUILD
ERROR: no such target '//sw/device/silicon_creator/rom/e2e:empty_test_slot_a_sim_dv': target 'empty_test_slot_a_sim_dv' not declared in package 'sw/device/silicon_creator/rom/e2e' defined by /nightly/current_run/opentitan/sw/device/silicon_creator/rom/e2e/BUILD
ERROR: Build did NOT complete successfully
_run_cmd -> had a non-zero return code of 1.
make: *** [/nightly/current_run/opentitan/hw/dv/tools/dvsim/sim.mk:58: sw_build] Error 1
rom_e2e_self_hash 60304153754654832976878569755405373818325288111711839747801997665782933215835 None
---- STDERR ----
Another command (pid=350460) is running. Waiting for it to complete on the server (server_pid=202285)...
WARNING: Target pattern parsing failed.
ERROR: Skipping '//sw/device/silicon_creator/rom/e2e:otp_img_sigverify_mod_exp_rma_otbn': no such target '//sw/device/silicon_creator/rom/e2e:otp_img_sigverify_mod_exp_rma_otbn': target 'otp_img_sigverify_mod_exp_rma_otbn' not declared in package 'sw/device/silicon_creator/rom/e2e' defined by /nightly/current_run/opentitan/sw/device/silicon_creator/rom/e2e/BUILD
ERROR: no such target '//sw/device/silicon_creator/rom/e2e:otp_img_sigverify_mod_exp_rma_otbn': target 'otp_img_sigverify_mod_exp_rma_otbn' not declared in package 'sw/device/silicon_creator/rom/e2e' defined by /nightly/current_run/opentitan/sw/device/silicon_creator/rom/e2e/BUILD
ERROR: Build did NOT complete successfully
_run_cmd -> had a non-zero return code of 1.
make: *** [/nightly/current_run/opentitan/hw/dv/tools/dvsim/sim.mk:58: sw_build] Error 1
chip_sw_uart_smoketest_signed 86792352775491119897718924106822566057353410183636513287880012221214824435075 None
---- STDERR ----
Another command (pid=518771) is running. Waiting for it to complete on the server (server_pid=202285)...
WARNING: Target pattern parsing failed.
ERROR: Skipping '//sw/device/tests:uart_smoketest_signed_sim_dv': no such target '//sw/device/tests:uart_smoketest_signed_sim_dv': target 'uart_smoketest_signed_sim_dv' not declared in package 'sw/device/tests' defined by /nightly/current_run/opentitan/sw/device/tests/BUILD
ERROR: no such target '//sw/device/tests:uart_smoketest_signed_sim_dv': target 'uart_smoketest_signed_sim_dv' not declared in package 'sw/device/tests' defined by /nightly/current_run/opentitan/sw/device/tests/BUILD
ERROR: Build did NOT complete successfully
_run_cmd -> had a non-zero return code of 1.
make: *** [/nightly/current_run/opentitan/hw/dv/tools/dvsim/sim.mk:58: sw_build] Error 1
rom_keymgr_functest 10099413195228666444978307733573514019816217957929191457625886761468234848784 None
Use --verbose_failures to see the command lines of failed build steps.
ERROR: Analysis of target '//sw/device/silicon_creator/lib/drivers:keymgr_functest_sim_dv' failed; build aborted: Target //sw/device/silicon_creator/lib/drivers:keymgr_functest_sim_dv is incompatible and cannot be built, but was explicitly requested.
Dependency chain:
//sw/device/silicon_creator/lib/drivers:keymgr_functest_sim_dv (f2055d) <-- target platform (//toolchain:opentitan_platform) didn't satisfy constraint @@platforms//:incompatible
INFO: Elapsed time: 0.286s, Critical Path: 0.03s
INFO: 1 process: 1 internal.
ERROR: Build did NOT complete successfully
_run_cmd -> had a non-zero return code of 1.
make: *** [/nightly/current_run/opentitan/hw/dv/tools/dvsim/sim.mk:58: sw_build] Error 1
UVM_FATAL @ * us: (dv_utils_pkg.sv:253) [dv_utils_pkg::sw_symbol_get_addr_size.unnamed$$_*] Check failed (ret) Failed to read line from "kJitterEnabled.dat" 12 test runs
chip_sw_otbn_ecdsa_op_irq_jitter_en 115251814387244755149249140338730137460601781165996085612209067442864627885988 318
UVM_INFO @ 10.320001 us: (uvm_report_catcher.svh:705) [UVM/REPORT/CATCHER]
--- UVM Report catcher Summary ---
chip_sw_aes_enc_jitter_en 13139659693093992491727237985762700075968085248651229771908679468900473137137 318
UVM_INFO @ 10.160001 us: (uvm_report_catcher.svh:705) [UVM/REPORT/CATCHER]
--- UVM Report catcher Summary ---
chip_sw_hmac_enc_jitter_en 18681775042198025430708112189898009772960507182478726142641680971519500086217 318
UVM_INFO @ 10.220001 us: (uvm_report_catcher.svh:705) [UVM/REPORT/CATCHER]
--- UVM Report catcher Summary ---
chip_sw_keymgr_dpe_key_derivation_jitter_en 112274302287238589421758392726002642037760265459221786790471567943262942582959 318
UVM_INFO @ 10.240001 us: (uvm_report_catcher.svh:705) [UVM/REPORT/CATCHER]
--- UVM Report catcher Summary ---
chip_sw_kmac_mode_kmac_jitter_en 114673599236015423790696207070397172981005222565509706315636638559356921399624 318
UVM_INFO @ 10.160001 us: (uvm_report_catcher.svh:705) [UVM/REPORT/CATCHER]
--- UVM Report catcher Summary ---
chip_sw_otbn_ecdsa_op_irq_jitter_en_reduced_freq 62399257107546457646547145060297935517830109493494447031498869859754150880124 318
UVM_INFO @ 10.240001 us: (uvm_report_catcher.svh:705) [UVM/REPORT/CATCHER]
--- UVM Report catcher Summary ---
chip_sw_aes_enc_jitter_en_reduced_freq 24451159663343400711565773415993341905266407184154754898098403022878324400044 318
UVM_INFO @ 10.120001 us: (uvm_report_catcher.svh:705) [UVM/REPORT/CATCHER]
--- UVM Report catcher Summary ---
chip_sw_hmac_enc_jitter_en_reduced_freq 100195370337167799520538457235215270367510791282925294086901349233077137571248 318
UVM_INFO @ 10.260001 us: (uvm_report_catcher.svh:705) [UVM/REPORT/CATCHER]
--- UVM Report catcher Summary ---
chip_sw_keymgr_dpe_key_derivation_jitter_en_reduced_freq 112197461836854386740210543306578839896033218032703000150834406405467233544720 318
UVM_INFO @ 10.400001 us: (uvm_report_catcher.svh:705) [UVM/REPORT/CATCHER]
--- UVM Report catcher Summary ---
chip_sw_kmac_mode_kmac_jitter_en_reduced_freq 112846311996387032202074655999949157834298349103685527154909843023854108247044 318
UVM_INFO @ 10.200001 us: (uvm_report_catcher.svh:705) [UVM/REPORT/CATCHER]
--- UVM Report catcher Summary ---
chip_sw_sram_ctrl_scrambled_access_jitter_en_reduced_freq 87614118430726786656411701684599726656760974273341073986909384911254697573927 318
UVM_INFO @ 10.340001 us: (uvm_report_catcher.svh:705) [UVM/REPORT/CATCHER]
--- UVM Report catcher Summary ---
chip_sw_csrng_edn_concurrency_reduced_freq 68243240743698151616959403475016948509993538440478816353334360306309236010776 318
UVM_INFO @ 10.120001 us: (uvm_report_catcher.svh:705) [UVM/REPORT/CATCHER]
--- UVM Report catcher Summary ---
Offending '((~rst_ni) === (~seed_en_q))' 10 test runs
chip_sw_lc_ctrl_rma_to_scrap 3268537388618673517854787854482826470494672790397308164596538563261475858099 339
UVM_ERROR @ 173.816000 us: (otbn_rnd.sv:233) [ASSERT FAILED] UrndNoReseedOnReset_A
UVM_INFO @ 173.816000 us: (uvm_report_catcher.svh:705) [UVM/REPORT/CATCHER]
--- UVM Report catcher Summary ---
chip_sw_lc_ctrl_raw_to_scrap 43109522087724282396854714121223436454739338340261530509470322960824705480557 328
UVM_ERROR @ 172.216000 us: (otbn_rnd.sv:233) [ASSERT FAILED] UrndNoReseedOnReset_A
UVM_INFO @ 172.216000 us: (uvm_report_catcher.svh:705) [UVM/REPORT/CATCHER]
--- UVM Report catcher Summary ---
chip_sw_lc_ctrl_test_locked0_to_scrap 48252539411784355421523940358526654639401029002620740893634133410610161057503 328
UVM_ERROR @ 169.000000 us: (otbn_rnd.sv:233) [ASSERT FAILED] UrndNoReseedOnReset_A
UVM_INFO @ 169.000000 us: (uvm_report_catcher.svh:705) [UVM/REPORT/CATCHER]
--- UVM Report catcher Summary ---
chip_sw_lc_ctrl_rand_to_scrap 93962267380943223426624177874795956668067450177667575118813925182574156225326 336
UVM_ERROR @ 169.096000 us: (otbn_rnd.sv:233) [ASSERT FAILED] UrndNoReseedOnReset_A
UVM_INFO @ 169.096000 us: (uvm_report_catcher.svh:705) [UVM/REPORT/CATCHER]
--- UVM Report catcher Summary ---
chip_sw_lc_ctrl_volatile_raw_unlock 102405877751769301755890146686066183968161663686604163310761336114494049788140 331
UVM_ERROR @ 348.888000 us: (otbn_rnd.sv:233) [ASSERT FAILED] UrndNoReseedOnReset_A
UVM_INFO @ 348.888000 us: (uvm_report_catcher.svh:705) [UVM/REPORT/CATCHER]
--- UVM Report catcher Summary ---
chip_sw_lc_ctrl_volatile_raw_unlock_ext_clk_48mhz 84633377807189227108909541880243145011908426918137132746494638385708870491344 334
UVM_ERROR @ 366.504000 us: (otbn_rnd.sv:233) [ASSERT FAILED] UrndNoReseedOnReset_A
UVM_INFO @ 366.504000 us: (uvm_report_catcher.svh:705) [UVM/REPORT/CATCHER]
--- UVM Report catcher Summary ---
chip_sw_pwrmgr_full_aon_reset 17983232137486985607550031582902462960775302696388900188467964983872527469355 321
UVM_ERROR @ 118.468000 us: (otbn_rnd.sv:233) [ASSERT FAILED] UrndNoReseedOnReset_A
UVM_INFO @ 118.468000 us: (uvm_report_catcher.svh:705) [UVM/REPORT/CATCHER]
--- UVM Report catcher Summary ---
chip_sw_rom_ctrl_integrity_check 109461268554734104763997765220287683369780712005825260565985770397879600347816 330
UVM_ERROR @ 157.256000 us: (otbn_rnd.sv:233) [ASSERT FAILED] UrndNoReseedOnReset_A
UVM_INFO @ 157.256000 us: (uvm_report_catcher.svh:705) [UVM/REPORT/CATCHER]
--- UVM Report catcher Summary ---
chip_prim_tl_access 42437487953690604978161019522892600015756347515206959553836872165540622806711 240
UVM_ERROR @ 118.840000 us: (otbn_rnd.sv:233) [ASSERT FAILED] UrndNoReseedOnReset_A
UVM_INFO @ 118.840000 us: (uvm_report_catcher.svh:705) [UVM/REPORT/CATCHER]
--- UVM Report catcher Summary ---
chip_rv_dm_lc_disabled 107021846137777152575566314125128849986685102129275254330974447765368263148800 223
UVM_ERROR @ 120.744000 us: (otbn_rnd.sv:233) [ASSERT FAILED] UrndNoReseedOnReset_A
UVM_INFO @ 120.744000 us: (uvm_report_catcher.svh:705) [UVM/REPORT/CATCHER]
--- UVM Report catcher Summary ---
Offending '((!rstreqs[*]) && (reset_cause != HwReq))' 5 test runs
chip_sw_rstmgr_cpu_info 50631810449692707460086533604766825613544955204125082681560703778329378981779 352
UVM_ERROR @ 412.016000 us: (pwrmgr_rstreqs_sva_if.sv:55) [ASSERT FAILED] HwResetOff_A
UVM_INFO @ 412.016000 us: (uvm_report_catcher.svh:705) [UVM/REPORT/CATCHER]
--- UVM Report catcher Summary ---
chip_sw_clkmgr_off_aes_trans 87898754901625752846925690069807112094968275042303742665361692566842918129241 329
UVM_ERROR @ 185.280000 us: (pwrmgr_rstreqs_sva_if.sv:55) [ASSERT FAILED] HwResetOff_A
UVM_INFO @ 185.280000 us: (uvm_report_catcher.svh:705) [UVM/REPORT/CATCHER]
--- UVM Report catcher Summary ---
chip_sw_clkmgr_off_hmac_trans 84947391820364991434931969897636219638765537464794283414183893038519880215276 329
UVM_ERROR @ 185.200000 us: (pwrmgr_rstreqs_sva_if.sv:55) [ASSERT FAILED] HwResetOff_A
UVM_INFO @ 185.200000 us: (uvm_report_catcher.svh:705) [UVM/REPORT/CATCHER]
--- UVM Report catcher Summary ---
chip_sw_clkmgr_off_kmac_trans 45266852048645853267130193405239451681440088967225675183896596595841400700525 329
UVM_ERROR @ 185.168000 us: (pwrmgr_rstreqs_sva_if.sv:55) [ASSERT FAILED] HwResetOff_A
UVM_INFO @ 185.168000 us: (uvm_report_catcher.svh:705) [UVM/REPORT/CATCHER]
--- UVM Report catcher Summary ---
chip_sw_clkmgr_off_otbn_trans 43882339059256764182049861479983440814413342136877010278880205821144557413685 329
UVM_ERROR @ 185.280000 us: (pwrmgr_rstreqs_sva_if.sv:55) [ASSERT FAILED] HwResetOff_A
UVM_INFO @ 185.280000 us: (uvm_report_catcher.svh:705) [UVM/REPORT/CATCHER]
--- UVM Report catcher Summary ---
UVM_FATAL @ * us: (mem_bkdr_util.sv:658) [mem_bkdr_util[Otp]] file otp_ctrl_img_rma.vmem could not be opened for r mode 3 test runs
chip_csr_bit_bash 49438361104132642066053387455099464271759240738494001932903321306319828950997 142
UVM_INFO @ 0.000000 us: (uvm_report_catcher.svh:705) [UVM/REPORT/CATCHER]
--- UVM Report catcher Summary ---
chip_csr_aliasing 95665541282642397656789831764309621220702335024131826016361121472238462992218 142
UVM_INFO @ 0.000000 us: (uvm_report_catcher.svh:705) [UVM/REPORT/CATCHER]
--- UVM Report catcher Summary ---
chip_same_csr_outstanding 69840653278279145679626260954150319815567706966695059432461208646754451634785 142
UVM_INFO @ 0.000000 us: (uvm_report_catcher.svh:705) [UVM/REPORT/CATCHER]
--- UVM Report catcher Summary ---
UVM_ERROR @ * us: (jtag_riscv_driver.sv:221) [jtag_riscv_agent_pkg] Check failed sbcs_val[SbAccess32] == * (* [*] vs * [*]) expect SBA width to be * bits! 2 test runs
chip_jtag_csr_rw 71541555066139548568700698651256037632981199130161229454056086048384576237708 5962
UVM_INFO @ 132.035000 us: (uvm_report_catcher.svh:705) [UVM/REPORT/CATCHER]
--- UVM Report catcher Summary ---
chip_jtag_mem_access 19686984701158272547356766651852628530428751286849572053620151606761905546374 5962
UVM_INFO @ 131.368000 us: (uvm_report_catcher.svh:705) [UVM/REPORT/CATCHER]
--- UVM Report catcher Summary ---
UVM_FATAL @ * us: (mem_bkdr_util.sv:658) [mem_bkdr_util[Rom0]] file example_test_from_rom_rom_prog_sim_dv.*.scr.vmem could not be opened for r mode 1 test run
chip_sw_example_rom 52797186090709836301166990353083569354986625996488262058233842873926423542429 290
UVM_INFO @ 10.260001 us: (uvm_report_catcher.svh:705) [UVM/REPORT/CATCHER]
--- UVM Report catcher Summary ---
UVM_ERROR @ * us: (sw_logger_if.sv:526) [all_escalation_resets_test_sim_dv(sw/device/lib/testing/alert_handler_testutils.c:78)] CHECK-fail: word_index < dump_size 1 test run
chip_sw_all_escalation_resets 9082159343909494747260615171424236530163991564155076933926556046112784243385 356
UVM_INFO @ 943.835000 us: (uvm_report_catcher.svh:705) [UVM/REPORT/CATCHER]
--- UVM Report catcher Summary ---
UVM_FATAL @ * us: (sec_cm_pkg.sv:48) [sec_cm_pkg::find_sec_cm_if_proxy] no proxy with path *rstmgr.u_d0_spi_host*.leaf_rst_path 1 test run
chip_sw_rstmgr_rst_cnsty_escalation 80732595604268723983525332407036147969570178715351183028727561972470829801039 319
UVM_INFO @ 10.200001 us: (uvm_report_catcher.svh:705) [UVM/REPORT/CATCHER]
--- UVM Report catcher Summary ---
UVM_ERROR @ * us: (sw_logger_if.sv:526) [spi_passthrough_test_sim_dv(sw/device/tests/sim_dv/spi_passthrough_test.c:382)] CHECK-fail: irq == kDtSpiDeviceIrqUploadCmdfifoNotEmpty 1 test run
chip_sw_spi_device_pass_through_collision 72554539077829361146800852476007587686395192942520206610002303453053548281736 340
UVM_INFO @ 226.418000 us: (uvm_report_catcher.svh:705) [UVM/REPORT/CATCHER]
--- UVM Report catcher Summary ---
Offending '(!$fell(lc_ctrl_pkg::lc_tx_test_true_strict(lc_init_done_o)))' 1 test run
chip_sw_otp_ctrl_escalation 58532191117753817946200523773738295291622405195340519415772782715171333860500 334
UVM_ERROR @ 176.928000 us: (lc_ctrl.sv:884) [ASSERT FAILED] LcInitDoneSticky_A
UVM_INFO @ 176.928000 us: (uvm_report_catcher.svh:705) [UVM/REPORT/CATCHER]
--- UVM Report catcher Summary ---
UVM_ERROR @ * us: (sw_logger_if.sv:526) [rstmgr_alert_info_test_sim_dv(sw/device/lib/testing/alert_handler_testutils.c:78)] CHECK-fail: word_index < dump_size 1 test run
chip_sw_rstmgr_alert_info 18193328670909392694714844189987405885900854049505132951217067058192467696933 348
UVM_INFO @ 331.156000 us: (uvm_report_catcher.svh:705) [UVM/REPORT/CATCHER]
--- UVM Report catcher Summary ---
UVM_ERROR @ * us: (chip_sw_soc_proxy_smoke_vseq.sv:36) [chip_env_pkg::\chip_sw_soc_proxy_smoke_vseq::body ] Resets did not complete within required time! 1 test run
chip_sw_soc_proxy_smoketest 78516778693225562932088988712941202895968425124192118430589842839589961973015 327
UVM_INFO @ 156.192000 us: (uvm_report_catcher.svh:705) [UVM/REPORT/CATCHER]
--- UVM Report catcher Summary ---
UVM_ERROR @ * us: (sw_logger_if.sv:526) [soc_proxy_external_wakeup_sim_dv(sw/device/tests/soc_proxy_external_wakeup.c:50)] DIF-fail: dif_pwrmgr_get_request_sources(&pwrmgr, kDifPwrmgrReqTypeWakeup, &wakeup_req_srcs) returns * 1 test run
chip_sw_soc_proxy_external_wakeup 74264607823071472602731114600134902193252012531224170330384809677954192896593 325
UVM_INFO @ 157.753000 us: (uvm_report_catcher.svh:705) [UVM/REPORT/CATCHER]
--- UVM Report catcher Summary ---
UVM_ERROR @ * us: (sw_logger_if.sv:526) [aon_timer_irq_test_sim_dv(sw/device/tests/aon_timer_irq_test.c:139)] CHECK-fail: Timer took * usec which is not in the range * usec and * usec 1 test run
chip_sw_aon_timer_irq 10084390131976055212868599938655258323422514598168337530813300871158755107704 326
UVM_INFO @ 492.310000 us: (uvm_report_catcher.svh:705) [UVM/REPORT/CATCHER]
--- UVM Report catcher Summary ---
UVM_ERROR @ * us: (sw_logger_if.sv:526) [aon_timer_wdog_bite_reset_test_sim_dv(sw/device/tests/aon_timer_wdog_bite_reset_test.c:84)] CHECK-fail: Wdog bark irq did not rise after * microseconds 1 test run
chip_sw_aon_timer_wdog_bite_reset 103311651837967868184583112423886622400701686248387639122244674906590050162729 327
UVM_INFO @ 182.503000 us: (uvm_report_catcher.svh:705) [UVM/REPORT/CATCHER]
--- UVM Report catcher Summary ---
UVM_ERROR @ * us: (sw_logger_if.sv:526) [rv_core_ibex_nmi_irq_test_sim_dv(sw/device/tests/rv_core_ibex_nmi_irq_test.c:172)] CHECK-fail: Timed out after * usec (* CPU cycles) waiting for nmi_fired 1 test run
chip_sw_rv_core_ibex_nmi_irq 43889427335424821760374052518222725923647158696061958082147497064214412413222 328
UVM_INFO @ 269.300000 us: (uvm_report_catcher.svh:705) [UVM/REPORT/CATCHER]
--- UVM Report catcher Summary ---
UVM_ERROR @ * us: (cip_base_scoreboard.sv:618) scoreboard [scoreboard] On interface chip_soc_mbx_reg_block, item had unexpected d_error value(predicted *, but saw *). 1 test run
chip_tl_errors 17633020672484146293156144193253655688622728922456587610900838805424519941957 237
TL item was: req: (cip_tl_seq_item@32027) { a_addr: 'h1465114 a_data: 'hb269d5f9 a_mask: 'h9 a_size: 'h2 a_param: 'h0 a_source: 'h3f a_opcode: 'h1 a_user: 'h26eba d_param: 'h0 d_source: 'h3f d_data: 'h0 d_size: 'h2 d_opcode: 'h0 d_error: 'h0 d_sink: 'h0 d_user: 'h1caa a_valid_delay: 'h0 d_valid_delay: 'h0 a_valid_len: 'h0 d_valid_len: 'h0 req_abort_after_a_valid_len: 'h0 rsp_abort_after_d_valid_len: 'h0 req_completed: 'h0 rsp_completed: 'h0 tl_intg_err_type: TlIntgErrNone max_ecc_errors: 'h3 }
Reasons for predicted error: '{"Unsupported partial write"} .
UVM_INFO @ 117.744000 us: (uvm_report_catcher.svh:705) [UVM/REPORT/CATCHER]
--- UVM Report catcher Summary ---
Error-[CNST-CIF] Constraints inconsistency failure 1 test run
chip_padctrl_attributes 85086270781787967718276947031855686873398259634970667318667985435621786465354 287
src/lowrisc_dv_dv_lib_0/dv_base_test.sv, 143
Constraints are inconsistent and cannot be solved.
Please check the inconsistent constraints being printed above and rewrite
them.
UVM_ERROR @ * us: (sw_test_status_if.sv:85) [tb.u_sim_sram.u_sim_sram_if.u_sw_test_status_if] ==== SW TEST FAILED ==== 1 test run
chip_sw_dma_abort 1969173670359348458197416478801614360359929664427612446207350054150421751608 346
UVM_INFO @ 201.533000 us: (uvm_report_catcher.svh:705) [UVM/REPORT/CATCHER]
--- UVM Report catcher Summary ---