Simulation Results: chip

 
09/09/2026 15:31:43 DVSim: v1.52.2 sha: 629146e json Branch: master Tool: vcs [unknown]
Coverage statistics
  • Total
  • 63.08 %
  • code
  • 60.86 %
  • assert
  • 76.44 %
  • func
  • 51.95 %
  • line
  • 67.11 %
  • branch
  • 72.74 %
  • cond
  • 61.95 %
  • toggle
  • 45.37 %
  • FSM
  • 57.14 %
Validation stages
V1
27.27%
V2
35.90%
V2S
100.00%
V3
0.00%
unmapped
40.00%
Testpoint Test Max Runtime Sim Time Pass Total %
chip_sw_uart_tx_rx 0 1 0.00
chip_sw_uart_tx_rx 15.112s 0.000us 0 1 0.00
chip_sw_uart_rx_overflow 0 1 0.00
chip_sw_uart_tx_rx 15.112s 0.000us 0 1 0.00
chip_sw_uart_rand_baudrate 0 1 0.00
chip_sw_uart_rand_baudrate 17.255s 0.000us 0 1 0.00
chip_sw_uart_tx_rx_alt_clk_freq 0 1 0.00
chip_sw_uart_tx_rx_alt_clk_freq 25.701s 0.000us 0 1 0.00
chip_sw_gpio_out 1 1 100.00
chip_sw_gpio 495.370s 285.961us 1 1 100.00
chip_sw_gpio_in 1 1 100.00
chip_sw_gpio 495.370s 285.961us 1 1 100.00
chip_sw_gpio_irq 1 1 100.00
chip_sw_gpio 495.370s 285.961us 1 1 100.00
chip_sw_example_tests 1 4 25.00
chip_sw_example_rom 44.630s 10.220us 0 1 0.00
chip_sw_example_manufacturer 13.245s 0.000us 0 1 0.00
chip_sw_example_concurrency 282.680s 168.832us 1 1 100.00
chip_sw_uart_smoketest_signed 12.236s 0.000us 0 1 0.00
csr_bit_bash 0 1 0.00
chip_csr_bit_bash 13.010s 0.000us 0 1 0.00
csr_aliasing 0 1 0.00
chip_csr_aliasing 12.000s 0.000us 0 1 0.00
regwen_csr_and_corresponding_lockable_csr 0 1 0.00
chip_csr_aliasing 12.000s 0.000us 0 1 0.00
xbar_smoke 1 1 100.00
xbar_smoke 34.440s 60.728us 1 1 100.00
Testpoint Test Max Runtime Sim Time Pass Total %
chip_sw_spi_device_flash_mode 0 1 0.00
chip_sw_uart_tx_rx_bootstrap 41.584s 0.000us 0 1 0.00
chip_sw_spi_device_pass_through 1 1 100.00
chip_sw_spi_device_pass_through 2320.410s 3298.319us 1 1 100.00
chip_sw_spi_device_pass_through_collision 0 1 0.00
chip_sw_spi_device_pass_through_collision 378.800s 251.781us 0 1 0.00
chip_sw_spi_device_tpm 0 1 0.00
chip_sw_spi_device_tpm 15.974s 0.000us 0 1 0.00
chip_sw_spi_host_tx_rx 0 1 0.00
chip_sw_spi_host_tx_rx 13.239s 0.000us 0 1 0.00
chip_sw_i2c_host_tx_rx 0 1 0.00
chip_sw_i2c_host_tx_rx 13.099s 0.000us 0 1 0.00
chip_sw_i2c_device_tx_rx 0 1 0.00
chip_sw_i2c_device_tx_rx 13.170s 0.000us 0 1 0.00
chip_pin_mux 0 1 0.00
chip_padctrl_attributes 3.910s 0.000us 0 1 0.00
chip_padctrl_attributes 0 1 0.00
chip_padctrl_attributes 3.910s 0.000us 0 1 0.00
chip_sw_sleep_pin_wake 0 1 0.00
chip_sw_sleep_pin_wake 13.899s 0.000us 0 1 0.00
chip_sw_sleep_pin_retention 0 1 0.00
chip_sw_sleep_pin_retention 11.936s 0.000us 0 1 0.00
chip_sw_data_integrity 0 1 0.00
chip_sw_data_integrity_escalation 16.711s 0.000us 0 1 0.00
chip_sw_instruction_integrity 0 1 0.00
chip_sw_data_integrity_escalation 16.711s 0.000us 0 1 0.00
chip_jtag_csr_rw 0 1 0.00
chip_jtag_csr_rw 185.790s 133.794us 0 1 0.00
chip_jtag_mem_access 0 1 0.00
chip_jtag_mem_access 178.560s 131.394us 0 1 0.00
chip_rv_dm_ndm_reset_req 1 1 100.00
chip_rv_dm_ndm_reset_req 482.570s 310.575us 1 1 100.00
chip_sw_rv_dm_ndm_reset_req_when_cpu_halted 0 1 0.00
chip_sw_rv_dm_ndm_reset_req_when_cpu_halted 12.550s 0.000us 0 1 0.00
chip_rv_dm_access_after_wakeup 0 1 0.00
chip_sw_rv_dm_access_after_wakeup 12.713s 0.000us 0 1 0.00
chip_rv_dm_lc_disabled 0 1 0.00
chip_rv_dm_lc_disabled 114.130s 123.705us 0 1 0.00
chip_sw_timer 1 1 100.00
chip_sw_rv_timer_irq 393.240s 266.938us 1 1 100.00
chip_sw_aon_timer_wakeup_irq 0 1 0.00
chip_sw_aon_timer_irq 806.590s 596.374us 0 1 0.00
chip_sw_aon_timer_wdog_bark_irq 0 1 0.00
chip_sw_aon_timer_irq 806.590s 596.374us 0 1 0.00
chip_sw_aon_timer_wdog_lc_escalate 1 1 100.00
chip_sw_aon_timer_wdog_lc_escalate 641.070s 386.644us 1 1 100.00
chip_sw_aon_timer_wdog_bite_reset 0 1 0.00
chip_sw_aon_timer_wdog_bite_reset 349.840s 182.539us 0 1 0.00
chip_sw_aon_timer_sleep_wdog_bite_reset 0 1 0.00
chip_sw_aon_timer_wdog_bite_reset 349.840s 182.539us 0 1 0.00
chip_sw_aon_timer_sleep_wdog_sleep_pause 1 1 100.00
chip_sw_aon_timer_sleep_wdog_sleep_pause 540.360s 2310.652us 1 1 100.00
chip_sw_plic_sw_irq 1 1 100.00
chip_sw_plic_sw_irq 259.640s 164.341us 1 1 100.00
chip_sw_clkmgr_idle_trans 4 4 100.00
chip_sw_otbn_randomness 455.850s 245.086us 1 1 100.00
chip_sw_aes_idle 313.440s 165.864us 1 1 100.00
chip_sw_hmac_enc_idle 315.590s 178.172us 1 1 100.00
chip_sw_kmac_idle 254.520s 164.070us 1 1 100.00
chip_sw_clkmgr_off_trans 0 4 0.00
chip_sw_clkmgr_off_aes_trans 284.520s 185.376us 0 1 0.00
chip_sw_clkmgr_off_hmac_trans 340.860s 185.312us 0 1 0.00
chip_sw_clkmgr_off_kmac_trans 307.830s 185.264us 0 1 0.00
chip_sw_clkmgr_off_otbn_trans 305.930s 185.296us 0 1 0.00
chip_sw_clkmgr_jitter 1 6 16.67
chip_sw_otbn_ecdsa_op_irq_jitter_en 59.430s 10.380us 0 1 0.00
chip_sw_aes_enc_jitter_en 65.190s 10.120us 0 1 0.00
chip_sw_hmac_enc_jitter_en 61.420s 10.140us 0 1 0.00
chip_sw_kmac_mode_kmac_jitter_en 62.880s 10.360us 0 1 0.00
chip_sw_sram_ctrl_scrambled_access_jitter_en 12.723s 0.000us 0 1 0.00
chip_sw_clkmgr_jitter 285.730s 161.289us 1 1 100.00
chip_sw_clkmgr_extended_range 1 7 14.29
chip_sw_clkmgr_jitter_reduced_freq 569.620s 1962.654us 1 1 100.00
chip_sw_otbn_ecdsa_op_irq_jitter_en_reduced_freq 56.690s 10.400us 0 1 0.00
chip_sw_aes_enc_jitter_en_reduced_freq 58.440s 10.260us 0 1 0.00
chip_sw_hmac_enc_jitter_en_reduced_freq 60.680s 10.100us 0 1 0.00
chip_sw_kmac_mode_kmac_jitter_en_reduced_freq 58.130s 10.280us 0 1 0.00
chip_sw_sram_ctrl_scrambled_access_jitter_en_reduced_freq 62.290s 10.140us 0 1 0.00
chip_sw_csrng_edn_concurrency_reduced_freq 53.500s 10.100us 0 1 0.00
chip_sw_clkmgr_deep_sleep_frequency 0 1 0.00
chip_sw_ast_clk_outputs 14.031s 0.000us 0 1 0.00
chip_sw_clkmgr_sleep_frequency 0 1 0.00
chip_sw_clkmgr_sleep_frequency 13.715s 0.000us 0 1 0.00
chip_sw_clkmgr_reset_frequency 0 1 0.00
chip_sw_clkmgr_reset_frequency 14.220s 0.000us 0 1 0.00
chip_sw_clkmgr_escalation_reset 0 1 0.00
chip_sw_all_escalation_resets 1584.810s 943.441us 0 1 0.00
chip_sw_pwrmgr_external_full_reset 1 1 100.00
chip_sw_pwrmgr_full_aon_reset 599.550s 524.901us 1 1 100.00
chip_sw_pwrmgr_sleep_all_reset_reqs 0 1 0.00
chip_sw_aon_timer_wdog_bite_reset 349.840s 182.539us 0 1 0.00
chip_sw_pwrmgr_wdog_reset 0 1 0.00
chip_sw_pwrmgr_wdog_reset 12.608s 0.000us 0 1 0.00
chip_sw_pwrmgr_power_glitch_reset 1 1 100.00
chip_sw_pwrmgr_full_aon_reset 599.550s 524.901us 1 1 100.00
chip_sw_pwrmgr_main_power_glitch_reset 0 1 0.00
chip_sw_pwrmgr_main_power_glitch_reset 16.999s 0.000us 0 1 0.00
chip_sw_pwrmgr_random_sleep_power_glitch_reset 0 1 0.00
chip_sw_pwrmgr_random_sleep_power_glitch_reset 26.084s 0.000us 0 1 0.00
chip_sw_pwrmgr_deep_sleep_power_glitch_reset 0 1 0.00
chip_sw_pwrmgr_deep_sleep_power_glitch_reset 15.235s 0.000us 0 1 0.00
chip_sw_pwrmgr_sleep_power_glitch_reset 0 1 0.00
chip_sw_pwrmgr_sleep_power_glitch_reset 13.778s 0.000us 0 1 0.00
chip_sw_pwrmgr_sleep_disabled 0 1 0.00
chip_sw_pwrmgr_sleep_disabled 13.090s 0.000us 0 1 0.00
chip_sw_pwrmgr_escalation_reset 0 1 0.00
chip_sw_all_escalation_resets 1584.810s 943.441us 0 1 0.00
chip_sw_rstmgr_sys_reset_info 1 1 100.00
chip_rv_dm_ndm_reset_req 482.570s 310.575us 1 1 100.00
chip_sw_rstmgr_cpu_info 0 1 0.00
chip_sw_rstmgr_cpu_info 557.600s 412.080us 0 1 0.00
chip_sw_rstmgr_sw_req_reset 1 1 100.00
chip_sw_rstmgr_sw_req 414.600s 305.560us 1 1 100.00
chip_sw_rstmgr_alert_info 0 1 0.00
chip_sw_rstmgr_alert_info 551.860s 331.084us 0 1 0.00
chip_sw_rstmgr_sw_rst 1 1 100.00
chip_sw_rstmgr_sw_rst 320.070s 163.620us 1 1 100.00
chip_sw_rstmgr_escalation_reset 0 1 0.00
chip_sw_all_escalation_resets 1584.810s 943.441us 0 1 0.00
chip_sw_alert_handler_alerts 0 1 0.00
chip_sw_alert_test 20.563s 0.000us 0 1 0.00
chip_sw_alert_handler_escalations 0 1 0.00
chip_sw_alert_handler_escalation 24.833s 0.000us 0 1 0.00
chip_sw_all_escalation_resets 0 1 0.00
chip_sw_all_escalation_resets 1584.810s 943.441us 0 1 0.00
chip_sw_alert_handler_entropy 0 1 0.00
chip_sw_alert_handler_entropy 44.174s 0.000us 0 1 0.00
chip_sw_alert_handler_crashdump 0 1 0.00
chip_sw_rstmgr_alert_info 551.860s 331.084us 0 1 0.00
chip_sw_alert_handler_ping_timeout 1 1 100.00
chip_sw_alert_handler_ping_timeout 541.130s 419.846us 1 1 100.00
chip_sw_alert_handler_lpg_sleep_mode_alerts 0 1 0.00
chip_sw_alert_handler_lpg_sleep_mode_alerts 105.726s 0.000us 0 1 0.00
chip_sw_alert_handler_lpg_sleep_mode_pings 0 1 0.00
chip_sw_alert_handler_lpg_sleep_mode_pings 108.555s 0.000us 0 1 0.00
chip_sw_alert_handler_lpg_clock_off 0 1 0.00
chip_sw_alert_handler_lpg_clkoff 105.530s 0.000us 0 1 0.00
chip_sw_alert_handler_lpg_reset_toggle 0 1 0.00
chip_sw_alert_handler_lpg_reset_toggle 121.207s 0.000us 0 1 0.00
chip_sw_alert_handler_reverse_ping_in_deep_sleep 0 1 0.00
chip_sw_alert_handler_reverse_ping_in_deep_sleep 117.729s 0.000us 0 1 0.00
chip_sw_lc_ctrl_alert_handler_escalation 0 1 0.00
chip_sw_alert_handler_escalation 24.833s 0.000us 0 1 0.00
chip_sw_lc_ctrl_jtag_access 0 1 0.00
chip_sw_lc_ctrl_transition 12.661s 0.000us 0 1 0.00
chip_sw_lc_ctrl_otp_hw_cfg 0 1 0.00
chip_sw_lc_ctrl_otp_hw_cfg 14.637s 0.000us 0 1 0.00
chip_sw_lc_ctrl_init 0 1 0.00
chip_sw_lc_ctrl_transition 12.661s 0.000us 0 1 0.00
chip_sw_lc_ctrl_transitions 0 1 0.00
chip_sw_lc_ctrl_transition 12.661s 0.000us 0 1 0.00
chip_sw_lc_ctrl_kmac_req 0 1 0.00
chip_sw_lc_ctrl_transition 12.661s 0.000us 0 1 0.00
chip_sw_lc_ctrl_broadcast 2 9 22.22
chip_sw_otp_ctrl_lc_signals_test_unlocked0 13.534s 0.000us 0 1 0.00
chip_sw_otp_ctrl_lc_signals_dev 27.313s 0.000us 0 1 0.00
chip_sw_otp_ctrl_lc_signals_prod 17.850s 0.000us 0 1 0.00
chip_sw_otp_ctrl_lc_signals_rma 14.384s 0.000us 0 1 0.00
chip_sw_lc_ctrl_transition 12.661s 0.000us 0 1 0.00
chip_sw_rom_ctrl_integrity_check 1179.740s 1285.797us 1 1 100.00
chip_sw_sram_ctrl_execution_main 13.307s 0.000us 0 1 0.00
chip_prim_tl_access 323.410s 378.138us 1 1 100.00
chip_rv_dm_lc_disabled 114.130s 123.705us 0 1 0.00
chip_sw_aes_enc 1 2 50.00
chip_sw_aes_enc 297.570s 173.136us 1 1 100.00
chip_sw_aes_enc_jitter_en 65.190s 10.120us 0 1 0.00
chip_sw_aes_gcm 1 2 50.00
chip_sw_aes_enc 297.570s 173.136us 1 1 100.00
chip_sw_aes_enc_jitter_en 65.190s 10.120us 0 1 0.00
chip_sw_aes_entropy 1 1 100.00
chip_sw_aes_entropy 297.410s 164.449us 1 1 100.00
chip_sw_aes_idle 1 1 100.00
chip_sw_aes_idle 313.440s 165.864us 1 1 100.00
chip_sw_hmac_enc 1 2 50.00
chip_sw_hmac_enc 335.980s 173.778us 1 1 100.00
chip_sw_hmac_enc_jitter_en 61.420s 10.140us 0 1 0.00
chip_sw_hmac_idle 1 1 100.00
chip_sw_hmac_enc_idle 315.590s 178.172us 1 1 100.00
chip_sw_kmac_enc 2 3 66.67
chip_sw_kmac_mode_cshake 287.890s 167.453us 1 1 100.00
chip_sw_kmac_mode_kmac 309.370s 188.927us 1 1 100.00
chip_sw_kmac_mode_kmac_jitter_en 62.880s 10.360us 0 1 0.00
chip_sw_kmac_app_lc 0 1 0.00
chip_sw_lc_ctrl_transition 12.661s 0.000us 0 1 0.00
chip_sw_kmac_app_rom 0 1 0.00
chip_sw_kmac_app_rom 18.622s 0.000us 0 1 0.00
chip_sw_kmac_entropy 1 1 100.00
chip_sw_kmac_entropy 448.990s 225.849us 1 1 100.00
chip_sw_kmac_idle 1 1 100.00
chip_sw_kmac_idle 254.520s 164.070us 1 1 100.00
chip_sw_entropy_src_csrng 1 1 100.00
chip_sw_entropy_src_csrng 2043.520s 2224.299us 1 1 100.00
chip_sw_csrng_edn_cmd 1 1 100.00
chip_sw_entropy_src_csrng 2043.520s 2224.299us 1 1 100.00
chip_sw_csrng_fuse_en_sw_app_read 0 1 0.00
chip_sw_csrng_fuse_en_sw_app_read_test 13.544s 0.000us 0 1 0.00
chip_sw_csrng_known_answer_tests 1 1 100.00
chip_sw_csrng_kat_test 298.450s 175.994us 1 1 100.00
chip_sw_edn_entropy_reqs 1 1 100.00
chip_sw_csrng_edn_concurrency 2233.030s 1136.371us 1 1 100.00
chip_sw_otbn_op 1 2 50.00
chip_sw_otbn_ecdsa_op_irq 3539.410s 1498.732us 1 1 100.00
chip_sw_otbn_ecdsa_op_irq_jitter_en 59.430s 10.380us 0 1 0.00
chip_sw_otbn_rnd_entropy 1 1 100.00
chip_sw_otbn_randomness 455.850s 245.086us 1 1 100.00
chip_sw_otbn_urnd_entropy 1 1 100.00
chip_sw_otbn_randomness 455.850s 245.086us 1 1 100.00
chip_sw_otbn_idle 1 1 100.00
chip_sw_otbn_randomness 455.850s 245.086us 1 1 100.00
chip_sw_otbn_mem_scramble 1 1 100.00
chip_sw_otbn_mem_scramble 535.520s 280.743us 1 1 100.00
chip_sw_rom_access 1 1 100.00
chip_sw_rom_ctrl_integrity_check 1179.740s 1285.797us 1 1 100.00
chip_sw_rom_ctrl_integrity_check 1 1 100.00
chip_sw_rom_ctrl_integrity_check 1179.740s 1285.797us 1 1 100.00
chip_sw_sram_scrambled_access 1 2 50.00
chip_sw_sram_ctrl_scrambled_access 517.640s 358.587us 1 1 100.00
chip_sw_sram_ctrl_scrambled_access_jitter_en 12.723s 0.000us 0 1 0.00
chip_sw_sram_execution 0 1 0.00
chip_sw_sram_ctrl_execution_main 13.307s 0.000us 0 1 0.00
chip_sw_sram_lc_escalation 0 2 0.00
chip_sw_all_escalation_resets 1584.810s 943.441us 0 1 0.00
chip_sw_data_integrity_escalation 16.711s 0.000us 0 1 0.00
chip_otp_ctrl_init 0 1 0.00
chip_sw_lc_ctrl_transition 12.661s 0.000us 0 1 0.00
chip_sw_otp_ctrl_keys 3 3 100.00
chip_sw_otbn_mem_scramble 535.520s 280.743us 1 1 100.00
chip_sw_sram_ctrl_scrambled_access 517.640s 358.587us 1 1 100.00
chip_sw_rv_core_ibex_icache_invalidate 336.720s 175.036us 1 1 100.00
chip_sw_otp_ctrl_entropy 3 3 100.00
chip_sw_otbn_mem_scramble 535.520s 280.743us 1 1 100.00
chip_sw_sram_ctrl_scrambled_access 517.640s 358.587us 1 1 100.00
chip_sw_rv_core_ibex_icache_invalidate 336.720s 175.036us 1 1 100.00
chip_sw_otp_ctrl_program 0 1 0.00
chip_sw_lc_ctrl_transition 12.661s 0.000us 0 1 0.00
chip_sw_otp_ctrl_program_error 0 1 0.00
chip_sw_lc_ctrl_program_error 16.934s 0.000us 0 1 0.00
chip_sw_otp_ctrl_hw_cfg 0 1 0.00
chip_sw_lc_ctrl_otp_hw_cfg 14.637s 0.000us 0 1 0.00
chip_sw_otp_ctrl_lc_signals 1 6 16.67
chip_sw_otp_ctrl_lc_signals_test_unlocked0 13.534s 0.000us 0 1 0.00
chip_sw_otp_ctrl_lc_signals_dev 27.313s 0.000us 0 1 0.00
chip_sw_otp_ctrl_lc_signals_prod 17.850s 0.000us 0 1 0.00
chip_sw_otp_ctrl_lc_signals_rma 14.384s 0.000us 0 1 0.00
chip_sw_lc_ctrl_transition 12.661s 0.000us 0 1 0.00
chip_prim_tl_access 323.410s 378.138us 1 1 100.00
chip_sw_otp_prim_tl_access 1 1 100.00
chip_prim_tl_access 323.410s 378.138us 1 1 100.00
chip_sw_otp_ctrl_nvm_cnt 0 1 0.00
chip_sw_otp_ctrl_nvm_cnt 11.723s 0.000us 0 1 0.00
chip_sw_otp_ctrl_sw_parts 0 1 0.00
chip_sw_otp_ctrl_sw_parts 17.190s 0.000us 0 1 0.00
chip_sw_ast_clk_outputs 0 1 0.00
chip_sw_ast_clk_outputs 14.031s 0.000us 0 1 0.00
chip_sw_ast_sys_clk_jitter 1 6 16.67
chip_sw_otbn_ecdsa_op_irq_jitter_en 59.430s 10.380us 0 1 0.00
chip_sw_aes_enc_jitter_en 65.190s 10.120us 0 1 0.00
chip_sw_hmac_enc_jitter_en 61.420s 10.140us 0 1 0.00
chip_sw_kmac_mode_kmac_jitter_en 62.880s 10.360us 0 1 0.00
chip_sw_sram_ctrl_scrambled_access_jitter_en 12.723s 0.000us 0 1 0.00
chip_sw_clkmgr_jitter 285.730s 161.289us 1 1 100.00
chip_sw_soc_proxy_external_reset_requests 0 1 0.00
chip_sw_soc_proxy_smoketest 295.820s 156.240us 0 1 0.00
chip_sw_soc_proxy_external_irqs 0 1 0.00
chip_sw_soc_proxy_smoketest 295.820s 156.240us 0 1 0.00
chip_sw_soc_proxy_external_wakeup_requests 0 1 0.00
chip_sw_soc_proxy_external_wakeup 290.370s 157.857us 0 1 0.00
chip_sw_soc_proxy_gpios 1 1 100.00
chip_sw_soc_proxy_gpios 270.490s 180.761us 1 1 100.00
chip_sw_nmi_irq 0 1 0.00
chip_sw_rv_core_ibex_nmi_irq 510.460s 269.306us 0 1 0.00
chip_sw_rv_core_ibex_rnd 0 1 0.00
chip_sw_rv_core_ibex_rnd 336.960s 181.343us 0 1 0.00
chip_sw_rv_core_ibex_address_translation 1 1 100.00
chip_sw_rv_core_ibex_address_translation 315.590s 180.010us 1 1 100.00
chip_sw_rv_core_ibex_icache_scrambled_access 1 1 100.00
chip_sw_rv_core_ibex_icache_invalidate 336.720s 175.036us 1 1 100.00
chip_sw_rv_core_ibex_fault_dump 0 1 0.00
chip_sw_rstmgr_cpu_info 557.600s 412.080us 0 1 0.00
chip_sw_rv_core_ibex_double_fault 0 1 0.00
chip_sw_rstmgr_cpu_info 557.600s 412.080us 0 1 0.00
chip_sw_smoketest 14 14 100.00
chip_sw_aes_smoketest 285.120s 173.088us 1 1 100.00
chip_sw_aon_timer_smoketest 299.050s 182.371us 1 1 100.00
chip_sw_clkmgr_smoketest 292.200s 162.234us 1 1 100.00
chip_sw_csrng_smoketest 275.200s 164.307us 1 1 100.00
chip_sw_gpio_smoketest 296.250s 184.702us 1 1 100.00
chip_sw_hmac_smoketest 347.850s 194.899us 1 1 100.00
chip_sw_kmac_smoketest 356.650s 185.578us 1 1 100.00
chip_sw_otbn_smoketest 405.070s 225.696us 1 1 100.00
chip_sw_otp_ctrl_smoketest 255.980s 165.913us 1 1 100.00
chip_sw_rv_plic_smoketest 275.910s 164.077us 1 1 100.00
chip_sw_rv_timer_smoketest 396.920s 266.990us 1 1 100.00
chip_sw_rstmgr_smoketest 234.360s 160.992us 1 1 100.00
chip_sw_sram_ctrl_smoketest 307.280s 164.533us 1 1 100.00
chip_sw_uart_smoketest 288.910s 175.343us 1 1 100.00
chip_sw_rom_functests 0 1 0.00
rom_keymgr_dpe_functest 13.534s 0.000us 0 1 0.00
chip_sw_signed 0 1 0.00
chip_sw_uart_smoketest_signed 12.236s 0.000us 0 1 0.00
chip_sw_boot 0 1 0.00
chip_sw_uart_tx_rx_bootstrap 41.584s 0.000us 0 1 0.00
chip_sw_secure_boot 0 1 0.00
base_rom_e2e_smoke 12.454s 0.000us 0 1 0.00
chip_lc_scrap 4 4 100.00
chip_sw_lc_ctrl_rma_to_scrap 325.470s 217.573us 1 1 100.00
chip_sw_lc_ctrl_raw_to_scrap 256.700s 228.974us 1 1 100.00
chip_sw_lc_ctrl_test_locked0_to_scrap 241.980s 220.980us 1 1 100.00
chip_sw_lc_ctrl_rand_to_scrap 310.380s 224.102us 1 1 100.00
chip_lc_test_locked 0 2 0.00
chip_sw_lc_walkthrough_testunlocks 13.985s 0.000us 0 1 0.00
chip_rv_dm_lc_disabled 114.130s 123.705us 0 1 0.00
chip_sw_lc_walkthrough 0 5 0.00
chip_sw_lc_walkthrough_dev 83.251s 0.000us 0 1 0.00
chip_sw_lc_walkthrough_prod 47.004s 0.000us 0 1 0.00
chip_sw_lc_walkthrough_prodend 13.615s 0.000us 0 1 0.00
chip_sw_lc_walkthrough_rma 29.712s 0.000us 0 1 0.00
chip_sw_lc_walkthrough_testunlocks 13.985s 0.000us 0 1 0.00
chip_sw_lc_ctrl_volatile_raw_unlock 2 3 66.67
chip_sw_lc_ctrl_volatile_raw_unlock 792.930s 553.440us 1 1 100.00
chip_sw_lc_ctrl_volatile_raw_unlock_ext_clk_48mhz 730.620s 568.265us 1 1 100.00
rom_volatile_raw_unlock 118.326s 0.000us 0 1 0.00
chip_sw_rom_raw_unlock 0 1 0.00
rom_raw_unlock 100.991s 0.000us 0 1 0.00
chip_sw_exit_test_unlocked_bootstrap 0 1 0.00
chip_sw_exit_test_unlocked_bootstrap 30.132s 0.000us 0 1 0.00
chip_sw_inject_scramble_seed 0 1 0.00
chip_sw_inject_scramble_seed 112.561s 0.000us 0 1 0.00
tl_d_oob_addr_access 0 1 0.00
chip_tl_errors 123.730s 117.739us 0 1 0.00
tl_d_illegal_access 0 1 0.00
chip_tl_errors 123.730s 117.739us 0 1 0.00
tl_d_outstanding_access 0 2 0.00
chip_csr_aliasing 12.000s 0.000us 0 1 0.00
chip_same_csr_outstanding 15.740s 0.000us 0 1 0.00
tl_d_partial_access 0 2 0.00
chip_csr_aliasing 12.000s 0.000us 0 1 0.00
chip_same_csr_outstanding 15.740s 0.000us 0 1 0.00
xbar_base_random_sequence 1 1 100.00
xbar_random 119.660s 70.753us 1 1 100.00
xbar_random_delay 6 6 100.00
xbar_smoke_zero_delays 14.410s 13.400us 1 1 100.00
xbar_smoke_large_delays 370.550s 2480.201us 1 1 100.00
xbar_smoke_slow_rsp 506.190s 2150.604us 1 1 100.00
xbar_random_zero_delays 82.020s 50.284us 1 1 100.00
xbar_random_large_delays 1513.140s 9868.241us 1 1 100.00
xbar_random_slow_rsp 2304.290s 10401.904us 1 1 100.00
xbar_unmapped_address 2 2 100.00
xbar_unmapped_addr 175.140s 173.750us 1 1 100.00
xbar_error_and_unmapped_addr 90.980s 109.149us 1 1 100.00
xbar_error_cases 2 2 100.00
xbar_error_random 97.450s 173.939us 1 1 100.00
xbar_error_and_unmapped_addr 90.980s 109.149us 1 1 100.00
xbar_all_access_same_device 2 2 100.00
xbar_access_same_device 222.330s 346.688us 1 1 100.00
xbar_access_same_device_slow_rsp 482.340s 2034.598us 1 1 100.00
xbar_all_hosts_use_same_source_id 1 1 100.00
xbar_same_source 191.520s 296.253us 1 1 100.00
xbar_stress_all 2 2 100.00
xbar_stress_all 243.600s 151.149us 1 1 100.00
xbar_stress_all_with_error 627.720s 475.171us 1 1 100.00
xbar_stress_with_reset 2 2 100.00
xbar_stress_all_with_rand_reset 324.920s 204.557us 1 1 100.00
xbar_stress_all_with_reset_error 183.760s 154.915us 1 1 100.00
rom_e2e_smoke 0 1 0.00
rom_e2e_smoke 12.802s 0.000us 0 1 0.00
rom_e2e_shutdown_output 0 1 0.00
rom_e2e_shutdown_output 38.728s 0.000us 0 1 0.00
rom_e2e_shutdown_exception_c 0 1 0.00
rom_e2e_shutdown_exception_c 23.707s 0.000us 0 1 0.00
rom_e2e_boot_policy_valid 0 15 0.00
rom_e2e_boot_policy_valid_a_good_b_good_test_unlocked0 73.249s 0.000us 0 1 0.00
rom_e2e_boot_policy_valid_a_good_b_good_dev 11.871s 0.000us 0 1 0.00
rom_e2e_boot_policy_valid_a_good_b_good_prod 12.228s 0.000us 0 1 0.00
rom_e2e_boot_policy_valid_a_good_b_good_prod_end 11.379s 0.000us 0 1 0.00
rom_e2e_boot_policy_valid_a_good_b_good_rma 12.415s 0.000us 0 1 0.00
rom_e2e_boot_policy_valid_a_good_b_bad_test_unlocked0 75.091s 0.000us 0 1 0.00
rom_e2e_boot_policy_valid_a_good_b_bad_dev 12.145s 0.000us 0 1 0.00
rom_e2e_boot_policy_valid_a_good_b_bad_prod 12.465s 0.000us 0 1 0.00
rom_e2e_boot_policy_valid_a_good_b_bad_prod_end 12.281s 0.000us 0 1 0.00
rom_e2e_boot_policy_valid_a_good_b_bad_rma 12.449s 0.000us 0 1 0.00
rom_e2e_boot_policy_valid_a_bad_b_good_test_unlocked0 80.190s 0.000us 0 1 0.00
rom_e2e_boot_policy_valid_a_bad_b_good_dev 13.991s 0.000us 0 1 0.00
rom_e2e_boot_policy_valid_a_bad_b_good_prod 14.875s 0.000us 0 1 0.00
rom_e2e_boot_policy_valid_a_bad_b_good_prod_end 13.689s 0.000us 0 1 0.00
rom_e2e_boot_policy_valid_a_bad_b_good_rma 14.240s 0.000us 0 1 0.00
rom_e2e_sigverify_always 0 15 0.00
rom_e2e_sigverify_always_a_bad_b_bad_test_unlocked0 81.541s 0.000us 0 1 0.00
rom_e2e_sigverify_always_a_bad_b_bad_dev 20.962s 0.000us 0 1 0.00
rom_e2e_sigverify_always_a_bad_b_bad_prod 29.182s 0.000us 0 1 0.00
rom_e2e_sigverify_always_a_bad_b_bad_prod_end 28.176s 0.000us 0 1 0.00
rom_e2e_sigverify_always_a_bad_b_bad_rma 22.612s 0.000us 0 1 0.00
rom_e2e_sigverify_always_a_bad_b_nothing_test_unlocked0 50.155s 0.000us 0 1 0.00
rom_e2e_sigverify_always_a_bad_b_nothing_dev 30.061s 0.000us 0 1 0.00
rom_e2e_sigverify_always_a_bad_b_nothing_prod 27.478s 0.000us 0 1 0.00
rom_e2e_sigverify_always_a_bad_b_nothing_prod_end 25.535s 0.000us 0 1 0.00
rom_e2e_sigverify_always_a_bad_b_nothing_rma 26.580s 0.000us 0 1 0.00
rom_e2e_sigverify_always_a_nothing_b_bad_test_unlocked0 157.864s 0.000us 0 1 0.00
rom_e2e_sigverify_always_a_nothing_b_bad_dev 23.678s 0.000us 0 1 0.00
rom_e2e_sigverify_always_a_nothing_b_bad_prod 18.161s 0.000us 0 1 0.00
rom_e2e_sigverify_always_a_nothing_b_bad_prod_end 14.367s 0.000us 0 1 0.00
rom_e2e_sigverify_always_a_nothing_b_bad_rma 17.996s 0.000us 0 1 0.00
rom_e2e_asm_init 0 5 0.00
rom_e2e_asm_init_test_unlocked0 79.517s 0.000us 0 1 0.00
rom_e2e_asm_init_dev 12.482s 0.000us 0 1 0.00
rom_e2e_asm_init_prod 12.196s 0.000us 0 1 0.00
rom_e2e_asm_init_prod_end 13.388s 0.000us 0 1 0.00
rom_e2e_asm_init_rma 14.799s 0.000us 0 1 0.00
rom_e2e_keymgr_dpe_init 0 3 0.00
rom_e2e_keymgr_dpe_init_rom_ext_meas 12.551s 0.000us 0 1 0.00
rom_e2e_keymgr_dpe_init_rom_ext_no_meas 12.842s 0.000us 0 1 0.00
rom_e2e_keymgr_dpe_init_rom_ext_invalid_meas 12.839s 0.000us 0 1 0.00
rom_e2e_static_critical 0 1 0.00
rom_e2e_static_critical 12.831s 0.000us 0 1 0.00
Testpoint Test Max Runtime Sim Time Pass Total %
chip_sw_aes_masking_off 1 1 100.00
chip_sw_aes_masking_off 338.480s 196.186us 1 1 100.00
chip_sw_rv_core_ibex_lockstep_glitch 1 1 100.00
chip_sw_rv_core_ibex_lockstep_glitch 193.730s 127.370us 1 1 100.00
Testpoint Test Max Runtime Sim Time Pass Total %
chip_rv_dm_perform_debug 0 3 0.00
rom_e2e_jtag_debug_test_unlocked0 16.872s 0.000us 0 1 0.00
rom_e2e_jtag_debug_dev 13.869s 0.000us 0 1 0.00
rom_e2e_jtag_debug_rma 24.915s 0.000us 0 1 0.00
chip_sw_rv_dm_access_after_hw_reset 0 1 0.00
chip_sw_rv_dm_access_after_escalation_reset 13.246s 0.000us 0 1 0.00
chip_sw_plic_alerts 0 1 0.00
chip_sw_all_escalation_resets 1584.810s 943.441us 0 1 0.00
chip_sw_otp_ctrl_vendor_test_csr_access 0 1 0.00
chip_sw_otp_ctrl_vendor_test_csr_access 15.626s 0.000us 0 1 0.00
chip_sw_otp_ctrl_escalation 0 1 0.00
chip_sw_otp_ctrl_escalation 338.740s 176.856us 0 1 0.00
chip_sw_coremark 0 1 0.00
chip_sw_coremark 12.200s 0.000us 0 1 0.00
chip_sw_power_max_load 0 1 0.00
chip_sw_power_virus 109.840s 0.000us 0 1 0.00
rom_e2e_debug 0 3 0.00
rom_e2e_jtag_debug_test_unlocked0 16.872s 0.000us 0 1 0.00
rom_e2e_jtag_debug_dev 13.869s 0.000us 0 1 0.00
rom_e2e_jtag_debug_rma 24.915s 0.000us 0 1 0.00
rom_e2e_jtag_inject 0 3 0.00
rom_e2e_jtag_inject_test_unlocked0 14.587s 0.000us 0 1 0.00
rom_e2e_jtag_inject_dev 26.665s 0.000us 0 1 0.00
rom_e2e_jtag_inject_rma 17.622s 0.000us 0 1 0.00
rom_e2e_self_hash 0 1 0.00
rom_e2e_self_hash 72.204s 0.000us 0 1 0.00
Testpoint Test Max Runtime Sim Time Pass Total %
Unmapped 8 20 40.00
chip_sw_rstmgr_rst_cnsty_escalation 68.280s 10.100us 0 1 0.00
chip_sw_aes_gcm 399.820s 203.627us 1 1 100.00
chip_sw_entropy_src_kat_test 291.020s 163.661us 1 1 100.00
chip_sw_entropy_src_ast_rng_req 281.750s 161.230us 1 1 100.00
chip_plic_all_irqs_0 596.350s 327.639us 1 1 100.00
chip_plic_all_irqs_10 567.370s 300.555us 1 1 100.00
chip_sw_dma_inline_hashing 356.440s 207.398us 1 1 100.00
chip_sw_dma_abort 377.530s 213.027us 0 1 0.00
rom_e2e_sigverify_mod_exp_test_unlocked0_otbn 21.471s 0.000us 0 1 0.00
rom_e2e_sigverify_mod_exp_test_unlocked0_sw 131.050s 0.000us 0 1 0.00
rom_e2e_sigverify_mod_exp_dev_otbn 12.672s 0.000us 0 1 0.00
rom_e2e_sigverify_mod_exp_dev_sw 12.475s 0.000us 0 1 0.00
rom_e2e_sigverify_mod_exp_prod_otbn 12.221s 0.000us 0 1 0.00
rom_e2e_sigverify_mod_exp_prod_sw 10.340s 0.000us 0 1 0.00
rom_e2e_sigverify_mod_exp_prod_end_otbn 11.685s 0.000us 0 1 0.00
rom_e2e_sigverify_mod_exp_prod_end_sw 11.748s 0.000us 0 1 0.00
rom_e2e_sigverify_mod_exp_rma_otbn 10.397s 0.000us 0 1 0.00
rom_e2e_sigverify_mod_exp_rma_sw 11.278s 0.000us 0 1 0.00
chip_sw_entropy_src_smoketest 318.250s 190.735us 1 1 100.00
chip_sw_mbx_smoketest 612.180s 370.710us 1 1 100.00

Error Messages

   Test seed line log context
Some pass patterns missing: ['^TEST PASSED (UVM_)?CHECKS$'] 119 test runs
chip_sw_example_manufacturer 95852718908405133398397990235289743702121651434489128587678780982223973175527 None
Use --verbose_failures to see the command lines of failed build steps.
ERROR: Analysis of target '@@+hooks+manufacturer_test_hooks//:example_test_sim_dv' failed; build aborted: Target @@+hooks+manufacturer_test_hooks//:example_test_sim_dv is incompatible and cannot be built, but was explicitly requested.
Dependency chain:
@@+hooks+manufacturer_test_hooks//:example_test_sim_dv (ca9a07) <-- target platform (//toolchain:opentitan_platform) didn't satisfy constraint @@platforms//:incompatible
INFO: Elapsed time: 0.445s, Critical Path: 0.03s
INFO: 1 process: 1 internal.
ERROR: Build did NOT complete successfully
_run_cmd -> had a non-zero return code of 1.
make: *** [/nightly/current_run/opentitan/hw/dv/tools/dvsim/sim.mk:58: sw_build] Error 1
chip_sw_data_integrity_escalation 23480585211729860948909466038455583233271296566976273005335258144594432240708 None
Use --verbose_failures to see the command lines of failed build steps.
ERROR: Analysis of target '//sw/device/tests/sim_dv:data_integrity_escalation_reset_test_sim_dv' failed; build aborted: Target //sw/device/tests/sim_dv:data_integrity_escalation_reset_test_sim_dv is incompatible and cannot be built, but was explicitly requested.
Dependency chain:
//sw/device/tests/sim_dv:data_integrity_escalation_reset_test_sim_dv (ca9a07) <-- target platform (//toolchain:opentitan_platform) didn't satisfy constraint @@platforms//:incompatible
INFO: Elapsed time: 1.020s, Critical Path: 0.03s
INFO: 1 process: 1 internal.
ERROR: Build did NOT complete successfully
_run_cmd -> had a non-zero return code of 1.
make: *** [/nightly/current_run/opentitan/hw/dv/tools/dvsim/sim.mk:58: sw_build] Error 1
chip_sw_sleep_pin_wake 7027134544761023168891696025048948985591803962770086879870919225106771512457 None
Use --verbose_failures to see the command lines of failed build steps.
ERROR: Analysis of target '//sw/device/tests:sleep_pin_wake_test_sim_dv' failed; build aborted: Target //sw/device/tests:sleep_pin_wake_test_sim_dv is incompatible and cannot be built, but was explicitly requested.
Dependency chain:
//sw/device/tests:sleep_pin_wake_test_sim_dv (ca9a07) <-- target platform (//toolchain:opentitan_platform) didn't satisfy constraint @@platforms//:incompatible
INFO: Elapsed time: 0.390s, Critical Path: 0.02s
INFO: 1 process: 1 internal.
ERROR: Build did NOT complete successfully
_run_cmd -> had a non-zero return code of 1.
make: *** [/nightly/current_run/opentitan/hw/dv/tools/dvsim/sim.mk:58: sw_build] Error 1
chip_sw_sleep_pin_retention 53365560022571215725401273682767462224671165982886709540059026680355541656873 None
Use --verbose_failures to see the command lines of failed build steps.
ERROR: Analysis of target '//sw/device/tests:sleep_pin_retention_test_sim_dv' failed; build aborted: Target //sw/device/tests:sleep_pin_retention_test_sim_dv is incompatible and cannot be built, but was explicitly requested.
Dependency chain:
//sw/device/tests:sleep_pin_retention_test_sim_dv (ca9a07) <-- target platform (//toolchain:opentitan_platform) didn't satisfy constraint @@platforms//:incompatible
INFO: Elapsed time: 0.385s, Critical Path: 0.03s
INFO: 1 process: 1 internal.
ERROR: Build did NOT complete successfully
_run_cmd -> had a non-zero return code of 1.
make: *** [/nightly/current_run/opentitan/hw/dv/tools/dvsim/sim.mk:58: sw_build] Error 1
chip_sw_uart_tx_rx 47444864905477404498461293772458752597523034305605701331274871925084734482806 None
ERROR: Analysis of target '//sw/device/tests:uart_tx_rx_test_sim_dv' failed; build aborted: Target //sw/device/tests:uart_tx_rx_test_sim_dv is incompatible and cannot be built, but was explicitly requested.
Dependency chain:
//sw/device/tests:uart_tx_rx_test_sim_dv (ca9a07) <-- target platform (//toolchain:opentitan_platform) didn't satisfy constraint @@platforms//:incompatible
INFO: Elapsed time: 1.057s, Critical Path: 0.04s
INFO: 1 process: 1 internal.
ERROR: Build did NOT complete successfully
FAILED:
_run_cmd -> had a non-zero return code of 1.
make: *** [/nightly/current_run/opentitan/hw/dv/tools/dvsim/sim.mk:58: sw_build] Error 1
chip_sw_uart_tx_rx_bootstrap 70782352767756456994728462400220453126484074585141057080034157949926961955492 None
Use --verbose_failures to see the command lines of failed build steps.
ERROR: Analysis of target '//sw/device/tests:uart_tx_rx_test_sim_dv' failed; build aborted: Target //sw/device/tests:uart_tx_rx_test_sim_dv is incompatible and cannot be built, but was explicitly requested.
Dependency chain:
//sw/device/tests:uart_tx_rx_test_sim_dv (ca9a07) <-- target platform (//toolchain:opentitan_platform) didn't satisfy constraint @@platforms//:incompatible
INFO: Elapsed time: 11.594s, Critical Path: 0.04s
INFO: 1 process: 1 internal.
ERROR: Build did NOT complete successfully
_run_cmd -> had a non-zero return code of 1.
make: *** [/nightly/current_run/opentitan/hw/dv/tools/dvsim/sim.mk:58: sw_build] Error 1
chip_sw_inject_scramble_seed 68049754591635903737546570663435143627161387542658583177287033225504472787251 None
Use --verbose_failures to see the command lines of failed build steps.
ERROR: Analysis of target '//sw/device/tests/sim_dv:inject_scramble_seed_sim_dv' failed; build aborted: Target //sw/device/tests/sim_dv:inject_scramble_seed_sim_dv is incompatible and cannot be built, but was explicitly requested.
Dependency chain:
//sw/device/tests/sim_dv:inject_scramble_seed_sim_dv (ca9a07) <-- target platform (//toolchain:opentitan_platform) didn't satisfy constraint @@platforms//:incompatible
INFO: Elapsed time: 2.403s, Critical Path: 0.03s
INFO: 1 process: 1 internal.
ERROR: Build did NOT complete successfully
_run_cmd -> had a non-zero return code of 1.
make: *** [/nightly/current_run/opentitan/hw/dv/tools/dvsim/sim.mk:58: sw_build] Error 1
chip_sw_exit_test_unlocked_bootstrap 12916032480187092287144221875220638211540879876937299594545182339296407289501 None
Use --verbose_failures to see the command lines of failed build steps.
ERROR: Analysis of target '//sw/device/tests/sim_dv:exit_test_unlocked_bootstrap_sim_dv' failed; build aborted: Target //sw/device/tests/sim_dv:exit_test_unlocked_bootstrap_sim_dv is incompatible and cannot be built, but was explicitly requested.
Dependency chain:
//sw/device/tests/sim_dv:exit_test_unlocked_bootstrap_sim_dv (ca9a07) <-- target platform (//toolchain:opentitan_platform) didn't satisfy constraint @@platforms//:incompatible
INFO: Elapsed time: 1.468s, Critical Path: 0.03s
INFO: 1 process: 1 internal.
ERROR: Build did NOT complete successfully
_run_cmd -> had a non-zero return code of 1.
make: *** [/nightly/current_run/opentitan/hw/dv/tools/dvsim/sim.mk:58: sw_build] Error 1
chip_sw_uart_rand_baudrate 15862334444779263231339770890192021086594124493430943712618927862444947324535 None
Use --verbose_failures to see the command lines of failed build steps.
ERROR: Analysis of target '//sw/device/tests:uart_tx_rx_test_sim_dv' failed; build aborted: Target //sw/device/tests:uart_tx_rx_test_sim_dv is incompatible and cannot be built, but was explicitly requested.
Dependency chain:
//sw/device/tests:uart_tx_rx_test_sim_dv (ca9a07) <-- target platform (//toolchain:opentitan_platform) didn't satisfy constraint @@platforms//:incompatible
INFO: Elapsed time: 1.913s, Critical Path: 0.04s
INFO: 1 process: 1 internal.
ERROR: Build did NOT complete successfully
_run_cmd -> had a non-zero return code of 1.
make: *** [/nightly/current_run/opentitan/hw/dv/tools/dvsim/sim.mk:58: sw_build] Error 1
chip_sw_uart_tx_rx_alt_clk_freq 11120490379530862314650557430271205640660937371173369761645471558216867482314 None
ERROR: Analysis of target '//sw/device/tests:uart_tx_rx_test_sim_dv' failed; build aborted: Target //sw/device/tests:uart_tx_rx_test_sim_dv is incompatible and cannot be built, but was explicitly requested.
Dependency chain:
//sw/device/tests:uart_tx_rx_test_sim_dv (ca9a07) <-- target platform (//toolchain:opentitan_platform) didn't satisfy constraint @@platforms//:incompatible
INFO: Elapsed time: 2.380s, Critical Path: 0.04s
INFO: 1 process: 1 internal.
ERROR: Build did NOT complete successfully
FAILED:
_run_cmd -> had a non-zero return code of 1.
make: *** [/nightly/current_run/opentitan/hw/dv/tools/dvsim/sim.mk:58: sw_build] Error 1
chip_sw_i2c_host_tx_rx 4478981153769325958296731498174987859258424167562413753552495257312570862016 None
Use --verbose_failures to see the command lines of failed build steps.
ERROR: Analysis of target '//sw/device/tests/sim_dv:i2c_host_tx_rx_test_sim_dv' failed; build aborted: Target //sw/device/tests/sim_dv:i2c_host_tx_rx_test_sim_dv is incompatible and cannot be built, but was explicitly requested.
Dependency chain:
//sw/device/tests/sim_dv:i2c_host_tx_rx_test_sim_dv (ca9a07) <-- target platform (//toolchain:opentitan_platform) didn't satisfy constraint @@platforms//:incompatible
INFO: Elapsed time: 0.410s, Critical Path: 0.04s
INFO: 1 process: 1 internal.
ERROR: Build did NOT complete successfully
_run_cmd -> had a non-zero return code of 1.
make: *** [/nightly/current_run/opentitan/hw/dv/tools/dvsim/sim.mk:58: sw_build] Error 1
chip_sw_i2c_device_tx_rx 110981225808720883887530823723987253184674968711631879719138970833086227088511 None
Use --verbose_failures to see the command lines of failed build steps.
ERROR: Analysis of target '//sw/device/tests/sim_dv:i2c_device_tx_rx_test_sim_dv' failed; build aborted: Target //sw/device/tests/sim_dv:i2c_device_tx_rx_test_sim_dv is incompatible and cannot be built, but was explicitly requested.
Dependency chain:
//sw/device/tests/sim_dv:i2c_device_tx_rx_test_sim_dv (ca9a07) <-- target platform (//toolchain:opentitan_platform) didn't satisfy constraint @@platforms//:incompatible
INFO: Elapsed time: 0.399s, Critical Path: 0.04s
INFO: 1 process: 1 internal.
ERROR: Build did NOT complete successfully
_run_cmd -> had a non-zero return code of 1.
make: *** [/nightly/current_run/opentitan/hw/dv/tools/dvsim/sim.mk:58: sw_build] Error 1
chip_sw_spi_device_tpm 21858055873647352945084070911846415641192568454742052639293895241921369082 None
Use --verbose_failures to see the command lines of failed build steps.
ERROR: Analysis of target '//sw/device/tests:spi_device_tpm_tx_rx_test_sim_dv' failed; build aborted: Target //sw/device/tests:spi_device_tpm_tx_rx_test_sim_dv is incompatible and cannot be built, but was explicitly requested.
Dependency chain:
//sw/device/tests:spi_device_tpm_tx_rx_test_sim_dv (ca9a07) <-- target platform (//toolchain:opentitan_platform) didn't satisfy constraint @@platforms//:incompatible
INFO: Elapsed time: 0.941s, Critical Path: 0.04s
INFO: 1 process: 1 internal.
ERROR: Build did NOT complete successfully
_run_cmd -> had a non-zero return code of 1.
make: *** [/nightly/current_run/opentitan/hw/dv/tools/dvsim/sim.mk:58: sw_build] Error 1
chip_sw_spi_host_tx_rx 46658745039077211846391516679361178891568490134245793739946333770447238241126 None
Use --verbose_failures to see the command lines of failed build steps.
ERROR: Analysis of target '//sw/device/tests/sim_dv:spi_host_tx_rx_test_sim_dv' failed; build aborted: Target //sw/device/tests/sim_dv:spi_host_tx_rx_test_sim_dv is incompatible and cannot be built, but was explicitly requested.
Dependency chain:
//sw/device/tests/sim_dv:spi_host_tx_rx_test_sim_dv (ca9a07) <-- target platform (//toolchain:opentitan_platform) didn't satisfy constraint @@platforms//:incompatible
INFO: Elapsed time: 0.384s, Critical Path: 0.01s
INFO: 1 process: 1 internal.
ERROR: Build did NOT complete successfully
_run_cmd -> had a non-zero return code of 1.
make: *** [/nightly/current_run/opentitan/hw/dv/tools/dvsim/sim.mk:58: sw_build] Error 1
chip_sw_lc_ctrl_otp_hw_cfg 497531030723306258329888339603908379053410773054434137287547158309436884808 None
Another command (pid=1155250) is running. Waiting for it to complete on the server (server_pid=201955)...
Another command (pid=1157771) is running. Waiting for it to complete on the server (server_pid=201955)...
Another command (pid=1161664) is running. Waiting for it to complete on the server (server_pid=201955)...
WARNING: Target pattern parsing failed.
ERROR: Skipping '//sw/device/tests:lc_ctrl_otp_hw_cfg_test_sim_dv': no such target '//sw/device/tests:lc_ctrl_otp_hw_cfg_test_sim_dv': target 'lc_ctrl_otp_hw_cfg_test_sim_dv' not declared in package 'sw/device/tests' defined by /nightly/current_run/opentitan/sw/device/tests/BUILD (did you mean lc_ctrl_otp_hw_cfg0_test_sim_dv?)
ERROR: no such target '//sw/device/tests:lc_ctrl_otp_hw_cfg_test_sim_dv': target 'lc_ctrl_otp_hw_cfg_test_sim_dv' not declared in package 'sw/device/tests' defined by /nightly/current_run/opentitan/sw/device/tests/BUILD (did you mean lc_ctrl_otp_hw_cfg0_test_sim_dv?)
ERROR: Build did NOT complete successfully
_run_cmd -> had a non-zero return code of 1.
make: *** [/nightly/current_run/opentitan/hw/dv/tools/dvsim/sim.mk:58: sw_build] Error 1
chip_sw_otp_ctrl_lc_signals_test_unlocked0 98528531868182659183596543000086848354104968717294666226750517453616698864174 None
Use --verbose_failures to see the command lines of failed build steps.
ERROR: Analysis of target '//sw/device/tests/sim_dv:otp_ctrl_lc_signals_test_sim_dv' failed; build aborted: Target //sw/device/tests/sim_dv:otp_ctrl_lc_signals_test_sim_dv is incompatible and cannot be built, but was explicitly requested.
Dependency chain:
//sw/device/tests/sim_dv:otp_ctrl_lc_signals_test_sim_dv (ca9a07) <-- target platform (//toolchain:opentitan_platform) didn't satisfy constraint @@platforms//:incompatible
INFO: Elapsed time: 0.383s, Critical Path: 0.04s
INFO: 1 process: 1 internal.
ERROR: Build did NOT complete successfully
_run_cmd -> had a non-zero return code of 1.
make: *** [/nightly/current_run/opentitan/hw/dv/tools/dvsim/sim.mk:58: sw_build] Error 1
chip_sw_otp_ctrl_lc_signals_dev 45431386887438092217453842774267492364730315297732234778733242728649782010724 None
Use --verbose_failures to see the command lines of failed build steps.
ERROR: Analysis of target '//sw/device/tests/sim_dv:otp_ctrl_lc_signals_test_sim_dv' failed; build aborted: Target //sw/device/tests/sim_dv:otp_ctrl_lc_signals_test_sim_dv is incompatible and cannot be built, but was explicitly requested.
Dependency chain:
//sw/device/tests/sim_dv:otp_ctrl_lc_signals_test_sim_dv (ca9a07) <-- target platform (//toolchain:opentitan_platform) didn't satisfy constraint @@platforms//:incompatible
INFO: Elapsed time: 10.302s, Critical Path: 0.03s
INFO: 1 process: 1 internal.
ERROR: Build did NOT complete successfully
_run_cmd -> had a non-zero return code of 1.
make: *** [/nightly/current_run/opentitan/hw/dv/tools/dvsim/sim.mk:58: sw_build] Error 1
chip_sw_otp_ctrl_lc_signals_prod 8118031742986750795592426017580695384151755820883885736039355798138798700515 None
ERROR: Analysis of target '//sw/device/tests/sim_dv:otp_ctrl_lc_signals_test_sim_dv' failed; build aborted: Target //sw/device/tests/sim_dv:otp_ctrl_lc_signals_test_sim_dv is incompatible and cannot be built, but was explicitly requested.
Dependency chain:
//sw/device/tests/sim_dv:otp_ctrl_lc_signals_test_sim_dv (ca9a07) <-- target platform (//toolchain:opentitan_platform) didn't satisfy constraint @@platforms//:incompatible
INFO: Elapsed time: 1.105s, Critical Path: 0.03s
INFO: 1 process: 1 internal.
ERROR: Build did NOT complete successfully
FAILED:
_run_cmd -> had a non-zero return code of 1.
make: *** [/nightly/current_run/opentitan/hw/dv/tools/dvsim/sim.mk:58: sw_build] Error 1
chip_sw_otp_ctrl_lc_signals_rma 108722177975441610765914037654298225314586989665709001080294000332529436879041 None
Use --verbose_failures to see the command lines of failed build steps.
ERROR: Analysis of target '//sw/device/tests/sim_dv:otp_ctrl_lc_signals_test_sim_dv' failed; build aborted: Target //sw/device/tests/sim_dv:otp_ctrl_lc_signals_test_sim_dv is incompatible and cannot be built, but was explicitly requested.
Dependency chain:
//sw/device/tests/sim_dv:otp_ctrl_lc_signals_test_sim_dv (ca9a07) <-- target platform (//toolchain:opentitan_platform) didn't satisfy constraint @@platforms//:incompatible
INFO: Elapsed time: 0.326s, Critical Path: 0.04s
INFO: 1 process: 1 internal.
ERROR: Build did NOT complete successfully
_run_cmd -> had a non-zero return code of 1.
make: *** [/nightly/current_run/opentitan/hw/dv/tools/dvsim/sim.mk:58: sw_build] Error 1
chip_sw_otp_ctrl_vendor_test_csr_access 94345691652613326156824036651765315820365378802126621833731834253006656319961 None
Use --verbose_failures to see the command lines of failed build steps.
ERROR: Analysis of target '//sw/device/tests/sim_dv:otp_ctrl_vendor_test_csr_access_test_sim_dv' failed; build aborted: Target //sw/device/tests/sim_dv:otp_ctrl_vendor_test_csr_access_test_sim_dv is incompatible and cannot be built, but was explicitly requested.
Dependency chain:
//sw/device/tests/sim_dv:otp_ctrl_vendor_test_csr_access_test_sim_dv (ca9a07) <-- target platform (//toolchain:opentitan_platform) didn't satisfy constraint @@platforms//:incompatible
INFO: Elapsed time: 3.988s, Critical Path: 0.04s
INFO: 1 process: 1 internal.
ERROR: Build did NOT complete successfully
_run_cmd -> had a non-zero return code of 1.
make: *** [/nightly/current_run/opentitan/hw/dv/tools/dvsim/sim.mk:58: sw_build] Error 1
chip_sw_otp_ctrl_nvm_cnt 52933404908042824051200478530312548503155566158537916319637609949533433015061 None
---- STDERR ----
Another command (pid=516495) is running. Waiting for it to complete on the server (server_pid=201955)...
WARNING: Target pattern parsing failed.
ERROR: Skipping '//sw/device/tests:otp_ctrl_nvm_cnt_test_sim_dv': no such target '//sw/device/tests:otp_ctrl_nvm_cnt_test_sim_dv': target 'otp_ctrl_nvm_cnt_test_sim_dv' not declared in package 'sw/device/tests' defined by /nightly/current_run/opentitan/sw/device/tests/BUILD
ERROR: no such target '//sw/device/tests:otp_ctrl_nvm_cnt_test_sim_dv': target 'otp_ctrl_nvm_cnt_test_sim_dv' not declared in package 'sw/device/tests' defined by /nightly/current_run/opentitan/sw/device/tests/BUILD
ERROR: Build did NOT complete successfully
_run_cmd -> had a non-zero return code of 1.
make: *** [/nightly/current_run/opentitan/hw/dv/tools/dvsim/sim.mk:58: sw_build] Error 1
chip_sw_otp_ctrl_sw_parts 6235433458199255836140601491375867363630631777636175069741822943663837079630 None
Another command (pid=543092) is running. Waiting for it to complete on the server (server_pid=201955)...
Another command (pid=544417) is running. Waiting for it to complete on the server (server_pid=201955)...
Another command (pid=546557) is running. Waiting for it to complete on the server (server_pid=201955)...
WARNING: Target pattern parsing failed.
ERROR: Skipping '//sw/device/tests:otp_ctrl_sw_parts_test_sim_dv': no such target '//sw/device/tests:otp_ctrl_sw_parts_test_sim_dv': target 'otp_ctrl_sw_parts_test_sim_dv' not declared in package 'sw/device/tests' defined by /nightly/current_run/opentitan/sw/device/tests/BUILD
ERROR: no such target '//sw/device/tests:otp_ctrl_sw_parts_test_sim_dv': target 'otp_ctrl_sw_parts_test_sim_dv' not declared in package 'sw/device/tests' defined by /nightly/current_run/opentitan/sw/device/tests/BUILD
ERROR: Build did NOT complete successfully
_run_cmd -> had a non-zero return code of 1.
make: *** [/nightly/current_run/opentitan/hw/dv/tools/dvsim/sim.mk:58: sw_build] Error 1
chip_sw_lc_ctrl_transition 77003381766489858190977499682335625285562682280177690580255994358905132099539 None
Use --verbose_failures to see the command lines of failed build steps.
ERROR: Analysis of target '//sw/device/tests/sim_dv:lc_ctrl_transition_test_sim_dv' failed; build aborted: Target //sw/device/tests/sim_dv:lc_ctrl_transition_test_sim_dv is incompatible and cannot be built, but was explicitly requested.
Dependency chain:
//sw/device/tests/sim_dv:lc_ctrl_transition_test_sim_dv (ca9a07) <-- target platform (//toolchain:opentitan_platform) didn't satisfy constraint @@platforms//:incompatible
INFO: Elapsed time: 0.424s, Critical Path: 0.04s
INFO: 1 process: 1 internal.
ERROR: Build did NOT complete successfully
_run_cmd -> had a non-zero return code of 1.
make: *** [/nightly/current_run/opentitan/hw/dv/tools/dvsim/sim.mk:58: sw_build] Error 1
chip_sw_lc_walkthrough_dev 106395478158312329962116376210922434841299568743168698891993692999164665215297 None
Use --verbose_failures to see the command lines of failed build steps.
ERROR: Analysis of target '//sw/device/tests/sim_dv:lc_walkthrough_test_sim_dv' failed; build aborted: Target //sw/device/tests/sim_dv:lc_walkthrough_test_sim_dv is incompatible and cannot be built, but was explicitly requested.
Dependency chain:
//sw/device/tests/sim_dv:lc_walkthrough_test_sim_dv (ca9a07) <-- target platform (//toolchain:opentitan_platform) didn't satisfy constraint @@platforms//:incompatible
INFO: Elapsed time: 1.823s, Critical Path: 0.03s
INFO: 1 process: 1 internal.
ERROR: Build did NOT complete successfully
_run_cmd -> had a non-zero return code of 1.
make: *** [/nightly/current_run/opentitan/hw/dv/tools/dvsim/sim.mk:58: sw_build] Error 1
chip_sw_lc_walkthrough_prod 78561856030629817187579056411221685737600886720876557426885213334790810725432 None
Use --verbose_failures to see the command lines of failed build steps.
ERROR: Analysis of target '//sw/device/tests/sim_dv:lc_walkthrough_test_sim_dv' failed; build aborted: Target //sw/device/tests/sim_dv:lc_walkthrough_test_sim_dv is incompatible and cannot be built, but was explicitly requested.
Dependency chain:
//sw/device/tests/sim_dv:lc_walkthrough_test_sim_dv (ca9a07) <-- target platform (//toolchain:opentitan_platform) didn't satisfy constraint @@platforms//:incompatible
INFO: Elapsed time: 1.699s, Critical Path: 0.04s
INFO: 1 process: 1 internal.
ERROR: Build did NOT complete successfully
_run_cmd -> had a non-zero return code of 1.
make: *** [/nightly/current_run/opentitan/hw/dv/tools/dvsim/sim.mk:58: sw_build] Error 1
chip_sw_lc_walkthrough_prodend 11853294004613940842140673867425980328113076578141216375939727884551843540314 None
Use --verbose_failures to see the command lines of failed build steps.
ERROR: Analysis of target '//sw/device/tests/sim_dv:lc_walkthrough_test_sim_dv' failed; build aborted: Target //sw/device/tests/sim_dv:lc_walkthrough_test_sim_dv is incompatible and cannot be built, but was explicitly requested.
Dependency chain:
//sw/device/tests/sim_dv:lc_walkthrough_test_sim_dv (ca9a07) <-- target platform (//toolchain:opentitan_platform) didn't satisfy constraint @@platforms//:incompatible
INFO: Elapsed time: 0.403s, Critical Path: 0.03s
INFO: 1 process: 1 internal.
ERROR: Build did NOT complete successfully
_run_cmd -> had a non-zero return code of 1.
make: *** [/nightly/current_run/opentitan/hw/dv/tools/dvsim/sim.mk:58: sw_build] Error 1
chip_sw_lc_walkthrough_rma 95066799024605260420792472734267380035386486180287890354219743573773738417021 None
Use --verbose_failures to see the command lines of failed build steps.
ERROR: Analysis of target '//sw/device/tests/sim_dv:lc_walkthrough_test_sim_dv' failed; build aborted: Target //sw/device/tests/sim_dv:lc_walkthrough_test_sim_dv is incompatible and cannot be built, but was explicitly requested.
Dependency chain:
//sw/device/tests/sim_dv:lc_walkthrough_test_sim_dv (ca9a07) <-- target platform (//toolchain:opentitan_platform) didn't satisfy constraint @@platforms//:incompatible
INFO: Elapsed time: 11.162s, Critical Path: 0.01s
INFO: 1 process: 1 internal.
ERROR: Build did NOT complete successfully
_run_cmd -> had a non-zero return code of 1.
make: *** [/nightly/current_run/opentitan/hw/dv/tools/dvsim/sim.mk:58: sw_build] Error 1
chip_sw_lc_walkthrough_testunlocks 64336685706891902955437271984310415734892114000151577735738927045968497091489 None
Use --verbose_failures to see the command lines of failed build steps.
ERROR: Analysis of target '//sw/device/tests/sim_dv:lc_walkthrough_testunlocks_test_sim_dv' failed; build aborted: Target //sw/device/tests/sim_dv:lc_walkthrough_testunlocks_test_sim_dv is incompatible and cannot be built, but was explicitly requested.
Dependency chain:
//sw/device/tests/sim_dv:lc_walkthrough_testunlocks_test_sim_dv (ca9a07) <-- target platform (//toolchain:opentitan_platform) didn't satisfy constraint @@platforms//:incompatible
INFO: Elapsed time: 0.400s, Critical Path: 0.04s
INFO: 1 process: 1 internal.
ERROR: Build did NOT complete successfully
_run_cmd -> had a non-zero return code of 1.
make: *** [/nightly/current_run/opentitan/hw/dv/tools/dvsim/sim.mk:58: sw_build] Error 1
chip_sw_pwrmgr_main_power_glitch_reset 49518980433833538624074110444162595493222065523642155690723041189221588308125 None
Use --verbose_failures to see the command lines of failed build steps.
ERROR: Analysis of target '//sw/device/tests/sim_dv:pwrmgr_main_power_glitch_test_sim_dv' failed; build aborted: Target //sw/device/tests/sim_dv:pwrmgr_main_power_glitch_test_sim_dv is incompatible and cannot be built, but was explicitly requested.
Dependency chain:
//sw/device/tests/sim_dv:pwrmgr_main_power_glitch_test_sim_dv (ca9a07) <-- target platform (//toolchain:opentitan_platform) didn't satisfy constraint @@platforms//:incompatible
INFO: Elapsed time: 1.051s, Critical Path: 0.04s
INFO: 1 process: 1 internal.
ERROR: Build did NOT complete successfully
_run_cmd -> had a non-zero return code of 1.
make: *** [/nightly/current_run/opentitan/hw/dv/tools/dvsim/sim.mk:58: sw_build] Error 1
chip_sw_pwrmgr_sleep_power_glitch_reset 87839383145736597445857542007864697117603025713872926914534160251371171934933 None
Use --verbose_failures to see the command lines of failed build steps.
ERROR: Analysis of target '//sw/device/tests/sim_dv:pwrmgr_sleep_power_glitch_test_sim_dv' failed; build aborted: Target //sw/device/tests/sim_dv:pwrmgr_sleep_power_glitch_test_sim_dv is incompatible and cannot be built, but was explicitly requested.
Dependency chain:
//sw/device/tests/sim_dv:pwrmgr_sleep_power_glitch_test_sim_dv (ca9a07) <-- target platform (//toolchain:opentitan_platform) didn't satisfy constraint @@platforms//:incompatible
INFO: Elapsed time: 0.908s, Critical Path: 0.04s
INFO: 1 process: 1 internal.
ERROR: Build did NOT complete successfully
_run_cmd -> had a non-zero return code of 1.
make: *** [/nightly/current_run/opentitan/hw/dv/tools/dvsim/sim.mk:58: sw_build] Error 1
chip_sw_pwrmgr_deep_sleep_power_glitch_reset 79681907234462912434939081927446917018686464350147900972849143177518256488978 None
Use --verbose_failures to see the command lines of failed build steps.
ERROR: Analysis of target '//sw/device/tests/sim_dv:pwrmgr_deep_sleep_power_glitch_test_sim_dv' failed; build aborted: Target //sw/device/tests/sim_dv:pwrmgr_deep_sleep_power_glitch_test_sim_dv is incompatible and cannot be built, but was explicitly requested.
Dependency chain:
//sw/device/tests/sim_dv:pwrmgr_deep_sleep_power_glitch_test_sim_dv (ca9a07) <-- target platform (//toolchain:opentitan_platform) didn't satisfy constraint @@platforms//:incompatible
INFO: Elapsed time: 1.047s, Critical Path: 0.04s
INFO: 1 process: 1 internal.
ERROR: Build did NOT complete successfully
_run_cmd -> had a non-zero return code of 1.
make: *** [/nightly/current_run/opentitan/hw/dv/tools/dvsim/sim.mk:58: sw_build] Error 1
chip_sw_pwrmgr_random_sleep_power_glitch_reset 10354072087739497723361073066150058623650624655882025798582292636682701065800 None
Use --verbose_failures to see the command lines of failed build steps.
ERROR: Analysis of target '//sw/device/tests/sim_dv:pwrmgr_random_sleep_power_glitch_reset_test_sim_dv' failed; build aborted: Target //sw/device/tests/sim_dv:pwrmgr_random_sleep_power_glitch_reset_test_sim_dv is incompatible and cannot be built, but was explicitly requested.
Dependency chain:
//sw/device/tests/sim_dv:pwrmgr_random_sleep_power_glitch_reset_test_sim_dv (ca9a07) <-- target platform (//toolchain:opentitan_platform) didn't satisfy constraint @@platforms//:incompatible
INFO: Elapsed time: 2.104s, Critical Path: 0.03s
INFO: 1 process: 1 internal.
ERROR: Build did NOT complete successfully
_run_cmd -> had a non-zero return code of 1.
make: *** [/nightly/current_run/opentitan/hw/dv/tools/dvsim/sim.mk:58: sw_build] Error 1
chip_sw_pwrmgr_sleep_disabled 91538209753763889982662869076905827110243835096348733199922521023727636045946 None
Use --verbose_failures to see the command lines of failed build steps.
ERROR: Analysis of target '//sw/device/tests:pwrmgr_sleep_disabled_test_sim_dv' failed; build aborted: Target //sw/device/tests:pwrmgr_sleep_disabled_test_sim_dv is incompatible and cannot be built, but was explicitly requested.
Dependency chain:
//sw/device/tests:pwrmgr_sleep_disabled_test_sim_dv (ca9a07) <-- target platform (//toolchain:opentitan_platform) didn't satisfy constraint @@platforms//:incompatible
INFO: Elapsed time: 0.371s, Critical Path: 0.04s
INFO: 1 process: 1 internal.
ERROR: Build did NOT complete successfully
_run_cmd -> had a non-zero return code of 1.
make: *** [/nightly/current_run/opentitan/hw/dv/tools/dvsim/sim.mk:58: sw_build] Error 1
chip_sw_pwrmgr_wdog_reset 43297592912016817302373879497984812797505198732351900877627402746430862301063 None
Use --verbose_failures to see the command lines of failed build steps.
ERROR: Analysis of target '//sw/device/tests:pwrmgr_wdog_reset_reqs_test_sim_dv' failed; build aborted: Target //sw/device/tests:pwrmgr_wdog_reset_reqs_test_sim_dv is incompatible and cannot be built, but was explicitly requested.
Dependency chain:
//sw/device/tests:pwrmgr_wdog_reset_reqs_test_sim_dv (ca9a07) <-- target platform (//toolchain:opentitan_platform) didn't satisfy constraint @@platforms//:incompatible
INFO: Elapsed time: 0.631s, Critical Path: 0.05s
INFO: 1 process: 1 internal.
ERROR: Build did NOT complete successfully
_run_cmd -> had a non-zero return code of 1.
make: *** [/nightly/current_run/opentitan/hw/dv/tools/dvsim/sim.mk:58: sw_build] Error 1
chip_sw_alert_test 80326721490888448015655766093052154847340818737996126761723019929993048905431 None
Another command (pid=675024) is running. Waiting for it to complete on the server (server_pid=201955)...
WARNING: Target pattern parsing failed.
ERROR: Skipping '//sw/device/tests/autogen/top_darjeeling:alert_test_sim_dv': no such package 'sw/device/tests/autogen/top_darjeeling': BUILD file not found in any of the following directories. Add a BUILD file to a directory to mark it as a package.
- sw/device/tests/autogen/top_darjeeling
ERROR: no such package 'sw/device/tests/autogen/top_darjeeling': BUILD file not found in any of the following directories. Add a BUILD file to a directory to mark it as a package.
- sw/device/tests/autogen/top_darjeeling
ERROR: Build did NOT complete successfully
_run_cmd -> had a non-zero return code of 1.
make: *** [/nightly/current_run/opentitan/hw/dv/tools/dvsim/sim.mk:58: sw_build] Error 1
chip_sw_alert_handler_escalation 44391164853366912100032509704407997914756047301752968435823922197891515205906 None
Use --verbose_failures to see the command lines of failed build steps.
ERROR: Analysis of target '//sw/device/tests:alert_handler_escalation_test_sim_dv' failed; build aborted: Target //sw/device/tests:alert_handler_escalation_test_sim_dv is incompatible and cannot be built, but was explicitly requested.
Dependency chain:
//sw/device/tests:alert_handler_escalation_test_sim_dv (ca9a07) <-- target platform (//toolchain:opentitan_platform) didn't satisfy constraint @@platforms//:incompatible
INFO: Elapsed time: 1.368s, Critical Path: 0.03s
INFO: 1 process: 1 internal.
ERROR: Build did NOT complete successfully
_run_cmd -> had a non-zero return code of 1.
make: *** [/nightly/current_run/opentitan/hw/dv/tools/dvsim/sim.mk:58: sw_build] Error 1
chip_sw_alert_handler_reverse_ping_in_deep_sleep 35680869470385484066701473266149819572197806125841794700055831190660496876552 None
Use --verbose_failures to see the command lines of failed build steps.
ERROR: Analysis of target '//sw/device/tests:alert_handler_reverse_ping_in_deep_sleep_test_sim_dv' failed; build aborted: Target //sw/device/tests:alert_handler_reverse_ping_in_deep_sleep_test_sim_dv is incompatible and cannot be built, but was explicitly requested.
Dependency chain:
//sw/device/tests:alert_handler_reverse_ping_in_deep_sleep_test_sim_dv (ca9a07) <-- target platform (//toolchain:opentitan_platform) didn't satisfy constraint @@platforms//:incompatible
INFO: Elapsed time: 2.937s, Critical Path: 0.01s
INFO: 1 process: 1 internal.
ERROR: Build did NOT complete successfully
_run_cmd -> had a non-zero return code of 1.
make: *** [/nightly/current_run/opentitan/hw/dv/tools/dvsim/sim.mk:58: sw_build] Error 1
chip_sw_alert_handler_lpg_sleep_mode_alerts 95944537830987700050630839850250499817128414873806248358192857611599585148270 None
Another command (pid=482321) is running. Waiting for it to complete on the server (server_pid=201955)...
Another command (pid=485405) is running. Waiting for it to complete on the server (server_pid=201955)...
Another command (pid=483625) is running. Waiting for it to complete on the server (server_pid=201955)...
WARNING: Target pattern parsing failed.
ERROR: Skipping '//sw/device/tests:alert_handler_lpg_sleep_mode_alerts_test_sim_dv': no such target '//sw/device/tests:alert_handler_lpg_sleep_mode_alerts_test_sim_dv': target 'alert_handler_lpg_sleep_mode_alerts_test_sim_dv' not declared in package 'sw/device/tests' defined by /nightly/current_run/opentitan/sw/device/tests/BUILD
ERROR: no such target '//sw/device/tests:alert_handler_lpg_sleep_mode_alerts_test_sim_dv': target 'alert_handler_lpg_sleep_mode_alerts_test_sim_dv' not declared in package 'sw/device/tests' defined by /nightly/current_run/opentitan/sw/device/tests/BUILD
ERROR: Build did NOT complete successfully
_run_cmd -> had a non-zero return code of 1.
make: *** [/nightly/current_run/opentitan/hw/dv/tools/dvsim/sim.mk:58: sw_build] Error 1
chip_sw_alert_handler_lpg_sleep_mode_pings 74785445483166233623351268689146071439521541903530935289324597205369897880718 None
Use --verbose_failures to see the command lines of failed build steps.
ERROR: Analysis of target '//sw/device/tests:alert_handler_lpg_sleep_mode_pings_test_sim_dv' failed; build aborted: Target //sw/device/tests:alert_handler_lpg_sleep_mode_pings_test_sim_dv is incompatible and cannot be built, but was explicitly requested.
Dependency chain:
//sw/device/tests:alert_handler_lpg_sleep_mode_pings_test_sim_dv (ca9a07) <-- target platform (//toolchain:opentitan_platform) didn't satisfy constraint @@platforms//:incompatible
INFO: Elapsed time: 4.338s, Critical Path: 0.03s
INFO: 1 process: 1 internal.
ERROR: Build did NOT complete successfully
_run_cmd -> had a non-zero return code of 1.
make: *** [/nightly/current_run/opentitan/hw/dv/tools/dvsim/sim.mk:58: sw_build] Error 1
chip_sw_alert_handler_lpg_clkoff 2780801440605864866689401527465370343888007485711538840549275206628993706272 None
Use --verbose_failures to see the command lines of failed build steps.
ERROR: Analysis of target '//sw/device/tests:alert_handler_lpg_clkoff_test_sim_dv' failed; build aborted: Target //sw/device/tests:alert_handler_lpg_clkoff_test_sim_dv is incompatible and cannot be built, but was explicitly requested.
Dependency chain:
//sw/device/tests:alert_handler_lpg_clkoff_test_sim_dv (ca9a07) <-- target platform (//toolchain:opentitan_platform) didn't satisfy constraint @@platforms//:incompatible
INFO: Elapsed time: 7.467s, Critical Path: 0.03s
INFO: 1 process: 1 internal.
ERROR: Build did NOT complete successfully
_run_cmd -> had a non-zero return code of 1.
make: *** [/nightly/current_run/opentitan/hw/dv/tools/dvsim/sim.mk:58: sw_build] Error 1
chip_sw_alert_handler_lpg_reset_toggle 91469762282735852376217804101653564584774735009856019226174429116257741693182 None
Use --verbose_failures to see the command lines of failed build steps.
ERROR: Analysis of target '//sw/device/tests:alert_handler_lpg_reset_toggle_test_sim_dv' failed; build aborted: Target //sw/device/tests:alert_handler_lpg_reset_toggle_test_sim_dv is incompatible and cannot be built, but was explicitly requested.
Dependency chain:
//sw/device/tests:alert_handler_lpg_reset_toggle_test_sim_dv (ca9a07) <-- target platform (//toolchain:opentitan_platform) didn't satisfy constraint @@platforms//:incompatible
INFO: Elapsed time: 3.435s, Critical Path: 0.03s
INFO: 1 process: 1 internal.
ERROR: Build did NOT complete successfully
_run_cmd -> had a non-zero return code of 1.
make: *** [/nightly/current_run/opentitan/hw/dv/tools/dvsim/sim.mk:58: sw_build] Error 1
chip_sw_alert_handler_entropy 55374844789673854501221056955188364543255446412166787405495744487194851461005 None
Use --verbose_failures to see the command lines of failed build steps.
ERROR: Analysis of target '//sw/device/tests/sim_dv:alert_handler_entropy_test_sim_dv' failed; build aborted: Target //sw/device/tests/sim_dv:alert_handler_entropy_test_sim_dv is incompatible and cannot be built, but was explicitly requested.
Dependency chain:
//sw/device/tests/sim_dv:alert_handler_entropy_test_sim_dv (ca9a07) <-- target platform (//toolchain:opentitan_platform) didn't satisfy constraint @@platforms//:incompatible
INFO: Elapsed time: 2.858s, Critical Path: 0.03s
INFO: 1 process: 1 internal.
ERROR: Build did NOT complete successfully
_run_cmd -> had a non-zero return code of 1.
make: *** [/nightly/current_run/opentitan/hw/dv/tools/dvsim/sim.mk:58: sw_build] Error 1
chip_sw_csrng_fuse_en_sw_app_read_test 19757734141171223273951373444081601868941461756550878679356741777588308359676 None
Use --verbose_failures to see the command lines of failed build steps.
ERROR: Analysis of target '//sw/device/tests/sim_dv:csrng_fuse_en_sw_app_read_sim_dv' failed; build aborted: Target //sw/device/tests/sim_dv:csrng_fuse_en_sw_app_read_sim_dv is incompatible and cannot be built, but was explicitly requested.
Dependency chain:
//sw/device/tests/sim_dv:csrng_fuse_en_sw_app_read_sim_dv (ca9a07) <-- target platform (//toolchain:opentitan_platform) didn't satisfy constraint @@platforms//:incompatible
INFO: Elapsed time: 0.371s, Critical Path: 0.03s
INFO: 1 process: 1 internal.
ERROR: Build did NOT complete successfully
_run_cmd -> had a non-zero return code of 1.
make: *** [/nightly/current_run/opentitan/hw/dv/tools/dvsim/sim.mk:58: sw_build] Error 1
chip_sw_kmac_app_rom 110667795659320955946986349597908400683802699081777600701080933772845158590120 None
---- STDOUT ----
---- STDERR ----
WARNING: Build option --define has changed, discarding analysis cache (this can be expensive, see https://bazel.build/advanced/performance/iteration-speed).
DEBUG: /nightly/current_run/opentitan/rules/autogen.bzl:536:14: NOTE: stamping is disabled, the build_info section will use a fixed version string
ERROR: Error doing post analysis query: Evaluation of subquery "labels('data', //sw/device/tests:kmac_app_rom_test_sim_dv)" failed (did you want to use --keep_going?): in 'data' of rule //sw/device/tests:kmac_app_rom_test_sim_dv: configured target of type test_suite does not have attribute 'data'
ERROR: Build did NOT complete successfully
_run_cmd -> had a non-zero return code of 1.
make: *** [/nightly/current_run/opentitan/hw/dv/tools/dvsim/sim.mk:58: sw_build] Error 1
chip_sw_sram_ctrl_scrambled_access_jitter_en 49873601873505266966823294368283774708562265099446756756902770471146169990119 None
---- STDERR ----
Another command (pid=1364010) is running. Waiting for it to complete on the server (server_pid=201955)...
WARNING: Target pattern parsing failed.
ERROR: Skipping '//sw/device/tests/sim_dv:sram_ctrl_scrambled_access_test_sim_dv': no such target '//sw/device/tests/sim_dv:sram_ctrl_scrambled_access_test_sim_dv': target 'sram_ctrl_scrambled_access_test_sim_dv' not declared in package 'sw/device/tests/sim_dv' defined by /nightly/current_run/opentitan/sw/device/tests/sim_dv/BUILD
ERROR: no such target '//sw/device/tests/sim_dv:sram_ctrl_scrambled_access_test_sim_dv': target 'sram_ctrl_scrambled_access_test_sim_dv' not declared in package 'sw/device/tests/sim_dv' defined by /nightly/current_run/opentitan/sw/device/tests/sim_dv/BUILD
ERROR: Build did NOT complete successfully
_run_cmd -> had a non-zero return code of 1.
make: *** [/nightly/current_run/opentitan/hw/dv/tools/dvsim/sim.mk:58: sw_build] Error 1
chip_sw_sram_ctrl_execution_main 102976243430118315188042508970243681515091193024990951252793008328416370618414 None
Use --verbose_failures to see the command lines of failed build steps.
ERROR: Analysis of target '//sw/device/tests/sim_dv:sram_ctrl_execution_main_test_sim_dv' failed; build aborted: Target //sw/device/tests/sim_dv:sram_ctrl_execution_main_test_sim_dv is incompatible and cannot be built, but was explicitly requested.
Dependency chain:
//sw/device/tests/sim_dv:sram_ctrl_execution_main_test_sim_dv (ca9a07) <-- target platform (//toolchain:opentitan_platform) didn't satisfy constraint @@platforms//:incompatible
INFO: Elapsed time: 0.362s, Critical Path: 0.04s
INFO: 1 process: 1 internal.
ERROR: Build did NOT complete successfully
_run_cmd -> had a non-zero return code of 1.
make: *** [/nightly/current_run/opentitan/hw/dv/tools/dvsim/sim.mk:58: sw_build] Error 1
chip_sw_coremark 68702719845204693455034634119801705922101479774712454660974360490947232235656 None
Another command (pid=521802) is running. Waiting for it to complete on the server (server_pid=201955)...
WARNING: Target pattern parsing failed.
ERROR: Skipping '//third_party/coremark/top_darjeeling:coremark_test_sim_dv': no such package 'third_party/coremark/top_darjeeling': BUILD file not found in any of the following directories. Add a BUILD file to a directory to mark it as a package.
- third_party/coremark/top_darjeeling
ERROR: no such package 'third_party/coremark/top_darjeeling': BUILD file not found in any of the following directories. Add a BUILD file to a directory to mark it as a package.
- third_party/coremark/top_darjeeling
ERROR: Build did NOT complete successfully
_run_cmd -> had a non-zero return code of 1.
make: *** [/nightly/current_run/opentitan/hw/dv/tools/dvsim/sim.mk:58: sw_build] Error 1
chip_sw_clkmgr_reset_frequency 81113960615576480128508340584047164885965946988210438685801457738158301480026 None
Use --verbose_failures to see the command lines of failed build steps.
ERROR: Analysis of target '//sw/device/tests:clkmgr_reset_frequency_test_sim_dv' failed; build aborted: Target //sw/device/tests:clkmgr_reset_frequency_test_sim_dv is incompatible and cannot be built, but was explicitly requested.
Dependency chain:
//sw/device/tests:clkmgr_reset_frequency_test_sim_dv (ca9a07) <-- target platform (//toolchain:opentitan_platform) didn't satisfy constraint @@platforms//:incompatible
INFO: Elapsed time: 0.486s, Critical Path: 0.04s
INFO: 1 process: 1 internal.
ERROR: Build did NOT complete successfully
_run_cmd -> had a non-zero return code of 1.
make: *** [/nightly/current_run/opentitan/hw/dv/tools/dvsim/sim.mk:58: sw_build] Error 1
chip_sw_clkmgr_sleep_frequency 72996312093937566131562053091656486384672201087050074866325348185623755807289 None
Use --verbose_failures to see the command lines of failed build steps.
ERROR: Analysis of target '//sw/device/tests:clkmgr_sleep_frequency_test_sim_dv' failed; build aborted: Target //sw/device/tests:clkmgr_sleep_frequency_test_sim_dv is incompatible and cannot be built, but was explicitly requested.
Dependency chain:
//sw/device/tests:clkmgr_sleep_frequency_test_sim_dv (ca9a07) <-- target platform (//toolchain:opentitan_platform) didn't satisfy constraint @@platforms//:incompatible
INFO: Elapsed time: 0.429s, Critical Path: 0.03s
INFO: 1 process: 1 internal.
ERROR: Build did NOT complete successfully
_run_cmd -> had a non-zero return code of 1.
make: *** [/nightly/current_run/opentitan/hw/dv/tools/dvsim/sim.mk:58: sw_build] Error 1
chip_sw_ast_clk_outputs 57879576257768252624111953484026817282379123875814615584826306967811504513691 None
Use --verbose_failures to see the command lines of failed build steps.
ERROR: Analysis of target '//sw/device/tests:ast_clk_outs_test_sim_dv' failed; build aborted: Target //sw/device/tests:ast_clk_outs_test_sim_dv is incompatible and cannot be built, but was explicitly requested.
Dependency chain:
//sw/device/tests:ast_clk_outs_test_sim_dv (ca9a07) <-- target platform (//toolchain:opentitan_platform) didn't satisfy constraint @@platforms//:incompatible
INFO: Elapsed time: 0.475s, Critical Path: 0.04s
INFO: 1 process: 1 internal.
ERROR: Build did NOT complete successfully
_run_cmd -> had a non-zero return code of 1.
make: *** [/nightly/current_run/opentitan/hw/dv/tools/dvsim/sim.mk:58: sw_build] Error 1
chip_sw_lc_ctrl_program_error 61442891245104597904318943689836137881819019069580300816845066346745044539910 None
Use --verbose_failures to see the command lines of failed build steps.
ERROR: Analysis of target '//sw/device/tests/sim_dv:lc_ctrl_program_error_sim_dv' failed; build aborted: Target //sw/device/tests/sim_dv:lc_ctrl_program_error_sim_dv is incompatible and cannot be built, but was explicitly requested.
Dependency chain:
//sw/device/tests/sim_dv:lc_ctrl_program_error_sim_dv (ca9a07) <-- target platform (//toolchain:opentitan_platform) didn't satisfy constraint @@platforms//:incompatible
INFO: Elapsed time: 0.421s, Critical Path: 0.04s
INFO: 1 process: 1 internal.
ERROR: Build did NOT complete successfully
_run_cmd -> had a non-zero return code of 1.
make: *** [/nightly/current_run/opentitan/hw/dv/tools/dvsim/sim.mk:58: sw_build] Error 1
chip_sw_rv_dm_ndm_reset_req_when_cpu_halted 29974933672319992319866922192147008251917887389111259708085743014842722161007 None
---- STDOUT ----
---- STDERR ----
WARNING: Target pattern parsing failed.
ERROR: Skipping '//sw/device/tests:rv_dm_ndm_reset_req_when_cpu_halted_sim_dv': no such target '//sw/device/tests:rv_dm_ndm_reset_req_when_cpu_halted_sim_dv': target 'rv_dm_ndm_reset_req_when_cpu_halted_sim_dv' not declared in package 'sw/device/tests' defined by /nightly/current_run/opentitan/sw/device/tests/BUILD (did you mean rv_dm_ndm_reset_req_when_cpu_halted_dev_sim_dv, or rv_dm_ndm_reset_req_when_cpu_halted_rma_sim_dv?)
ERROR: no such target '//sw/device/tests:rv_dm_ndm_reset_req_when_cpu_halted_sim_dv': target 'rv_dm_ndm_reset_req_when_cpu_halted_sim_dv' not declared in package 'sw/device/tests' defined by /nightly/current_run/opentitan/sw/device/tests/BUILD (did you mean rv_dm_ndm_reset_req_when_cpu_halted_dev_sim_dv, or rv_dm_ndm_reset_req_when_cpu_halted_rma_sim_dv?)
ERROR: Build did NOT complete successfully
_run_cmd -> had a non-zero return code of 1.
make: *** [/nightly/current_run/opentitan/hw/dv/tools/dvsim/sim.mk:58: sw_build] Error 1
chip_sw_rv_dm_access_after_wakeup 50498716290493146148722039168750011831973196445492168818587491986372436997964 None
---- STDOUT ----
---- STDERR ----
WARNING: Target pattern parsing failed.
ERROR: Skipping '//sw/device/tests:rv_dm_access_after_wakeup_sim_dv': no such target '//sw/device/tests:rv_dm_access_after_wakeup_sim_dv': target 'rv_dm_access_after_wakeup_sim_dv' not declared in package 'sw/device/tests' defined by /nightly/current_run/opentitan/sw/device/tests/BUILD (did you mean rv_dm_access_after_wakeup_dev_sim_dv, or rv_dm_access_after_wakeup_rma_sim_dv?)
ERROR: no such target '//sw/device/tests:rv_dm_access_after_wakeup_sim_dv': target 'rv_dm_access_after_wakeup_sim_dv' not declared in package 'sw/device/tests' defined by /nightly/current_run/opentitan/sw/device/tests/BUILD (did you mean rv_dm_access_after_wakeup_dev_sim_dv, or rv_dm_access_after_wakeup_rma_sim_dv?)
ERROR: Build did NOT complete successfully
_run_cmd -> had a non-zero return code of 1.
make: *** [/nightly/current_run/opentitan/hw/dv/tools/dvsim/sim.mk:58: sw_build] Error 1
chip_sw_rv_dm_access_after_escalation_reset 101457233542412301342274641680335219864999895090705035924445072037252440140322 None
Use --verbose_failures to see the command lines of failed build steps.
ERROR: Analysis of target '//sw/device/tests:alert_handler_escalation_test_sim_dv' failed; build aborted: Target //sw/device/tests:alert_handler_escalation_test_sim_dv is incompatible and cannot be built, but was explicitly requested.
Dependency chain:
//sw/device/tests:alert_handler_escalation_test_sim_dv (ca9a07) <-- target platform (//toolchain:opentitan_platform) didn't satisfy constraint @@platforms//:incompatible
INFO: Elapsed time: 0.435s, Critical Path: 0.04s
INFO: 1 process: 1 internal.
ERROR: Build did NOT complete successfully
_run_cmd -> had a non-zero return code of 1.
make: *** [/nightly/current_run/opentitan/hw/dv/tools/dvsim/sim.mk:58: sw_build] Error 1
chip_sw_power_virus 110641068846019431936657219600384610150709857375085956732268264032760758471333 None
Use --verbose_failures to see the command lines of failed build steps.
ERROR: Analysis of target '//sw/device/tests:power_virus_systemtest_sim_dv' failed; build aborted: Target //sw/device/tests:power_virus_systemtest_sim_dv is incompatible and cannot be built, but was explicitly requested.
Dependency chain:
//sw/device/tests:power_virus_systemtest_sim_dv (ca9a07) <-- target platform (//toolchain:opentitan_platform) didn't satisfy constraint @@platforms//:incompatible
INFO: Elapsed time: 0.693s, Critical Path: 0.01s
INFO: 1 process: 1 internal.
ERROR: Build did NOT complete successfully
_run_cmd -> had a non-zero return code of 1.
make: *** [/nightly/current_run/opentitan/hw/dv/tools/dvsim/sim.mk:58: sw_build] Error 1
base_rom_e2e_smoke 84779415144327267310365705357998682777655202184135936033667893779833752035843 None
_deploy_software_collateral(args)
~~~~~~~~~~~~~~~~~~~~~~~~~~~^^^^^^
File "/nightly/current_run/opentitan/util/py/scripts/build_sw_collateral_for_sim.py", line 329, in _deploy_software_collateral
image_string = ImageString(image)
File "<string>", line 4, in __init__
File "/nightly/current_run/opentitan/util/py/scripts/build_sw_collateral_for_sim.py", line 261, in __post_init__
assert flag in KNOWN_FLAGS, f"Unknown flag '{flag}' used in sw_image '{self.raw}'"
^^^^^^^^^^^^^^^^^^^
AssertionError: Unknown flag 'test_in_second_rom' used in sw_image '//sw/device/silicon_creator/rom/e2e:base_rom_e2e_smoke:7:test_in_second_rom'
make: *** [/nightly/current_run/opentitan/hw/dv/tools/dvsim/sim.mk:58: sw_build] Error 1
rom_e2e_smoke 8459283814494834169704576200939204962531751056021848540186373913352612998430 None
---- STDOUT ----
---- STDERR ----
WARNING: Target pattern parsing failed.
ERROR: Skipping '//sw/device/silicon_creator/rom/e2e:empty_test_slot_a_sim_dv': no such target '//sw/device/silicon_creator/rom/e2e:empty_test_slot_a_sim_dv': target 'empty_test_slot_a_sim_dv' not declared in package 'sw/device/silicon_creator/rom/e2e' defined by /nightly/current_run/opentitan/sw/device/silicon_creator/rom/e2e/BUILD
ERROR: no such target '//sw/device/silicon_creator/rom/e2e:empty_test_slot_a_sim_dv': target 'empty_test_slot_a_sim_dv' not declared in package 'sw/device/silicon_creator/rom/e2e' defined by /nightly/current_run/opentitan/sw/device/silicon_creator/rom/e2e/BUILD
ERROR: Build did NOT complete successfully
_run_cmd -> had a non-zero return code of 1.
make: *** [/nightly/current_run/opentitan/hw/dv/tools/dvsim/sim.mk:58: sw_build] Error 1
rom_e2e_shutdown_exception_c 66262756888611878878483746710691429089899900126789540220003582990949151671499 None
Another command (pid=588600) is running. Waiting for it to complete on the server (server_pid=201955)...
Another command (pid=597861) is running. Waiting for it to complete on the server (server_pid=201955)...
Another command (pid=602334) is running. Waiting for it to complete on the server (server_pid=201955)...
WARNING: Target pattern parsing failed.
ERROR: Skipping '//sw/device/silicon_creator/rom:rom_with_fake_keys_sim_dv': no such target '//sw/device/silicon_creator/rom:rom_with_fake_keys_sim_dv': target 'rom_with_fake_keys_sim_dv' not declared in package 'sw/device/silicon_creator/rom' defined by /nightly/current_run/opentitan/sw/device/silicon_creator/rom/BUILD
ERROR: no such target '//sw/device/silicon_creator/rom:rom_with_fake_keys_sim_dv': target 'rom_with_fake_keys_sim_dv' not declared in package 'sw/device/silicon_creator/rom' defined by /nightly/current_run/opentitan/sw/device/silicon_creator/rom/BUILD
ERROR: Build did NOT complete successfully
_run_cmd -> had a non-zero return code of 1.
make: *** [/nightly/current_run/opentitan/hw/dv/tools/dvsim/sim.mk:58: sw_build] Error 1
rom_e2e_shutdown_output 29170186459880061365280185379468103319820970580657681819965739536128877547384 None
Another command (pid=609224) is running. Waiting for it to complete on the server (server_pid=201955)...
Another command (pid=601985) is running. Waiting for it to complete on the server (server_pid=201955)...
Another command (pid=618903) is running. Waiting for it to complete on the server (server_pid=201955)...
WARNING: Target pattern parsing failed.
ERROR: Skipping '//sw/device/silicon_creator/rom/e2e:empty_test_slot_a_sim_dv': no such target '//sw/device/silicon_creator/rom/e2e:empty_test_slot_a_sim_dv': target 'empty_test_slot_a_sim_dv' not declared in package 'sw/device/silicon_creator/rom/e2e' defined by /nightly/current_run/opentitan/sw/device/silicon_creator/rom/e2e/BUILD
ERROR: no such target '//sw/device/silicon_creator/rom/e2e:empty_test_slot_a_sim_dv': target 'empty_test_slot_a_sim_dv' not declared in package 'sw/device/silicon_creator/rom/e2e' defined by /nightly/current_run/opentitan/sw/device/silicon_creator/rom/e2e/BUILD
ERROR: Build did NOT complete successfully
_run_cmd -> had a non-zero return code of 1.
make: *** [/nightly/current_run/opentitan/hw/dv/tools/dvsim/sim.mk:58: sw_build] Error 1
rom_e2e_boot_policy_valid_a_good_b_good_test_unlocked0 39283888999880739835806795560243910999755478198895411359911951480503083022590 None
Another command (pid=372171) is running. Waiting for it to complete on the server (server_pid=201955)...
Another command (pid=331444) is running. Waiting for it to complete on the server (server_pid=201955)...
Another command (pid=382001) is running. Waiting for it to complete on the server (server_pid=201955)...
WARNING: Target pattern parsing failed.
ERROR: Skipping '//sw/device/silicon_creator/rom/e2e:empty_test_slot_a_sim_dv': no such target '//sw/device/silicon_creator/rom/e2e:empty_test_slot_a_sim_dv': target 'empty_test_slot_a_sim_dv' not declared in package 'sw/device/silicon_creator/rom/e2e' defined by /nightly/current_run/opentitan/sw/device/silicon_creator/rom/e2e/BUILD
ERROR: no such target '//sw/device/silicon_creator/rom/e2e:empty_test_slot_a_sim_dv': target 'empty_test_slot_a_sim_dv' not declared in package 'sw/device/silicon_creator/rom/e2e' defined by /nightly/current_run/opentitan/sw/device/silicon_creator/rom/e2e/BUILD
ERROR: Build did NOT complete successfully
_run_cmd -> had a non-zero return code of 1.
make: *** [/nightly/current_run/opentitan/hw/dv/tools/dvsim/sim.mk:58: sw_build] Error 1
rom_e2e_boot_policy_valid_a_good_b_good_dev 44467979883268592093808937225072265630609433232908375856018227793504823933582 None
---- STDOUT ----
---- STDERR ----
WARNING: Target pattern parsing failed.
ERROR: Skipping '//sw/device/silicon_creator/rom/e2e:empty_test_slot_a_sim_dv': no such target '//sw/device/silicon_creator/rom/e2e:empty_test_slot_a_sim_dv': target 'empty_test_slot_a_sim_dv' not declared in package 'sw/device/silicon_creator/rom/e2e' defined by /nightly/current_run/opentitan/sw/device/silicon_creator/rom/e2e/BUILD
ERROR: no such target '//sw/device/silicon_creator/rom/e2e:empty_test_slot_a_sim_dv': target 'empty_test_slot_a_sim_dv' not declared in package 'sw/device/silicon_creator/rom/e2e' defined by /nightly/current_run/opentitan/sw/device/silicon_creator/rom/e2e/BUILD
ERROR: Build did NOT complete successfully
_run_cmd -> had a non-zero return code of 1.
make: *** [/nightly/current_run/opentitan/hw/dv/tools/dvsim/sim.mk:58: sw_build] Error 1
rom_e2e_boot_policy_valid_a_good_b_good_prod 67620718389612121332263175233907726695292700192354778243409085008959642404403 None
---- STDOUT ----
---- STDERR ----
WARNING: Target pattern parsing failed.
ERROR: Skipping '//sw/device/silicon_creator/rom/e2e:empty_test_slot_a_sim_dv': no such target '//sw/device/silicon_creator/rom/e2e:empty_test_slot_a_sim_dv': target 'empty_test_slot_a_sim_dv' not declared in package 'sw/device/silicon_creator/rom/e2e' defined by /nightly/current_run/opentitan/sw/device/silicon_creator/rom/e2e/BUILD
ERROR: no such target '//sw/device/silicon_creator/rom/e2e:empty_test_slot_a_sim_dv': target 'empty_test_slot_a_sim_dv' not declared in package 'sw/device/silicon_creator/rom/e2e' defined by /nightly/current_run/opentitan/sw/device/silicon_creator/rom/e2e/BUILD
ERROR: Build did NOT complete successfully
_run_cmd -> had a non-zero return code of 1.
make: *** [/nightly/current_run/opentitan/hw/dv/tools/dvsim/sim.mk:58: sw_build] Error 1
rom_e2e_boot_policy_valid_a_good_b_good_prod_end 101801796790808233489256899032063451576285561790988115704969365944816318609868 None
---- STDOUT ----
---- STDERR ----
WARNING: Target pattern parsing failed.
ERROR: Skipping '//sw/device/silicon_creator/rom/e2e:empty_test_slot_a_sim_dv': no such target '//sw/device/silicon_creator/rom/e2e:empty_test_slot_a_sim_dv': target 'empty_test_slot_a_sim_dv' not declared in package 'sw/device/silicon_creator/rom/e2e' defined by /nightly/current_run/opentitan/sw/device/silicon_creator/rom/e2e/BUILD
ERROR: no such target '//sw/device/silicon_creator/rom/e2e:empty_test_slot_a_sim_dv': target 'empty_test_slot_a_sim_dv' not declared in package 'sw/device/silicon_creator/rom/e2e' defined by /nightly/current_run/opentitan/sw/device/silicon_creator/rom/e2e/BUILD
ERROR: Build did NOT complete successfully
_run_cmd -> had a non-zero return code of 1.
make: *** [/nightly/current_run/opentitan/hw/dv/tools/dvsim/sim.mk:58: sw_build] Error 1
rom_e2e_boot_policy_valid_a_good_b_good_rma 47587244829567091161973927889438559842328860905489033703654677259510112214628 None
---- STDERR ----
Another command (pid=566439) is running. Waiting for it to complete on the server (server_pid=201955)...
WARNING: Target pattern parsing failed.
ERROR: Skipping '//sw/device/silicon_creator/rom/e2e:empty_test_slot_a_sim_dv': no such target '//sw/device/silicon_creator/rom/e2e:empty_test_slot_a_sim_dv': target 'empty_test_slot_a_sim_dv' not declared in package 'sw/device/silicon_creator/rom/e2e' defined by /nightly/current_run/opentitan/sw/device/silicon_creator/rom/e2e/BUILD
ERROR: no such target '//sw/device/silicon_creator/rom/e2e:empty_test_slot_a_sim_dv': target 'empty_test_slot_a_sim_dv' not declared in package 'sw/device/silicon_creator/rom/e2e' defined by /nightly/current_run/opentitan/sw/device/silicon_creator/rom/e2e/BUILD
ERROR: Build did NOT complete successfully
_run_cmd -> had a non-zero return code of 1.
make: *** [/nightly/current_run/opentitan/hw/dv/tools/dvsim/sim.mk:58: sw_build] Error 1
rom_e2e_boot_policy_valid_a_good_b_bad_test_unlocked0 54019880780806012368048781195770534798061205224096782554931151922572406471230 None
Another command (pid=346950) is running. Waiting for it to complete on the server (server_pid=201955)...
Another command (pid=322616) is running. Waiting for it to complete on the server (server_pid=201955)...
Another command (pid=331444) is running. Waiting for it to complete on the server (server_pid=201955)...
WARNING: Target pattern parsing failed.
ERROR: Skipping '//sw/device/silicon_creator/rom/e2e:empty_test_slot_a_sim_dv': no such target '//sw/device/silicon_creator/rom/e2e:empty_test_slot_a_sim_dv': target 'empty_test_slot_a_sim_dv' not declared in package 'sw/device/silicon_creator/rom/e2e' defined by /nightly/current_run/opentitan/sw/device/silicon_creator/rom/e2e/BUILD
ERROR: no such target '//sw/device/silicon_creator/rom/e2e:empty_test_slot_a_sim_dv': target 'empty_test_slot_a_sim_dv' not declared in package 'sw/device/silicon_creator/rom/e2e' defined by /nightly/current_run/opentitan/sw/device/silicon_creator/rom/e2e/BUILD
ERROR: Build did NOT complete successfully
_run_cmd -> had a non-zero return code of 1.
make: *** [/nightly/current_run/opentitan/hw/dv/tools/dvsim/sim.mk:58: sw_build] Error 1
rom_e2e_boot_policy_valid_a_good_b_bad_dev 10766570883521228180048787338784365285468183825576665277198881889811523315719 None
---- STDERR ----
Another command (pid=553583) is running. Waiting for it to complete on the server (server_pid=201955)...
WARNING: Target pattern parsing failed.
ERROR: Skipping '//sw/device/silicon_creator/rom/e2e:empty_test_slot_a_sim_dv': no such target '//sw/device/silicon_creator/rom/e2e:empty_test_slot_a_sim_dv': target 'empty_test_slot_a_sim_dv' not declared in package 'sw/device/silicon_creator/rom/e2e' defined by /nightly/current_run/opentitan/sw/device/silicon_creator/rom/e2e/BUILD
ERROR: no such target '//sw/device/silicon_creator/rom/e2e:empty_test_slot_a_sim_dv': target 'empty_test_slot_a_sim_dv' not declared in package 'sw/device/silicon_creator/rom/e2e' defined by /nightly/current_run/opentitan/sw/device/silicon_creator/rom/e2e/BUILD
ERROR: Build did NOT complete successfully
_run_cmd -> had a non-zero return code of 1.
make: *** [/nightly/current_run/opentitan/hw/dv/tools/dvsim/sim.mk:58: sw_build] Error 1
rom_e2e_boot_policy_valid_a_good_b_bad_prod 100250654973629681782727766000448153637644509301840665676996562591159489824004 None
---- STDERR ----
Another command (pid=555517) is running. Waiting for it to complete on the server (server_pid=201955)...
WARNING: Target pattern parsing failed.
ERROR: Skipping '//sw/device/silicon_creator/rom/e2e:empty_test_slot_a_sim_dv': no such target '//sw/device/silicon_creator/rom/e2e:empty_test_slot_a_sim_dv': target 'empty_test_slot_a_sim_dv' not declared in package 'sw/device/silicon_creator/rom/e2e' defined by /nightly/current_run/opentitan/sw/device/silicon_creator/rom/e2e/BUILD
ERROR: no such target '//sw/device/silicon_creator/rom/e2e:empty_test_slot_a_sim_dv': target 'empty_test_slot_a_sim_dv' not declared in package 'sw/device/silicon_creator/rom/e2e' defined by /nightly/current_run/opentitan/sw/device/silicon_creator/rom/e2e/BUILD
ERROR: Build did NOT complete successfully
_run_cmd -> had a non-zero return code of 1.
make: *** [/nightly/current_run/opentitan/hw/dv/tools/dvsim/sim.mk:58: sw_build] Error 1
rom_e2e_boot_policy_valid_a_good_b_bad_prod_end 99942458762846149269846897314801998508024059352441365103885758188529480429341 None
---- STDERR ----
Another command (pid=553641) is running. Waiting for it to complete on the server (server_pid=201955)...
Another command (pid=556658) is running. Waiting for it to complete on the server (server_pid=201955)...
WARNING: Target pattern parsing failed.
ERROR: Skipping '//sw/device/silicon_creator/rom/e2e:empty_test_slot_a_sim_dv': no such target '//sw/device/silicon_creator/rom/e2e:empty_test_slot_a_sim_dv': target 'empty_test_slot_a_sim_dv' not declared in package 'sw/device/silicon_creator/rom/e2e' defined by /nightly/current_run/opentitan/sw/device/silicon_creator/rom/e2e/BUILD
ERROR: no such target '//sw/device/silicon_creator/rom/e2e:empty_test_slot_a_sim_dv': target 'empty_test_slot_a_sim_dv' not declared in package 'sw/device/silicon_creator/rom/e2e' defined by /nightly/current_run/opentitan/sw/device/silicon_creator/rom/e2e/BUILD
ERROR: Build did NOT complete successfully
_run_cmd -> had a non-zero return code of 1.
make: *** [/nightly/current_run/opentitan/hw/dv/tools/dvsim/sim.mk:58: sw_build] Error 1
rom_e2e_boot_policy_valid_a_good_b_bad_rma 98605950333712713946286035349733938200046880917458097704407386819930442869182 None
---- STDOUT ----
---- STDERR ----
WARNING: Target pattern parsing failed.
ERROR: Skipping '//sw/device/silicon_creator/rom/e2e:empty_test_slot_a_sim_dv': no such target '//sw/device/silicon_creator/rom/e2e:empty_test_slot_a_sim_dv': target 'empty_test_slot_a_sim_dv' not declared in package 'sw/device/silicon_creator/rom/e2e' defined by /nightly/current_run/opentitan/sw/device/silicon_creator/rom/e2e/BUILD
ERROR: no such target '//sw/device/silicon_creator/rom/e2e:empty_test_slot_a_sim_dv': target 'empty_test_slot_a_sim_dv' not declared in package 'sw/device/silicon_creator/rom/e2e' defined by /nightly/current_run/opentitan/sw/device/silicon_creator/rom/e2e/BUILD
ERROR: Build did NOT complete successfully
_run_cmd -> had a non-zero return code of 1.
make: *** [/nightly/current_run/opentitan/hw/dv/tools/dvsim/sim.mk:58: sw_build] Error 1
rom_e2e_boot_policy_valid_a_bad_b_good_test_unlocked0 33659466331183436219434012743878021452118401957189675636400973075862718206985 None
---- STDERR ----
Another command (pid=329364) is running. Waiting for it to complete on the server (server_pid=201955)...
WARNING: Target pattern parsing failed.
ERROR: Skipping '//sw/device/silicon_creator/rom/e2e:empty_test_slot_b_sim_dv': no such target '//sw/device/silicon_creator/rom/e2e:empty_test_slot_b_sim_dv': target 'empty_test_slot_b_sim_dv' not declared in package 'sw/device/silicon_creator/rom/e2e' defined by /nightly/current_run/opentitan/sw/device/silicon_creator/rom/e2e/BUILD
ERROR: no such target '//sw/device/silicon_creator/rom/e2e:empty_test_slot_b_sim_dv': target 'empty_test_slot_b_sim_dv' not declared in package 'sw/device/silicon_creator/rom/e2e' defined by /nightly/current_run/opentitan/sw/device/silicon_creator/rom/e2e/BUILD
ERROR: Build did NOT complete successfully
_run_cmd -> had a non-zero return code of 1.
make: *** [/nightly/current_run/opentitan/hw/dv/tools/dvsim/sim.mk:58: sw_build] Error 1
rom_e2e_boot_policy_valid_a_bad_b_good_dev 69644903018454832669479945685712978568697338711490226079456646363238130484547 None
Another command (pid=552105) is running. Waiting for it to complete on the server (server_pid=201955)...
Another command (pid=551392) is running. Waiting for it to complete on the server (server_pid=201955)...
Another command (pid=553583) is running. Waiting for it to complete on the server (server_pid=201955)...
WARNING: Target pattern parsing failed.
ERROR: Skipping '//sw/device/silicon_creator/rom/e2e:empty_test_slot_b_sim_dv': no such target '//sw/device/silicon_creator/rom/e2e:empty_test_slot_b_sim_dv': target 'empty_test_slot_b_sim_dv' not declared in package 'sw/device/silicon_creator/rom/e2e' defined by /nightly/current_run/opentitan/sw/device/silicon_creator/rom/e2e/BUILD
ERROR: no such target '//sw/device/silicon_creator/rom/e2e:empty_test_slot_b_sim_dv': target 'empty_test_slot_b_sim_dv' not declared in package 'sw/device/silicon_creator/rom/e2e' defined by /nightly/current_run/opentitan/sw/device/silicon_creator/rom/e2e/BUILD
ERROR: Build did NOT complete successfully
_run_cmd -> had a non-zero return code of 1.
make: *** [/nightly/current_run/opentitan/hw/dv/tools/dvsim/sim.mk:58: sw_build] Error 1
rom_e2e_boot_policy_valid_a_bad_b_good_prod 24168294212618675842255022249619552881822793753055075488151855561766560911161 None
Another command (pid=555517) is running. Waiting for it to complete on the server (server_pid=201955)...
Another command (pid=552679) is running. Waiting for it to complete on the server (server_pid=201955)...
Another command (pid=553641) is running. Waiting for it to complete on the server (server_pid=201955)...
WARNING: Target pattern parsing failed.
ERROR: Skipping '//sw/device/silicon_creator/rom/e2e:empty_test_slot_b_sim_dv': no such target '//sw/device/silicon_creator/rom/e2e:empty_test_slot_b_sim_dv': target 'empty_test_slot_b_sim_dv' not declared in package 'sw/device/silicon_creator/rom/e2e' defined by /nightly/current_run/opentitan/sw/device/silicon_creator/rom/e2e/BUILD
ERROR: no such target '//sw/device/silicon_creator/rom/e2e:empty_test_slot_b_sim_dv': target 'empty_test_slot_b_sim_dv' not declared in package 'sw/device/silicon_creator/rom/e2e' defined by /nightly/current_run/opentitan/sw/device/silicon_creator/rom/e2e/BUILD
ERROR: Build did NOT complete successfully
_run_cmd -> had a non-zero return code of 1.
make: *** [/nightly/current_run/opentitan/hw/dv/tools/dvsim/sim.mk:58: sw_build] Error 1
rom_e2e_boot_policy_valid_a_bad_b_good_prod_end 96272109000686561855402743518016969051892663194692621260948297232436690405580 None
---- STDERR ----
Another command (pid=555649) is running. Waiting for it to complete on the server (server_pid=201955)...
Another command (pid=556273) is running. Waiting for it to complete on the server (server_pid=201955)...
WARNING: Target pattern parsing failed.
ERROR: Skipping '//sw/device/silicon_creator/rom/e2e:empty_test_slot_b_sim_dv': no such target '//sw/device/silicon_creator/rom/e2e:empty_test_slot_b_sim_dv': target 'empty_test_slot_b_sim_dv' not declared in package 'sw/device/silicon_creator/rom/e2e' defined by /nightly/current_run/opentitan/sw/device/silicon_creator/rom/e2e/BUILD
ERROR: no such target '//sw/device/silicon_creator/rom/e2e:empty_test_slot_b_sim_dv': target 'empty_test_slot_b_sim_dv' not declared in package 'sw/device/silicon_creator/rom/e2e' defined by /nightly/current_run/opentitan/sw/device/silicon_creator/rom/e2e/BUILD
ERROR: Build did NOT complete successfully
_run_cmd -> had a non-zero return code of 1.
make: *** [/nightly/current_run/opentitan/hw/dv/tools/dvsim/sim.mk:58: sw_build] Error 1
rom_e2e_boot_policy_valid_a_bad_b_good_rma 54809150452828506515621125549469848077342036936672455325180548611610198262674 None
---- STDOUT ----
---- STDERR ----
WARNING: Target pattern parsing failed.
ERROR: Skipping '//sw/device/silicon_creator/rom/e2e:empty_test_slot_b_sim_dv': no such target '//sw/device/silicon_creator/rom/e2e:empty_test_slot_b_sim_dv': target 'empty_test_slot_b_sim_dv' not declared in package 'sw/device/silicon_creator/rom/e2e' defined by /nightly/current_run/opentitan/sw/device/silicon_creator/rom/e2e/BUILD
ERROR: no such target '//sw/device/silicon_creator/rom/e2e:empty_test_slot_b_sim_dv': target 'empty_test_slot_b_sim_dv' not declared in package 'sw/device/silicon_creator/rom/e2e' defined by /nightly/current_run/opentitan/sw/device/silicon_creator/rom/e2e/BUILD
ERROR: Build did NOT complete successfully
_run_cmd -> had a non-zero return code of 1.
make: *** [/nightly/current_run/opentitan/hw/dv/tools/dvsim/sim.mk:58: sw_build] Error 1
rom_e2e_sigverify_always_a_bad_b_bad_test_unlocked0 85637265551974500268329683903647856839827629581554085177825080618965561020553 None
---- STDERR ----
Another command (pid=323731) is running. Waiting for it to complete on the server (server_pid=201955)...
WARNING: Target pattern parsing failed.
ERROR: Skipping '//sw/device/silicon_creator/rom/e2e:otp_img_sigverify_always_test_unlocked0': no such target '//sw/device/silicon_creator/rom/e2e:otp_img_sigverify_always_test_unlocked0': target 'otp_img_sigverify_always_test_unlocked0' not declared in package 'sw/device/silicon_creator/rom/e2e' defined by /nightly/current_run/opentitan/sw/device/silicon_creator/rom/e2e/BUILD
ERROR: no such target '//sw/device/silicon_creator/rom/e2e:otp_img_sigverify_always_test_unlocked0': target 'otp_img_sigverify_always_test_unlocked0' not declared in package 'sw/device/silicon_creator/rom/e2e' defined by /nightly/current_run/opentitan/sw/device/silicon_creator/rom/e2e/BUILD
ERROR: Build did NOT complete successfully
_run_cmd -> had a non-zero return code of 1.
make: *** [/nightly/current_run/opentitan/hw/dv/tools/dvsim/sim.mk:58: sw_build] Error 1
rom_e2e_sigverify_always_a_bad_b_bad_dev 26863243924162064914217202128448966073383485418095151867675934244792255302814 None
---- STDERR ----
Another command (pid=602334) is running. Waiting for it to complete on the server (server_pid=201955)...
Another command (pid=574386) is running. Waiting for it to complete on the server (server_pid=201955)...
WARNING: Target pattern parsing failed.
ERROR: Skipping '//sw/device/silicon_creator/rom/e2e:otp_img_sigverify_always_dev': no such target '//sw/device/silicon_creator/rom/e2e:otp_img_sigverify_always_dev': target 'otp_img_sigverify_always_dev' not declared in package 'sw/device/silicon_creator/rom/e2e' defined by /nightly/current_run/opentitan/sw/device/silicon_creator/rom/e2e/BUILD
ERROR: no such target '//sw/device/silicon_creator/rom/e2e:otp_img_sigverify_always_dev': target 'otp_img_sigverify_always_dev' not declared in package 'sw/device/silicon_creator/rom/e2e' defined by /nightly/current_run/opentitan/sw/device/silicon_creator/rom/e2e/BUILD
ERROR: Build did NOT complete successfully
_run_cmd -> had a non-zero return code of 1.
make: *** [/nightly/current_run/opentitan/hw/dv/tools/dvsim/sim.mk:58: sw_build] Error 1
rom_e2e_sigverify_always_a_bad_b_bad_prod 77476062860651352884803030355464776543976624551879046214331428769930322546641 None
---- STDERR ----
Another command (pid=623815) is running. Waiting for it to complete on the server (server_pid=201955)...
WARNING: Target pattern parsing failed.
ERROR: Skipping '//sw/device/silicon_creator/rom/e2e:otp_img_sigverify_always_prod': no such target '//sw/device/silicon_creator/rom/e2e:otp_img_sigverify_always_prod': target 'otp_img_sigverify_always_prod' not declared in package 'sw/device/silicon_creator/rom/e2e' defined by /nightly/current_run/opentitan/sw/device/silicon_creator/rom/e2e/BUILD
ERROR: no such target '//sw/device/silicon_creator/rom/e2e:otp_img_sigverify_always_prod': target 'otp_img_sigverify_always_prod' not declared in package 'sw/device/silicon_creator/rom/e2e' defined by /nightly/current_run/opentitan/sw/device/silicon_creator/rom/e2e/BUILD
ERROR: Build did NOT complete successfully
_run_cmd -> had a non-zero return code of 1.
make: *** [/nightly/current_run/opentitan/hw/dv/tools/dvsim/sim.mk:58: sw_build] Error 1
rom_e2e_sigverify_always_a_bad_b_bad_prod_end 1860306866193281586747345588322035743280534487897225686885566384555354286409 None
Another command (pid=625665) is running. Waiting for it to complete on the server (server_pid=201955)...
Another command (pid=622548) is running. Waiting for it to complete on the server (server_pid=201955)...
Another command (pid=623815) is running. Waiting for it to complete on the server (server_pid=201955)...
WARNING: Target pattern parsing failed.
ERROR: Skipping '//sw/device/silicon_creator/rom/e2e:otp_img_sigverify_always_prod_end': no such target '//sw/device/silicon_creator/rom/e2e:otp_img_sigverify_always_prod_end': target 'otp_img_sigverify_always_prod_end' not declared in package 'sw/device/silicon_creator/rom/e2e' defined by /nightly/current_run/opentitan/sw/device/silicon_creator/rom/e2e/BUILD
ERROR: no such target '//sw/device/silicon_creator/rom/e2e:otp_img_sigverify_always_prod_end': target 'otp_img_sigverify_always_prod_end' not declared in package 'sw/device/silicon_creator/rom/e2e' defined by /nightly/current_run/opentitan/sw/device/silicon_creator/rom/e2e/BUILD
ERROR: Build did NOT complete successfully
_run_cmd -> had a non-zero return code of 1.
make: *** [/nightly/current_run/opentitan/hw/dv/tools/dvsim/sim.mk:58: sw_build] Error 1
rom_e2e_sigverify_always_a_bad_b_bad_rma 62790824854583437286818633271289132388723071807053038495836378651895125773101 None
Another command (pid=607862) is running. Waiting for it to complete on the server (server_pid=201955)...
Another command (pid=606648) is running. Waiting for it to complete on the server (server_pid=201955)...
Another command (pid=614043) is running. Waiting for it to complete on the server (server_pid=201955)...
WARNING: Target pattern parsing failed.
ERROR: Skipping '//sw/device/silicon_creator/rom/e2e:otp_img_sigverify_always_rma': no such target '//sw/device/silicon_creator/rom/e2e:otp_img_sigverify_always_rma': target 'otp_img_sigverify_always_rma' not declared in package 'sw/device/silicon_creator/rom/e2e' defined by /nightly/current_run/opentitan/sw/device/silicon_creator/rom/e2e/BUILD
ERROR: no such target '//sw/device/silicon_creator/rom/e2e:otp_img_sigverify_always_rma': target 'otp_img_sigverify_always_rma' not declared in package 'sw/device/silicon_creator/rom/e2e' defined by /nightly/current_run/opentitan/sw/device/silicon_creator/rom/e2e/BUILD
ERROR: Build did NOT complete successfully
_run_cmd -> had a non-zero return code of 1.
make: *** [/nightly/current_run/opentitan/hw/dv/tools/dvsim/sim.mk:58: sw_build] Error 1
rom_e2e_sigverify_always_a_bad_b_nothing_test_unlocked0 7371614995987622612525188375463758618324633567430064181565926366401432716901 None
---- STDERR ----
Another command (pid=322616) is running. Waiting for it to complete on the server (server_pid=201955)...
WARNING: Target pattern parsing failed.
ERROR: Skipping '//sw/device/silicon_creator/rom/e2e:otp_img_sigverify_always_test_unlocked0': no such target '//sw/device/silicon_creator/rom/e2e:otp_img_sigverify_always_test_unlocked0': target 'otp_img_sigverify_always_test_unlocked0' not declared in package 'sw/device/silicon_creator/rom/e2e' defined by /nightly/current_run/opentitan/sw/device/silicon_creator/rom/e2e/BUILD
ERROR: no such target '//sw/device/silicon_creator/rom/e2e:otp_img_sigverify_always_test_unlocked0': target 'otp_img_sigverify_always_test_unlocked0' not declared in package 'sw/device/silicon_creator/rom/e2e' defined by /nightly/current_run/opentitan/sw/device/silicon_creator/rom/e2e/BUILD
ERROR: Build did NOT complete successfully
_run_cmd -> had a non-zero return code of 1.
make: *** [/nightly/current_run/opentitan/hw/dv/tools/dvsim/sim.mk:58: sw_build] Error 1
rom_e2e_sigverify_always_a_bad_b_nothing_dev 38768000579435528671486824315076288773253187047021330240935985052043872667519 None
Another command (pid=619279) is running. Waiting for it to complete on the server (server_pid=201955)...
Another command (pid=626955) is running. Waiting for it to complete on the server (server_pid=201955)...
Another command (pid=633306) is running. Waiting for it to complete on the server (server_pid=201955)...
WARNING: Target pattern parsing failed.
ERROR: Skipping '//sw/device/silicon_creator/rom/e2e:otp_img_sigverify_always_dev': no such target '//sw/device/silicon_creator/rom/e2e:otp_img_sigverify_always_dev': target 'otp_img_sigverify_always_dev' not declared in package 'sw/device/silicon_creator/rom/e2e' defined by /nightly/current_run/opentitan/sw/device/silicon_creator/rom/e2e/BUILD
ERROR: no such target '//sw/device/silicon_creator/rom/e2e:otp_img_sigverify_always_dev': target 'otp_img_sigverify_always_dev' not declared in package 'sw/device/silicon_creator/rom/e2e' defined by /nightly/current_run/opentitan/sw/device/silicon_creator/rom/e2e/BUILD
ERROR: Build did NOT complete successfully
_run_cmd -> had a non-zero return code of 1.
make: *** [/nightly/current_run/opentitan/hw/dv/tools/dvsim/sim.mk:58: sw_build] Error 1
rom_e2e_sigverify_always_a_bad_b_nothing_prod 9972715221974167192268636665713445925564730468262835611079879377845249232715 None
Another command (pid=601985) is running. Waiting for it to complete on the server (server_pid=201955)...
Another command (pid=618903) is running. Waiting for it to complete on the server (server_pid=201955)...
Another command (pid=583282) is running. Waiting for it to complete on the server (server_pid=201955)...
WARNING: Target pattern parsing failed.
ERROR: Skipping '//sw/device/silicon_creator/rom/e2e:otp_img_sigverify_always_prod': no such target '//sw/device/silicon_creator/rom/e2e:otp_img_sigverify_always_prod': target 'otp_img_sigverify_always_prod' not declared in package 'sw/device/silicon_creator/rom/e2e' defined by /nightly/current_run/opentitan/sw/device/silicon_creator/rom/e2e/BUILD
ERROR: no such target '//sw/device/silicon_creator/rom/e2e:otp_img_sigverify_always_prod': target 'otp_img_sigverify_always_prod' not declared in package 'sw/device/silicon_creator/rom/e2e' defined by /nightly/current_run/opentitan/sw/device/silicon_creator/rom/e2e/BUILD
ERROR: Build did NOT complete successfully
_run_cmd -> had a non-zero return code of 1.
make: *** [/nightly/current_run/opentitan/hw/dv/tools/dvsim/sim.mk:58: sw_build] Error 1
rom_e2e_sigverify_always_a_bad_b_nothing_prod_end 115310273293461786377963627065796205767030784707359258524909051255772130720308 None
---- STDERR ----
Another command (pid=629604) is running. Waiting for it to complete on the server (server_pid=201955)...
WARNING: Target pattern parsing failed.
ERROR: Skipping '//sw/device/silicon_creator/rom/e2e:otp_img_sigverify_always_prod_end': no such target '//sw/device/silicon_creator/rom/e2e:otp_img_sigverify_always_prod_end': target 'otp_img_sigverify_always_prod_end' not declared in package 'sw/device/silicon_creator/rom/e2e' defined by /nightly/current_run/opentitan/sw/device/silicon_creator/rom/e2e/BUILD
ERROR: no such target '//sw/device/silicon_creator/rom/e2e:otp_img_sigverify_always_prod_end': target 'otp_img_sigverify_always_prod_end' not declared in package 'sw/device/silicon_creator/rom/e2e' defined by /nightly/current_run/opentitan/sw/device/silicon_creator/rom/e2e/BUILD
ERROR: Build did NOT complete successfully
_run_cmd -> had a non-zero return code of 1.
make: *** [/nightly/current_run/opentitan/hw/dv/tools/dvsim/sim.mk:58: sw_build] Error 1
rom_e2e_sigverify_always_a_bad_b_nothing_rma 99062808506000590274840323378823862918623354730660150003682869503922042609852 None
Another command (pid=619279) is running. Waiting for it to complete on the server (server_pid=201955)...
Another command (pid=626955) is running. Waiting for it to complete on the server (server_pid=201955)...
Another command (pid=633306) is running. Waiting for it to complete on the server (server_pid=201955)...
WARNING: Target pattern parsing failed.
ERROR: Skipping '//sw/device/silicon_creator/rom/e2e:otp_img_sigverify_always_rma': no such target '//sw/device/silicon_creator/rom/e2e:otp_img_sigverify_always_rma': target 'otp_img_sigverify_always_rma' not declared in package 'sw/device/silicon_creator/rom/e2e' defined by /nightly/current_run/opentitan/sw/device/silicon_creator/rom/e2e/BUILD
ERROR: no such target '//sw/device/silicon_creator/rom/e2e:otp_img_sigverify_always_rma': target 'otp_img_sigverify_always_rma' not declared in package 'sw/device/silicon_creator/rom/e2e' defined by /nightly/current_run/opentitan/sw/device/silicon_creator/rom/e2e/BUILD
ERROR: Build did NOT complete successfully
_run_cmd -> had a non-zero return code of 1.
make: *** [/nightly/current_run/opentitan/hw/dv/tools/dvsim/sim.mk:58: sw_build] Error 1
rom_e2e_sigverify_always_a_nothing_b_bad_test_unlocked0 110751610635151888399694952883263983830458063220497371757000172407507183401087 None
Another command (pid=507153) is running. Waiting for it to complete on the server (server_pid=201955)...
Another command (pid=504891) is running. Waiting for it to complete on the server (server_pid=201955)...
Another command (pid=402715) is running. Waiting for it to complete on the server (server_pid=201955)...
WARNING: Target pattern parsing failed.
ERROR: Skipping '//sw/device/silicon_creator/rom/e2e:otp_img_sigverify_always_test_unlocked0': no such target '//sw/device/silicon_creator/rom/e2e:otp_img_sigverify_always_test_unlocked0': target 'otp_img_sigverify_always_test_unlocked0' not declared in package 'sw/device/silicon_creator/rom/e2e' defined by /nightly/current_run/opentitan/sw/device/silicon_creator/rom/e2e/BUILD
ERROR: no such target '//sw/device/silicon_creator/rom/e2e:otp_img_sigverify_always_test_unlocked0': target 'otp_img_sigverify_always_test_unlocked0' not declared in package 'sw/device/silicon_creator/rom/e2e' defined by /nightly/current_run/opentitan/sw/device/silicon_creator/rom/e2e/BUILD
ERROR: Build did NOT complete successfully
_run_cmd -> had a non-zero return code of 1.
make: *** [/nightly/current_run/opentitan/hw/dv/tools/dvsim/sim.mk:58: sw_build] Error 1
rom_e2e_sigverify_always_a_nothing_b_bad_dev 43761543027815931507598557183918545416489353429799584846568742669336010930066 None
Another command (pid=623957) is running. Waiting for it to complete on the server (server_pid=201955)...
Another command (pid=622548) is running. Waiting for it to complete on the server (server_pid=201955)...
Another command (pid=607524) is running. Waiting for it to complete on the server (server_pid=201955)...
WARNING: Target pattern parsing failed.
ERROR: Skipping '//sw/device/silicon_creator/rom/e2e:otp_img_sigverify_always_dev': no such target '//sw/device/silicon_creator/rom/e2e:otp_img_sigverify_always_dev': target 'otp_img_sigverify_always_dev' not declared in package 'sw/device/silicon_creator/rom/e2e' defined by /nightly/current_run/opentitan/sw/device/silicon_creator/rom/e2e/BUILD
ERROR: no such target '//sw/device/silicon_creator/rom/e2e:otp_img_sigverify_always_dev': target 'otp_img_sigverify_always_dev' not declared in package 'sw/device/silicon_creator/rom/e2e' defined by /nightly/current_run/opentitan/sw/device/silicon_creator/rom/e2e/BUILD
ERROR: Build did NOT complete successfully
_run_cmd -> had a non-zero return code of 1.
make: *** [/nightly/current_run/opentitan/hw/dv/tools/dvsim/sim.mk:58: sw_build] Error 1
rom_e2e_sigverify_always_a_nothing_b_bad_prod 39816102351623283465267155165668662000642862246846752235607760271306457662414 None
---- STDERR ----
Another command (pid=618903) is running. Waiting for it to complete on the server (server_pid=201955)...
WARNING: Target pattern parsing failed.
ERROR: Skipping '//sw/device/silicon_creator/rom/e2e:otp_img_sigverify_always_prod': no such target '//sw/device/silicon_creator/rom/e2e:otp_img_sigverify_always_prod': target 'otp_img_sigverify_always_prod' not declared in package 'sw/device/silicon_creator/rom/e2e' defined by /nightly/current_run/opentitan/sw/device/silicon_creator/rom/e2e/BUILD
ERROR: no such target '//sw/device/silicon_creator/rom/e2e:otp_img_sigverify_always_prod': target 'otp_img_sigverify_always_prod' not declared in package 'sw/device/silicon_creator/rom/e2e' defined by /nightly/current_run/opentitan/sw/device/silicon_creator/rom/e2e/BUILD
ERROR: Build did NOT complete successfully
_run_cmd -> had a non-zero return code of 1.
make: *** [/nightly/current_run/opentitan/hw/dv/tools/dvsim/sim.mk:58: sw_build] Error 1
rom_e2e_sigverify_always_a_nothing_b_bad_prod_end 115220776457938397691345719633900064068059566493552645850229866437531848931514 None
---- STDERR ----
Another command (pid=621908) is running. Waiting for it to complete on the server (server_pid=201955)...
Another command (pid=608917) is running. Waiting for it to complete on the server (server_pid=201955)...
WARNING: Target pattern parsing failed.
ERROR: Skipping '//sw/device/silicon_creator/rom/e2e:otp_img_sigverify_always_prod_end': no such target '//sw/device/silicon_creator/rom/e2e:otp_img_sigverify_always_prod_end': target 'otp_img_sigverify_always_prod_end' not declared in package 'sw/device/silicon_creator/rom/e2e' defined by /nightly/current_run/opentitan/sw/device/silicon_creator/rom/e2e/BUILD
ERROR: no such target '//sw/device/silicon_creator/rom/e2e:otp_img_sigverify_always_prod_end': target 'otp_img_sigverify_always_prod_end' not declared in package 'sw/device/silicon_creator/rom/e2e' defined by /nightly/current_run/opentitan/sw/device/silicon_creator/rom/e2e/BUILD
ERROR: Build did NOT complete successfully
_run_cmd -> had a non-zero return code of 1.
make: *** [/nightly/current_run/opentitan/hw/dv/tools/dvsim/sim.mk:58: sw_build] Error 1
rom_e2e_sigverify_always_a_nothing_b_bad_rma 90262348883700434524701785665280566573231221840186227747830824083959322068202 None
---- STDERR ----
Another command (pid=626955) is running. Waiting for it to complete on the server (server_pid=201955)...
WARNING: Target pattern parsing failed.
ERROR: Skipping '//sw/device/silicon_creator/rom/e2e:otp_img_sigverify_always_rma': no such target '//sw/device/silicon_creator/rom/e2e:otp_img_sigverify_always_rma': target 'otp_img_sigverify_always_rma' not declared in package 'sw/device/silicon_creator/rom/e2e' defined by /nightly/current_run/opentitan/sw/device/silicon_creator/rom/e2e/BUILD
ERROR: no such target '//sw/device/silicon_creator/rom/e2e:otp_img_sigverify_always_rma': target 'otp_img_sigverify_always_rma' not declared in package 'sw/device/silicon_creator/rom/e2e' defined by /nightly/current_run/opentitan/sw/device/silicon_creator/rom/e2e/BUILD
ERROR: Build did NOT complete successfully
_run_cmd -> had a non-zero return code of 1.
make: *** [/nightly/current_run/opentitan/hw/dv/tools/dvsim/sim.mk:58: sw_build] Error 1
rom_e2e_asm_init_test_unlocked0 29942545474571219357571639583898617035541127768669521211601882775176601077063 None
Another command (pid=315312) is running. Waiting for it to complete on the server (server_pid=201955)...
Another command (pid=346950) is running. Waiting for it to complete on the server (server_pid=201955)...
Another command (pid=372171) is running. Waiting for it to complete on the server (server_pid=201955)...
WARNING: Target pattern parsing failed.
ERROR: Skipping '//sw/device/silicon_creator/rom/e2e:empty_test_slot_a_sim_dv': no such target '//sw/device/silicon_creator/rom/e2e:empty_test_slot_a_sim_dv': target 'empty_test_slot_a_sim_dv' not declared in package 'sw/device/silicon_creator/rom/e2e' defined by /nightly/current_run/opentitan/sw/device/silicon_creator/rom/e2e/BUILD
ERROR: no such target '//sw/device/silicon_creator/rom/e2e:empty_test_slot_a_sim_dv': target 'empty_test_slot_a_sim_dv' not declared in package 'sw/device/silicon_creator/rom/e2e' defined by /nightly/current_run/opentitan/sw/device/silicon_creator/rom/e2e/BUILD
ERROR: Build did NOT complete successfully
_run_cmd -> had a non-zero return code of 1.
make: *** [/nightly/current_run/opentitan/hw/dv/tools/dvsim/sim.mk:58: sw_build] Error 1
rom_e2e_asm_init_dev 84623528519449740622085621395694467576484757282469742382519242963826531400550 None
---- STDERR ----
Another command (pid=540352) is running. Waiting for it to complete on the server (server_pid=201955)...
Another command (pid=543092) is running. Waiting for it to complete on the server (server_pid=201955)...
WARNING: Target pattern parsing failed.
ERROR: Skipping '//sw/device/silicon_creator/rom/e2e:empty_test_slot_a_sim_dv': no such target '//sw/device/silicon_creator/rom/e2e:empty_test_slot_a_sim_dv': target 'empty_test_slot_a_sim_dv' not declared in package 'sw/device/silicon_creator/rom/e2e' defined by /nightly/current_run/opentitan/sw/device/silicon_creator/rom/e2e/BUILD
ERROR: no such target '//sw/device/silicon_creator/rom/e2e:empty_test_slot_a_sim_dv': target 'empty_test_slot_a_sim_dv' not declared in package 'sw/device/silicon_creator/rom/e2e' defined by /nightly/current_run/opentitan/sw/device/silicon_creator/rom/e2e/BUILD
ERROR: Build did NOT complete successfully
_run_cmd -> had a non-zero return code of 1.
make: *** [/nightly/current_run/opentitan/hw/dv/tools/dvsim/sim.mk:58: sw_build] Error 1
rom_e2e_asm_init_prod 13932205513947500755584685541737707564357354562642865437306036087491792852950 None
---- STDERR ----
Another command (pid=544417) is running. Waiting for it to complete on the server (server_pid=201955)...
WARNING: Target pattern parsing failed.
ERROR: Skipping '//sw/device/silicon_creator/rom/e2e:empty_test_slot_a_sim_dv': no such target '//sw/device/silicon_creator/rom/e2e:empty_test_slot_a_sim_dv': target 'empty_test_slot_a_sim_dv' not declared in package 'sw/device/silicon_creator/rom/e2e' defined by /nightly/current_run/opentitan/sw/device/silicon_creator/rom/e2e/BUILD
ERROR: no such target '//sw/device/silicon_creator/rom/e2e:empty_test_slot_a_sim_dv': target 'empty_test_slot_a_sim_dv' not declared in package 'sw/device/silicon_creator/rom/e2e' defined by /nightly/current_run/opentitan/sw/device/silicon_creator/rom/e2e/BUILD
ERROR: Build did NOT complete successfully
_run_cmd -> had a non-zero return code of 1.
make: *** [/nightly/current_run/opentitan/hw/dv/tools/dvsim/sim.mk:58: sw_build] Error 1
rom_e2e_asm_init_prod_end 69783356231452422974350985342622369053723220710155859501663698173302239811344 None
Waiting for it to complete...
Another command (pid=551381) is running. Waiting for it to complete on the server (server_pid=201955)...
WARNING: Target pattern parsing failed.
ERROR: Skipping '//sw/device/silicon_creator/rom/e2e:empty_test_slot_a_sim_dv': no such target '//sw/device/silicon_creator/rom/e2e:empty_test_slot_a_sim_dv': target 'empty_test_slot_a_sim_dv' not declared in package 'sw/device/silicon_creator/rom/e2e' defined by /nightly/current_run/opentitan/sw/device/silicon_creator/rom/e2e/BUILD
ERROR: no such target '//sw/device/silicon_creator/rom/e2e:empty_test_slot_a_sim_dv': target 'empty_test_slot_a_sim_dv' not declared in package 'sw/device/silicon_creator/rom/e2e' defined by /nightly/current_run/opentitan/sw/device/silicon_creator/rom/e2e/BUILD
ERROR: Build did NOT complete successfully
_run_cmd -> had a non-zero return code of 1.
make: *** [/nightly/current_run/opentitan/hw/dv/tools/dvsim/sim.mk:58: sw_build] Error 1
rom_e2e_asm_init_rma 80528702161102327914194271363100108230268139007743225802520068345153163061830 None
Another command (pid=553583) is running. Waiting for it to complete on the server (server_pid=201955)...
Another command (pid=555517) is running. Waiting for it to complete on the server (server_pid=201955)...
Another command (pid=552679) is running. Waiting for it to complete on the server (server_pid=201955)...
WARNING: Target pattern parsing failed.
ERROR: Skipping '//sw/device/silicon_creator/rom/e2e:empty_test_slot_a_sim_dv': no such target '//sw/device/silicon_creator/rom/e2e:empty_test_slot_a_sim_dv': target 'empty_test_slot_a_sim_dv' not declared in package 'sw/device/silicon_creator/rom/e2e' defined by /nightly/current_run/opentitan/sw/device/silicon_creator/rom/e2e/BUILD
ERROR: no such target '//sw/device/silicon_creator/rom/e2e:empty_test_slot_a_sim_dv': target 'empty_test_slot_a_sim_dv' not declared in package 'sw/device/silicon_creator/rom/e2e' defined by /nightly/current_run/opentitan/sw/device/silicon_creator/rom/e2e/BUILD
ERROR: Build did NOT complete successfully
_run_cmd -> had a non-zero return code of 1.
make: *** [/nightly/current_run/opentitan/hw/dv/tools/dvsim/sim.mk:58: sw_build] Error 1
rom_e2e_jtag_debug_test_unlocked0 35630086765115497478990659330233499737884482642150420719959379937758778232255 None
Another command (pid=576797) is running. Waiting for it to complete on the server (server_pid=201955)...
Another command (pid=573703) is running. Waiting for it to complete on the server (server_pid=201955)...
Another command (pid=580110) is running. Waiting for it to complete on the server (server_pid=201955)...
WARNING: Target pattern parsing failed.
ERROR: Skipping '//sw/device/silicon_creator/rom/e2e:img_test_unlocked0_exec_disabled': no such target '//sw/device/silicon_creator/rom/e2e:img_test_unlocked0_exec_disabled': target 'img_test_unlocked0_exec_disabled' not declared in package 'sw/device/silicon_creator/rom/e2e' defined by /nightly/current_run/opentitan/sw/device/silicon_creator/rom/e2e/BUILD
ERROR: no such target '//sw/device/silicon_creator/rom/e2e:img_test_unlocked0_exec_disabled': target 'img_test_unlocked0_exec_disabled' not declared in package 'sw/device/silicon_creator/rom/e2e' defined by /nightly/current_run/opentitan/sw/device/silicon_creator/rom/e2e/BUILD
ERROR: Build did NOT complete successfully
_run_cmd -> had a non-zero return code of 1.
make: *** [/nightly/current_run/opentitan/hw/dv/tools/dvsim/sim.mk:58: sw_build] Error 1
rom_e2e_jtag_debug_dev 89158749323594505256174461523889608616968214331556126917196113084831495693694 None
Another command (pid=574001) is running. Waiting for it to complete on the server (server_pid=201955)...
Another command (pid=573052) is running. Waiting for it to complete on the server (server_pid=201955)...
Another command (pid=575643) is running. Waiting for it to complete on the server (server_pid=201955)...
WARNING: Target pattern parsing failed.
ERROR: Skipping '//sw/device/silicon_creator/rom/e2e:img_dev_exec_disabled': no such target '//sw/device/silicon_creator/rom/e2e:img_dev_exec_disabled': target 'img_dev_exec_disabled' not declared in package 'sw/device/silicon_creator/rom/e2e' defined by /nightly/current_run/opentitan/sw/device/silicon_creator/rom/e2e/BUILD
ERROR: no such target '//sw/device/silicon_creator/rom/e2e:img_dev_exec_disabled': target 'img_dev_exec_disabled' not declared in package 'sw/device/silicon_creator/rom/e2e' defined by /nightly/current_run/opentitan/sw/device/silicon_creator/rom/e2e/BUILD
ERROR: Build did NOT complete successfully
_run_cmd -> had a non-zero return code of 1.
make: *** [/nightly/current_run/opentitan/hw/dv/tools/dvsim/sim.mk:58: sw_build] Error 1
rom_e2e_jtag_debug_rma 94597699218616225944262474587399723709594040168280298151193939301593159541418 None
Another command (pid=591853) is running. Waiting for it to complete on the server (server_pid=201955)...
Another command (pid=596095) is running. Waiting for it to complete on the server (server_pid=201955)...
Another command (pid=594839) is running. Waiting for it to complete on the server (server_pid=201955)...
WARNING: Target pattern parsing failed.
ERROR: Skipping '//sw/device/silicon_creator/rom/e2e:img_rma_exec_disabled': no such target '//sw/device/silicon_creator/rom/e2e:img_rma_exec_disabled': target 'img_rma_exec_disabled' not declared in package 'sw/device/silicon_creator/rom/e2e' defined by /nightly/current_run/opentitan/sw/device/silicon_creator/rom/e2e/BUILD
ERROR: no such target '//sw/device/silicon_creator/rom/e2e:img_rma_exec_disabled': target 'img_rma_exec_disabled' not declared in package 'sw/device/silicon_creator/rom/e2e' defined by /nightly/current_run/opentitan/sw/device/silicon_creator/rom/e2e/BUILD
ERROR: Build did NOT complete successfully
_run_cmd -> had a non-zero return code of 1.
make: *** [/nightly/current_run/opentitan/hw/dv/tools/dvsim/sim.mk:58: sw_build] Error 1
rom_e2e_jtag_inject_test_unlocked0 57955046931145745635872178241667084701467565397711918962321946377002252337285 None
Another command (pid=517331) is running. Waiting for it to complete on the server (server_pid=201955)...
Another command (pid=512660) is running. Waiting for it to complete on the server (server_pid=201955)...
Another command (pid=519977) is running. Waiting for it to complete on the server (server_pid=201955)...
WARNING: Target pattern parsing failed.
ERROR: Skipping '//sw/device/silicon_creator/rom/e2e:img_dev_exec_disabled': no such target '//sw/device/silicon_creator/rom/e2e:img_dev_exec_disabled': target 'img_dev_exec_disabled' not declared in package 'sw/device/silicon_creator/rom/e2e' defined by /nightly/current_run/opentitan/sw/device/silicon_creator/rom/e2e/BUILD
ERROR: no such target '//sw/device/silicon_creator/rom/e2e:img_dev_exec_disabled': target 'img_dev_exec_disabled' not declared in package 'sw/device/silicon_creator/rom/e2e' defined by /nightly/current_run/opentitan/sw/device/silicon_creator/rom/e2e/BUILD
ERROR: Build did NOT complete successfully
_run_cmd -> had a non-zero return code of 1.
make: *** [/nightly/current_run/opentitan/hw/dv/tools/dvsim/sim.mk:58: sw_build] Error 1
rom_e2e_jtag_inject_dev 102749946812139943010314711880073952469041226625370207665464715881276735662759 None
Another command (pid=543092) is running. Waiting for it to complete on the server (server_pid=201955)...
Another command (pid=544417) is running. Waiting for it to complete on the server (server_pid=201955)...
Another command (pid=545046) is running. Waiting for it to complete on the server (server_pid=201955)...
WARNING: Target pattern parsing failed.
ERROR: Skipping '//sw/device/silicon_creator/rom/e2e:img_dev_exec_disabled': no such target '//sw/device/silicon_creator/rom/e2e:img_dev_exec_disabled': target 'img_dev_exec_disabled' not declared in package 'sw/device/silicon_creator/rom/e2e' defined by /nightly/current_run/opentitan/sw/device/silicon_creator/rom/e2e/BUILD
ERROR: no such target '//sw/device/silicon_creator/rom/e2e:img_dev_exec_disabled': target 'img_dev_exec_disabled' not declared in package 'sw/device/silicon_creator/rom/e2e' defined by /nightly/current_run/opentitan/sw/device/silicon_creator/rom/e2e/BUILD
ERROR: Build did NOT complete successfully
_run_cmd -> had a non-zero return code of 1.
make: *** [/nightly/current_run/opentitan/hw/dv/tools/dvsim/sim.mk:58: sw_build] Error 1
rom_e2e_jtag_inject_rma 12889970918092047988990129361783760364169293885292133185773366594402654028594 None
Another command (pid=527044) is running. Waiting for it to complete on the server (server_pid=201955)...
Another command (pid=516495) is running. Waiting for it to complete on the server (server_pid=201955)...
Another command (pid=527896) is running. Waiting for it to complete on the server (server_pid=201955)...
WARNING: Target pattern parsing failed.
ERROR: Skipping '//sw/device/silicon_creator/rom/e2e:img_dev_exec_disabled': no such target '//sw/device/silicon_creator/rom/e2e:img_dev_exec_disabled': target 'img_dev_exec_disabled' not declared in package 'sw/device/silicon_creator/rom/e2e' defined by /nightly/current_run/opentitan/sw/device/silicon_creator/rom/e2e/BUILD
ERROR: no such target '//sw/device/silicon_creator/rom/e2e:img_dev_exec_disabled': target 'img_dev_exec_disabled' not declared in package 'sw/device/silicon_creator/rom/e2e' defined by /nightly/current_run/opentitan/sw/device/silicon_creator/rom/e2e/BUILD
ERROR: Build did NOT complete successfully
_run_cmd -> had a non-zero return code of 1.
make: *** [/nightly/current_run/opentitan/hw/dv/tools/dvsim/sim.mk:58: sw_build] Error 1
rom_e2e_static_critical 46601001769823518661030236168789444994302393598540231257821977797956840930062 None
---- STDOUT ----
---- STDERR ----
WARNING: Target pattern parsing failed.
ERROR: Skipping '//sw/device/silicon_creator/rom:rom_with_fake_keys_sim_dv': no such target '//sw/device/silicon_creator/rom:rom_with_fake_keys_sim_dv': target 'rom_with_fake_keys_sim_dv' not declared in package 'sw/device/silicon_creator/rom' defined by /nightly/current_run/opentitan/sw/device/silicon_creator/rom/BUILD
ERROR: no such target '//sw/device/silicon_creator/rom:rom_with_fake_keys_sim_dv': target 'rom_with_fake_keys_sim_dv' not declared in package 'sw/device/silicon_creator/rom' defined by /nightly/current_run/opentitan/sw/device/silicon_creator/rom/BUILD
ERROR: Build did NOT complete successfully
_run_cmd -> had a non-zero return code of 1.
make: *** [/nightly/current_run/opentitan/hw/dv/tools/dvsim/sim.mk:58: sw_build] Error 1
rom_e2e_keymgr_dpe_init_rom_ext_meas 20551206585722585416877431997993630572986707718105422437938546105618378791730 None
---- STDERR ----
Another command (pid=575643) is running. Waiting for it to complete on the server (server_pid=201955)...
WARNING: Target pattern parsing failed.
ERROR: Skipping '//sw/device/silicon_creator/rom/e2e:rom_e2e_keymgr_dpe_init_test_sim_dv': no such target '//sw/device/silicon_creator/rom/e2e:rom_e2e_keymgr_dpe_init_test_sim_dv': target 'rom_e2e_keymgr_dpe_init_test_sim_dv' not declared in package 'sw/device/silicon_creator/rom/e2e' defined by /nightly/current_run/opentitan/sw/device/silicon_creator/rom/e2e/BUILD
ERROR: no such target '//sw/device/silicon_creator/rom/e2e:rom_e2e_keymgr_dpe_init_test_sim_dv': target 'rom_e2e_keymgr_dpe_init_test_sim_dv' not declared in package 'sw/device/silicon_creator/rom/e2e' defined by /nightly/current_run/opentitan/sw/device/silicon_creator/rom/e2e/BUILD
ERROR: Build did NOT complete successfully
_run_cmd -> had a non-zero return code of 1.
make: *** [/nightly/current_run/opentitan/hw/dv/tools/dvsim/sim.mk:58: sw_build] Error 1
rom_e2e_keymgr_dpe_init_rom_ext_no_meas 72198456223428402727148704503943833585047532932952285049699490814451031479486 None
---- STDERR ----
Another command (pid=580883) is running. Waiting for it to complete on the server (server_pid=201955)...
WARNING: Target pattern parsing failed.
ERROR: Skipping '//sw/device/silicon_creator/rom/e2e:rom_e2e_keymgr_dpe_init_test_sim_dv': no such target '//sw/device/silicon_creator/rom/e2e:rom_e2e_keymgr_dpe_init_test_sim_dv': target 'rom_e2e_keymgr_dpe_init_test_sim_dv' not declared in package 'sw/device/silicon_creator/rom/e2e' defined by /nightly/current_run/opentitan/sw/device/silicon_creator/rom/e2e/BUILD
ERROR: no such target '//sw/device/silicon_creator/rom/e2e:rom_e2e_keymgr_dpe_init_test_sim_dv': target 'rom_e2e_keymgr_dpe_init_test_sim_dv' not declared in package 'sw/device/silicon_creator/rom/e2e' defined by /nightly/current_run/opentitan/sw/device/silicon_creator/rom/e2e/BUILD
ERROR: Build did NOT complete successfully
_run_cmd -> had a non-zero return code of 1.
make: *** [/nightly/current_run/opentitan/hw/dv/tools/dvsim/sim.mk:58: sw_build] Error 1
rom_e2e_keymgr_dpe_init_rom_ext_invalid_meas 1639950759092944482358867898385068543278307788857999274895271558157691091283 None
---- STDERR ----
Another command (pid=573052) is running. Waiting for it to complete on the server (server_pid=201955)...
WARNING: Target pattern parsing failed.
ERROR: Skipping '//sw/device/silicon_creator/rom/e2e:rom_e2e_keymgr_dpe_init_test_sim_dv': no such target '//sw/device/silicon_creator/rom/e2e:rom_e2e_keymgr_dpe_init_test_sim_dv': target 'rom_e2e_keymgr_dpe_init_test_sim_dv' not declared in package 'sw/device/silicon_creator/rom/e2e' defined by /nightly/current_run/opentitan/sw/device/silicon_creator/rom/e2e/BUILD
ERROR: no such target '//sw/device/silicon_creator/rom/e2e:rom_e2e_keymgr_dpe_init_test_sim_dv': target 'rom_e2e_keymgr_dpe_init_test_sim_dv' not declared in package 'sw/device/silicon_creator/rom/e2e' defined by /nightly/current_run/opentitan/sw/device/silicon_creator/rom/e2e/BUILD
ERROR: Build did NOT complete successfully
_run_cmd -> had a non-zero return code of 1.
make: *** [/nightly/current_run/opentitan/hw/dv/tools/dvsim/sim.mk:58: sw_build] Error 1
rom_e2e_sigverify_mod_exp_test_unlocked0_otbn 89218867762224841984592044748654888580524510397273823263870367550310196209908 None
---- STDERR ----
Another command (pid=315312) is running. Waiting for it to complete on the server (server_pid=201955)...
Another command (pid=346950) is running. Waiting for it to complete on the server (server_pid=201955)...
WARNING: Target pattern parsing failed.
ERROR: Skipping '//sw/device/silicon_creator/rom/e2e:empty_test_sigverify_mod_exp_sim_dv': no such target '//sw/device/silicon_creator/rom/e2e:empty_test_sigverify_mod_exp_sim_dv': target 'empty_test_sigverify_mod_exp_sim_dv' not declared in package 'sw/device/silicon_creator/rom/e2e' defined by /nightly/current_run/opentitan/sw/device/silicon_creator/rom/e2e/BUILD
ERROR: no such target '//sw/device/silicon_creator/rom/e2e:empty_test_sigverify_mod_exp_sim_dv': target 'empty_test_sigverify_mod_exp_sim_dv' not declared in package 'sw/device/silicon_creator/rom/e2e' defined by /nightly/current_run/opentitan/sw/device/silicon_creator/rom/e2e/BUILD
ERROR: Build did NOT complete successfully
_run_cmd -> had a non-zero return code of 1.
make: *** [/nightly/current_run/opentitan/hw/dv/tools/dvsim/sim.mk:58: sw_build] Error 1
rom_e2e_sigverify_mod_exp_test_unlocked0_sw 30420399111356375694397973903714059298920540280641964351836973017386293374992 None
Another command (pid=519977) is running. Waiting for it to complete on the server (server_pid=201955)...
Another command (pid=524678) is running. Waiting for it to complete on the server (server_pid=201955)...
Another command (pid=521802) is running. Waiting for it to complete on the server (server_pid=201955)...
WARNING: Target pattern parsing failed.
ERROR: Skipping '//sw/device/silicon_creator/rom/e2e:empty_test_sigverify_mod_exp_sim_dv': no such target '//sw/device/silicon_creator/rom/e2e:empty_test_sigverify_mod_exp_sim_dv': target 'empty_test_sigverify_mod_exp_sim_dv' not declared in package 'sw/device/silicon_creator/rom/e2e' defined by /nightly/current_run/opentitan/sw/device/silicon_creator/rom/e2e/BUILD
ERROR: no such target '//sw/device/silicon_creator/rom/e2e:empty_test_sigverify_mod_exp_sim_dv': target 'empty_test_sigverify_mod_exp_sim_dv' not declared in package 'sw/device/silicon_creator/rom/e2e' defined by /nightly/current_run/opentitan/sw/device/silicon_creator/rom/e2e/BUILD
ERROR: Build did NOT complete successfully
_run_cmd -> had a non-zero return code of 1.
make: *** [/nightly/current_run/opentitan/hw/dv/tools/dvsim/sim.mk:58: sw_build] Error 1
rom_e2e_sigverify_mod_exp_dev_otbn 42588831899713214801981292534240159123200221159602642500898539273182368025660 None
---- STDERR ----
Another command (pid=622928) is running. Waiting for it to complete on the server (server_pid=201955)...
WARNING: Target pattern parsing failed.
ERROR: Skipping '//sw/device/silicon_creator/rom/e2e:empty_test_sigverify_mod_exp_sim_dv': no such target '//sw/device/silicon_creator/rom/e2e:empty_test_sigverify_mod_exp_sim_dv': target 'empty_test_sigverify_mod_exp_sim_dv' not declared in package 'sw/device/silicon_creator/rom/e2e' defined by /nightly/current_run/opentitan/sw/device/silicon_creator/rom/e2e/BUILD
ERROR: no such target '//sw/device/silicon_creator/rom/e2e:empty_test_sigverify_mod_exp_sim_dv': target 'empty_test_sigverify_mod_exp_sim_dv' not declared in package 'sw/device/silicon_creator/rom/e2e' defined by /nightly/current_run/opentitan/sw/device/silicon_creator/rom/e2e/BUILD
ERROR: Build did NOT complete successfully
_run_cmd -> had a non-zero return code of 1.
make: *** [/nightly/current_run/opentitan/hw/dv/tools/dvsim/sim.mk:58: sw_build] Error 1
rom_e2e_sigverify_mod_exp_dev_sw 93822207674963499377741044897709657299103631770693553023256580702466163101905 None
---- STDERR ----
Another command (pid=608917) is running. Waiting for it to complete on the server (server_pid=201955)...
Another command (pid=621357) is running. Waiting for it to complete on the server (server_pid=201955)...
WARNING: Target pattern parsing failed.
ERROR: Skipping '//sw/device/silicon_creator/rom/e2e:empty_test_sigverify_mod_exp_sim_dv': no such target '//sw/device/silicon_creator/rom/e2e:empty_test_sigverify_mod_exp_sim_dv': target 'empty_test_sigverify_mod_exp_sim_dv' not declared in package 'sw/device/silicon_creator/rom/e2e' defined by /nightly/current_run/opentitan/sw/device/silicon_creator/rom/e2e/BUILD
ERROR: no such target '//sw/device/silicon_creator/rom/e2e:empty_test_sigverify_mod_exp_sim_dv': target 'empty_test_sigverify_mod_exp_sim_dv' not declared in package 'sw/device/silicon_creator/rom/e2e' defined by /nightly/current_run/opentitan/sw/device/silicon_creator/rom/e2e/BUILD
ERROR: Build did NOT complete successfully
_run_cmd -> had a non-zero return code of 1.
make: *** [/nightly/current_run/opentitan/hw/dv/tools/dvsim/sim.mk:58: sw_build] Error 1
rom_e2e_sigverify_mod_exp_prod_otbn 8916575384734413238096019621649726615135171536481191089846156869323160630969 None
---- STDOUT ----
---- STDERR ----
WARNING: Target pattern parsing failed.
ERROR: Skipping '//sw/device/silicon_creator/rom/e2e:empty_test_sigverify_mod_exp_sim_dv': no such target '//sw/device/silicon_creator/rom/e2e:empty_test_sigverify_mod_exp_sim_dv': target 'empty_test_sigverify_mod_exp_sim_dv' not declared in package 'sw/device/silicon_creator/rom/e2e' defined by /nightly/current_run/opentitan/sw/device/silicon_creator/rom/e2e/BUILD
ERROR: no such target '//sw/device/silicon_creator/rom/e2e:empty_test_sigverify_mod_exp_sim_dv': target 'empty_test_sigverify_mod_exp_sim_dv' not declared in package 'sw/device/silicon_creator/rom/e2e' defined by /nightly/current_run/opentitan/sw/device/silicon_creator/rom/e2e/BUILD
ERROR: Build did NOT complete successfully
_run_cmd -> had a non-zero return code of 1.
make: *** [/nightly/current_run/opentitan/hw/dv/tools/dvsim/sim.mk:58: sw_build] Error 1
rom_e2e_sigverify_mod_exp_prod_sw 52634175329268930161174376290725566530365903447582386360191567693885327837915 None
---- STDOUT ----
---- STDERR ----
WARNING: Target pattern parsing failed.
ERROR: Skipping '//sw/device/silicon_creator/rom/e2e:empty_test_sigverify_mod_exp_sim_dv': no such target '//sw/device/silicon_creator/rom/e2e:empty_test_sigverify_mod_exp_sim_dv': target 'empty_test_sigverify_mod_exp_sim_dv' not declared in package 'sw/device/silicon_creator/rom/e2e' defined by /nightly/current_run/opentitan/sw/device/silicon_creator/rom/e2e/BUILD
ERROR: no such target '//sw/device/silicon_creator/rom/e2e:empty_test_sigverify_mod_exp_sim_dv': target 'empty_test_sigverify_mod_exp_sim_dv' not declared in package 'sw/device/silicon_creator/rom/e2e' defined by /nightly/current_run/opentitan/sw/device/silicon_creator/rom/e2e/BUILD
ERROR: Build did NOT complete successfully
_run_cmd -> had a non-zero return code of 1.
make: *** [/nightly/current_run/opentitan/hw/dv/tools/dvsim/sim.mk:58: sw_build] Error 1
rom_e2e_sigverify_mod_exp_prod_end_otbn 65384767719247099115317683125689014330067030135956065664155109790979846929295 None
---- STDOUT ----
---- STDERR ----
WARNING: Target pattern parsing failed.
ERROR: Skipping '//sw/device/silicon_creator/rom/e2e:empty_test_sigverify_mod_exp_sim_dv': no such target '//sw/device/silicon_creator/rom/e2e:empty_test_sigverify_mod_exp_sim_dv': target 'empty_test_sigverify_mod_exp_sim_dv' not declared in package 'sw/device/silicon_creator/rom/e2e' defined by /nightly/current_run/opentitan/sw/device/silicon_creator/rom/e2e/BUILD
ERROR: no such target '//sw/device/silicon_creator/rom/e2e:empty_test_sigverify_mod_exp_sim_dv': target 'empty_test_sigverify_mod_exp_sim_dv' not declared in package 'sw/device/silicon_creator/rom/e2e' defined by /nightly/current_run/opentitan/sw/device/silicon_creator/rom/e2e/BUILD
ERROR: Build did NOT complete successfully
_run_cmd -> had a non-zero return code of 1.
make: *** [/nightly/current_run/opentitan/hw/dv/tools/dvsim/sim.mk:58: sw_build] Error 1
rom_e2e_sigverify_mod_exp_prod_end_sw 94051944783553547717635856596108339485967286552726185843523993939097621402963 None
---- STDOUT ----
---- STDERR ----
WARNING: Target pattern parsing failed.
ERROR: Skipping '//sw/device/silicon_creator/rom/e2e:empty_test_sigverify_mod_exp_sim_dv': no such target '//sw/device/silicon_creator/rom/e2e:empty_test_sigverify_mod_exp_sim_dv': target 'empty_test_sigverify_mod_exp_sim_dv' not declared in package 'sw/device/silicon_creator/rom/e2e' defined by /nightly/current_run/opentitan/sw/device/silicon_creator/rom/e2e/BUILD
ERROR: no such target '//sw/device/silicon_creator/rom/e2e:empty_test_sigverify_mod_exp_sim_dv': target 'empty_test_sigverify_mod_exp_sim_dv' not declared in package 'sw/device/silicon_creator/rom/e2e' defined by /nightly/current_run/opentitan/sw/device/silicon_creator/rom/e2e/BUILD
ERROR: Build did NOT complete successfully
_run_cmd -> had a non-zero return code of 1.
make: *** [/nightly/current_run/opentitan/hw/dv/tools/dvsim/sim.mk:58: sw_build] Error 1
rom_e2e_sigverify_mod_exp_rma_otbn 90358657364086639465209551960830360257065421121189984574298148823323783750309 None
---- STDERR ----
Another command (pid=641957) is running. Waiting for it to complete on the server (server_pid=201955)...
WARNING: Target pattern parsing failed.
ERROR: Skipping '//sw/device/silicon_creator/rom/e2e:empty_test_sigverify_mod_exp_sim_dv': no such target '//sw/device/silicon_creator/rom/e2e:empty_test_sigverify_mod_exp_sim_dv': target 'empty_test_sigverify_mod_exp_sim_dv' not declared in package 'sw/device/silicon_creator/rom/e2e' defined by /nightly/current_run/opentitan/sw/device/silicon_creator/rom/e2e/BUILD
ERROR: no such target '//sw/device/silicon_creator/rom/e2e:empty_test_sigverify_mod_exp_sim_dv': target 'empty_test_sigverify_mod_exp_sim_dv' not declared in package 'sw/device/silicon_creator/rom/e2e' defined by /nightly/current_run/opentitan/sw/device/silicon_creator/rom/e2e/BUILD
ERROR: Build did NOT complete successfully
_run_cmd -> had a non-zero return code of 1.
make: *** [/nightly/current_run/opentitan/hw/dv/tools/dvsim/sim.mk:58: sw_build] Error 1
rom_e2e_sigverify_mod_exp_rma_sw 33485694212935811867085349536341366581287194609427758066052948915056817944743 None
---- STDOUT ----
---- STDERR ----
WARNING: Target pattern parsing failed.
ERROR: Skipping '//sw/device/silicon_creator/rom/e2e:empty_test_sigverify_mod_exp_sim_dv': no such target '//sw/device/silicon_creator/rom/e2e:empty_test_sigverify_mod_exp_sim_dv': target 'empty_test_sigverify_mod_exp_sim_dv' not declared in package 'sw/device/silicon_creator/rom/e2e' defined by /nightly/current_run/opentitan/sw/device/silicon_creator/rom/e2e/BUILD
ERROR: no such target '//sw/device/silicon_creator/rom/e2e:empty_test_sigverify_mod_exp_sim_dv': target 'empty_test_sigverify_mod_exp_sim_dv' not declared in package 'sw/device/silicon_creator/rom/e2e' defined by /nightly/current_run/opentitan/sw/device/silicon_creator/rom/e2e/BUILD
ERROR: Build did NOT complete successfully
_run_cmd -> had a non-zero return code of 1.
make: *** [/nightly/current_run/opentitan/hw/dv/tools/dvsim/sim.mk:58: sw_build] Error 1
rom_volatile_raw_unlock 82800185694725938896313963554516650931594015252045621079435260759697477106582 None
Another command (pid=402715) is running. Waiting for it to complete on the server (server_pid=201955)...
Another command (pid=512127) is running. Waiting for it to complete on the server (server_pid=201955)...
Another command (pid=400597) is running. Waiting for it to complete on the server (server_pid=201955)...
WARNING: Target pattern parsing failed.
ERROR: Skipping '//sw/device/silicon_creator/rom/e2e:empty_test_slot_a_sim_dv': no such target '//sw/device/silicon_creator/rom/e2e:empty_test_slot_a_sim_dv': target 'empty_test_slot_a_sim_dv' not declared in package 'sw/device/silicon_creator/rom/e2e' defined by /nightly/current_run/opentitan/sw/device/silicon_creator/rom/e2e/BUILD
ERROR: no such target '//sw/device/silicon_creator/rom/e2e:empty_test_slot_a_sim_dv': target 'empty_test_slot_a_sim_dv' not declared in package 'sw/device/silicon_creator/rom/e2e' defined by /nightly/current_run/opentitan/sw/device/silicon_creator/rom/e2e/BUILD
ERROR: Build did NOT complete successfully
_run_cmd -> had a non-zero return code of 1.
make: *** [/nightly/current_run/opentitan/hw/dv/tools/dvsim/sim.mk:58: sw_build] Error 1
rom_raw_unlock 10898327792199587982901765068281129175494678373377290737307734061118469714166 None
---- STDERR ----
Another command (pid=386525) is running. Waiting for it to complete on the server (server_pid=201955)...
Another command (pid=408627) is running. Waiting for it to complete on the server (server_pid=201955)...
WARNING: Target pattern parsing failed.
ERROR: Skipping '//sw/device/silicon_creator/rom/e2e:empty_test_slot_a_sim_dv': no such target '//sw/device/silicon_creator/rom/e2e:empty_test_slot_a_sim_dv': target 'empty_test_slot_a_sim_dv' not declared in package 'sw/device/silicon_creator/rom/e2e' defined by /nightly/current_run/opentitan/sw/device/silicon_creator/rom/e2e/BUILD
ERROR: no such target '//sw/device/silicon_creator/rom/e2e:empty_test_slot_a_sim_dv': target 'empty_test_slot_a_sim_dv' not declared in package 'sw/device/silicon_creator/rom/e2e' defined by /nightly/current_run/opentitan/sw/device/silicon_creator/rom/e2e/BUILD
ERROR: Build did NOT complete successfully
_run_cmd -> had a non-zero return code of 1.
make: *** [/nightly/current_run/opentitan/hw/dv/tools/dvsim/sim.mk:58: sw_build] Error 1
rom_e2e_self_hash 13761920342895858159068927688013494169300021595047552914508550759282434328304 None
Another command (pid=382001) is running. Waiting for it to complete on the server (server_pid=201955)...
Another command (pid=329364) is running. Waiting for it to complete on the server (server_pid=201955)...
Another command (pid=378023) is running. Waiting for it to complete on the server (server_pid=201955)...
WARNING: Target pattern parsing failed.
ERROR: Skipping '//sw/device/silicon_creator/rom/e2e:otp_img_sigverify_mod_exp_rma_otbn': no such target '//sw/device/silicon_creator/rom/e2e:otp_img_sigverify_mod_exp_rma_otbn': target 'otp_img_sigverify_mod_exp_rma_otbn' not declared in package 'sw/device/silicon_creator/rom/e2e' defined by /nightly/current_run/opentitan/sw/device/silicon_creator/rom/e2e/BUILD
ERROR: no such target '//sw/device/silicon_creator/rom/e2e:otp_img_sigverify_mod_exp_rma_otbn': target 'otp_img_sigverify_mod_exp_rma_otbn' not declared in package 'sw/device/silicon_creator/rom/e2e' defined by /nightly/current_run/opentitan/sw/device/silicon_creator/rom/e2e/BUILD
ERROR: Build did NOT complete successfully
_run_cmd -> had a non-zero return code of 1.
make: *** [/nightly/current_run/opentitan/hw/dv/tools/dvsim/sim.mk:58: sw_build] Error 1
chip_sw_uart_smoketest_signed 51653515928892648703318008923048811334615088835434246236589422393332882414245 None
---- STDERR ----
Another command (pid=500757) is running. Waiting for it to complete on the server (server_pid=201955)...
Another command (pid=517734) is running. Waiting for it to complete on the server (server_pid=201955)...
WARNING: Target pattern parsing failed.
ERROR: Skipping '//sw/device/tests:uart_smoketest_signed_sim_dv': no such target '//sw/device/tests:uart_smoketest_signed_sim_dv': target 'uart_smoketest_signed_sim_dv' not declared in package 'sw/device/tests' defined by /nightly/current_run/opentitan/sw/device/tests/BUILD
ERROR: no such target '//sw/device/tests:uart_smoketest_signed_sim_dv': target 'uart_smoketest_signed_sim_dv' not declared in package 'sw/device/tests' defined by /nightly/current_run/opentitan/sw/device/tests/BUILD
ERROR: Build did NOT complete successfully
_run_cmd -> had a non-zero return code of 1.
make: *** [/nightly/current_run/opentitan/hw/dv/tools/dvsim/sim.mk:58: sw_build] Error 1
rom_keymgr_dpe_functest 65527901049255266606733870064131249453591497622646717927613933389911987046852 None
Use --verbose_failures to see the command lines of failed build steps.
ERROR: Analysis of target '//sw/device/silicon_creator/lib/drivers:keymgr_dpe_functest_sim_dv' failed; build aborted: Target //sw/device/silicon_creator/lib/drivers:keymgr_dpe_functest_sim_dv is incompatible and cannot be built, but was explicitly requested.
Dependency chain:
//sw/device/silicon_creator/lib/drivers:keymgr_dpe_functest_sim_dv (ca9a07) <-- target platform (//toolchain:opentitan_platform) didn't satisfy constraint @@platforms//:incompatible
INFO: Elapsed time: 0.378s, Critical Path: 0.04s
INFO: 1 process: 1 internal.
ERROR: Build did NOT complete successfully
_run_cmd -> had a non-zero return code of 1.
make: *** [/nightly/current_run/opentitan/hw/dv/tools/dvsim/sim.mk:58: sw_build] Error 1
UVM_FATAL @ * us: (dv_utils_pkg.sv:253) [dv_utils_pkg::sw_symbol_get_addr_size.unnamed$$_*] Check failed (ret) Failed to read line from "kJitterEnabled.dat" 10 test runs
chip_sw_otbn_ecdsa_op_irq_jitter_en 29348424177482495994195879604303084357514629386250653847698090407857651449026 319
UVM_INFO @ 10.380001 us: (uvm_report_catcher.svh:705) [UVM/REPORT/CATCHER]
--- UVM Report catcher Summary ---
chip_sw_aes_enc_jitter_en 106518740742264748110248430327489271398691692170778573174167008124118202997647 319
UVM_INFO @ 10.120001 us: (uvm_report_catcher.svh:705) [UVM/REPORT/CATCHER]
--- UVM Report catcher Summary ---
chip_sw_hmac_enc_jitter_en 109852998580685536701036355868573531009645921445943830646616612212574052200420 319
UVM_INFO @ 10.140001 us: (uvm_report_catcher.svh:705) [UVM/REPORT/CATCHER]
--- UVM Report catcher Summary ---
chip_sw_kmac_mode_kmac_jitter_en 54028584252756393938719652928412141919692853838714097740399644815287207392658 319
UVM_INFO @ 10.360001 us: (uvm_report_catcher.svh:705) [UVM/REPORT/CATCHER]
--- UVM Report catcher Summary ---
chip_sw_otbn_ecdsa_op_irq_jitter_en_reduced_freq 34888204470198150026985070274832887546826681262405601742455781985138137463514 319
UVM_INFO @ 10.400001 us: (uvm_report_catcher.svh:705) [UVM/REPORT/CATCHER]
--- UVM Report catcher Summary ---
chip_sw_aes_enc_jitter_en_reduced_freq 19365579478737990946752831268276484215327771145400176010468344150071567674418 319
UVM_INFO @ 10.260001 us: (uvm_report_catcher.svh:705) [UVM/REPORT/CATCHER]
--- UVM Report catcher Summary ---
chip_sw_hmac_enc_jitter_en_reduced_freq 3630669885999151558212149357748966813397611739224757907527077686003485510254 319
UVM_INFO @ 10.100001 us: (uvm_report_catcher.svh:705) [UVM/REPORT/CATCHER]
--- UVM Report catcher Summary ---
chip_sw_kmac_mode_kmac_jitter_en_reduced_freq 36142557944928280628586254917982268872229786459803399455393736232066371687620 319
UVM_INFO @ 10.280001 us: (uvm_report_catcher.svh:705) [UVM/REPORT/CATCHER]
--- UVM Report catcher Summary ---
chip_sw_sram_ctrl_scrambled_access_jitter_en_reduced_freq 87330535549398065300206021419061857953804570045589244401331298454701554385563 319
UVM_INFO @ 10.140001 us: (uvm_report_catcher.svh:705) [UVM/REPORT/CATCHER]
--- UVM Report catcher Summary ---
chip_sw_csrng_edn_concurrency_reduced_freq 88265446808692342893715659784882407591621558990501740031074236576048222989016 319
UVM_INFO @ 10.100001 us: (uvm_report_catcher.svh:705) [UVM/REPORT/CATCHER]
--- UVM Report catcher Summary ---
Offending '((!rstreqs[*]) && (reset_cause != HwReq))' 5 test runs
chip_sw_rstmgr_cpu_info 75852998634446367205364754597941297379568742275346990847017007812098137722971 353
UVM_ERROR @ 412.080000 us: (pwrmgr_rstreqs_sva_if.sv:55) [ASSERT FAILED] HwResetOff_A
UVM_INFO @ 412.080000 us: (uvm_report_catcher.svh:705) [UVM/REPORT/CATCHER]
--- UVM Report catcher Summary ---
chip_sw_clkmgr_off_aes_trans 52359743720593786032326506135279190246279728582710084050455729900982547307348 330
UVM_ERROR @ 185.376000 us: (pwrmgr_rstreqs_sva_if.sv:55) [ASSERT FAILED] HwResetOff_A
UVM_INFO @ 185.376000 us: (uvm_report_catcher.svh:705) [UVM/REPORT/CATCHER]
--- UVM Report catcher Summary ---
chip_sw_clkmgr_off_hmac_trans 99677732244079731141136826456584529015303692035535016154647506181242829135747 330
UVM_ERROR @ 185.312000 us: (pwrmgr_rstreqs_sva_if.sv:55) [ASSERT FAILED] HwResetOff_A
UVM_INFO @ 185.312000 us: (uvm_report_catcher.svh:705) [UVM/REPORT/CATCHER]
--- UVM Report catcher Summary ---
chip_sw_clkmgr_off_kmac_trans 6918484304164164218703334002871516582849688545739574814677182313586823258489 330
UVM_ERROR @ 185.264000 us: (pwrmgr_rstreqs_sva_if.sv:55) [ASSERT FAILED] HwResetOff_A
UVM_INFO @ 185.264000 us: (uvm_report_catcher.svh:705) [UVM/REPORT/CATCHER]
--- UVM Report catcher Summary ---
chip_sw_clkmgr_off_otbn_trans 70380825008195868042782780196481936005461472370438368693858003100112424312364 330
UVM_ERROR @ 185.296000 us: (pwrmgr_rstreqs_sva_if.sv:55) [ASSERT FAILED] HwResetOff_A
UVM_INFO @ 185.296000 us: (uvm_report_catcher.svh:705) [UVM/REPORT/CATCHER]
--- UVM Report catcher Summary ---
UVM_FATAL @ * us: (mem_bkdr_util.sv:658) [mem_bkdr_util[Otp]] file otp_ctrl_img_rma.vmem could not be opened for r mode 3 test runs
chip_csr_bit_bash 51105150517912317563719629340536553501374146042281865175710092743741525349120 143
UVM_INFO @ 0.000000 us: (uvm_report_catcher.svh:705) [UVM/REPORT/CATCHER]
--- UVM Report catcher Summary ---
chip_csr_aliasing 3031523115222503392397628441852790808122946511334042999530581540263163243966 143
UVM_INFO @ 0.000000 us: (uvm_report_catcher.svh:705) [UVM/REPORT/CATCHER]
--- UVM Report catcher Summary ---
chip_same_csr_outstanding 61636653258874916235212576254618665494423219632239467763113319261321416976210 143
UVM_INFO @ 0.000000 us: (uvm_report_catcher.svh:705) [UVM/REPORT/CATCHER]
--- UVM Report catcher Summary ---
UVM_ERROR @ * us: (jtag_riscv_driver.sv:221) [jtag_riscv_agent_pkg] Check failed sbcs_val[SbAccess32] == * (* [*] vs * [*]) expect SBA width to be * bits! 2 test runs
chip_jtag_csr_rw 46366979674711518495030167610173520529065945756415994315953780925235490683249 5963
UVM_INFO @ 133.794000 us: (uvm_report_catcher.svh:705) [UVM/REPORT/CATCHER]
--- UVM Report catcher Summary ---
chip_jtag_mem_access 38536416630509095999909619412001032898978927004361544296232880594809373823652 5963
UVM_INFO @ 131.394000 us: (uvm_report_catcher.svh:705) [UVM/REPORT/CATCHER]
--- UVM Report catcher Summary ---
UVM_FATAL @ * us: (mem_bkdr_util.sv:658) [mem_bkdr_util[Rom0]] file example_test_from_rom_rom_prog_sim_dv.*.scr.vmem could not be opened for r mode 1 test run
chip_sw_example_rom 28541957435433330561666804356857401305119085955413506133898817903265301677578 291
UVM_INFO @ 10.220001 us: (uvm_report_catcher.svh:705) [UVM/REPORT/CATCHER]
--- UVM Report catcher Summary ---
UVM_ERROR @ * us: (sw_logger_if.sv:526) [all_escalation_resets_test_sim_dv(sw/device/lib/testing/alert_handler_testutils.c:78)] CHECK-fail: word_index < dump_size 1 test run
chip_sw_all_escalation_resets 100611119710063838627650485770548217671709685022125947591075045527647950234625 359
UVM_INFO @ 943.441000 us: (uvm_report_catcher.svh:705) [UVM/REPORT/CATCHER]
--- UVM Report catcher Summary ---
UVM_FATAL @ * us: (sec_cm_pkg.sv:48) [sec_cm_pkg::find_sec_cm_if_proxy] no proxy with path *rstmgr.u_d0_spi_host*.leaf_rst_path 1 test run
chip_sw_rstmgr_rst_cnsty_escalation 3152813761845684148706224280753212009402814244008061657738450552968491964478 320
UVM_INFO @ 10.100001 us: (uvm_report_catcher.svh:705) [UVM/REPORT/CATCHER]
--- UVM Report catcher Summary ---
UVM_ERROR @ * us: (sw_logger_if.sv:526) [spi_passthrough_test_sim_dv(sw/device/tests/sim_dv/spi_passthrough_test.c:382)] CHECK-fail: irq == kDtSpiDeviceIrqUploadCmdfifoNotEmpty 1 test run
chip_sw_spi_device_pass_through_collision 78586089728845250552615857854779079327445302152431848119362583044111271252441 341
UVM_INFO @ 251.781000 us: (uvm_report_catcher.svh:705) [UVM/REPORT/CATCHER]
--- UVM Report catcher Summary ---
Offending '(!$fell(lc_ctrl_pkg::lc_tx_test_true_strict(lc_init_done_o)))' 1 test run
chip_sw_otp_ctrl_escalation 23530809151070167870365557415637853547435191765390867286609746460888722818759 335
UVM_ERROR @ 176.856000 us: (lc_ctrl.sv:884) [ASSERT FAILED] LcInitDoneSticky_A
UVM_INFO @ 176.856000 us: (uvm_report_catcher.svh:705) [UVM/REPORT/CATCHER]
--- UVM Report catcher Summary ---
UVM_ERROR @ * us: (sw_logger_if.sv:526) [rstmgr_alert_info_test_sim_dv(sw/device/lib/testing/alert_handler_testutils.c:78)] CHECK-fail: word_index < dump_size 1 test run
chip_sw_rstmgr_alert_info 73855002227220917240092877338810607627915085854031311295717450619922660153403 349
UVM_INFO @ 331.084000 us: (uvm_report_catcher.svh:705) [UVM/REPORT/CATCHER]
--- UVM Report catcher Summary ---
UVM_ERROR @ * us: (chip_sw_soc_proxy_smoke_vseq.sv:36) [chip_env_pkg::\chip_sw_soc_proxy_smoke_vseq::body ] Resets did not complete within required time! 1 test run
chip_sw_soc_proxy_smoketest 21789416223298508596206909789358489983110391812447681959187309991706220550517 328
UVM_INFO @ 156.240000 us: (uvm_report_catcher.svh:705) [UVM/REPORT/CATCHER]
--- UVM Report catcher Summary ---
UVM_ERROR @ * us: (sw_logger_if.sv:526) [soc_proxy_external_wakeup_sim_dv(sw/device/tests/soc_proxy_external_wakeup.c:50)] DIF-fail: dif_pwrmgr_get_request_sources(&pwrmgr, kDifPwrmgrReqTypeWakeup, &wakeup_req_srcs) returns * 1 test run
chip_sw_soc_proxy_external_wakeup 62541532366751741935728812923010748888738259944241899223442741603029668746788 326
UVM_INFO @ 157.857000 us: (uvm_report_catcher.svh:705) [UVM/REPORT/CATCHER]
--- UVM Report catcher Summary ---
UVM_ERROR @ * us: (sw_logger_if.sv:526) [aon_timer_irq_test_sim_dv(sw/device/tests/aon_timer_irq_test.c:139)] CHECK-fail: Timer took * usec which is not in the range * usec and * usec 1 test run
chip_sw_aon_timer_irq 43126861573126509532150399317096318625983071960251954415987911866783663094761 327
UVM_INFO @ 596.374000 us: (uvm_report_catcher.svh:705) [UVM/REPORT/CATCHER]
--- UVM Report catcher Summary ---
UVM_ERROR @ * us: (sw_logger_if.sv:526) [aon_timer_wdog_bite_reset_test_sim_dv(sw/device/tests/aon_timer_wdog_bite_reset_test.c:84)] CHECK-fail: Wdog bark irq did not rise after * microseconds 1 test run
chip_sw_aon_timer_wdog_bite_reset 64623741395504473412917948197296678723806975411960948399701146618762768546803 328
UVM_INFO @ 182.539000 us: (uvm_report_catcher.svh:705) [UVM/REPORT/CATCHER]
--- UVM Report catcher Summary ---
UVM_ERROR @ * us: (sw_logger_if.sv:526) [rv_core_ibex_rnd_test_sim_dv(sw/device/tests/rv_core_ibex_rnd_test.c:94)] CHECK-fail: status_value == * 1 test run
chip_sw_rv_core_ibex_rnd 105507632668789779467912219223971178839480937561570832841150752896710401528233 326
UVM_INFO @ 181.343000 us: (uvm_report_catcher.svh:705) [UVM/REPORT/CATCHER]
--- UVM Report catcher Summary ---
UVM_ERROR @ * us: (sw_logger_if.sv:526) [rv_core_ibex_nmi_irq_test_sim_dv(sw/device/tests/rv_core_ibex_nmi_irq_test.c:172)] CHECK-fail: Timed out after * usec (* CPU cycles) waiting for nmi_fired 1 test run
chip_sw_rv_core_ibex_nmi_irq 10545547774133403296440162765359445028844144044401671454207718184247219449894 329
UVM_INFO @ 269.306000 us: (uvm_report_catcher.svh:705) [UVM/REPORT/CATCHER]
--- UVM Report catcher Summary ---
Offending '(tl_h_i[*].a_source[(IDW - *)-:STIDW] == '0)' 1 test run
chip_tl_errors 62048925453624578595767584583548181788670499488874229736176378371635999707598 239
UVM_ERROR @ 117.739000 us: (tlul_socket_m1.sv:101) [ASSERT FAILED] idInRange
UVM_INFO @ 117.739000 us: (uvm_report_catcher.svh:705) [UVM/REPORT/CATCHER]
--- UVM Report catcher Summary ---
UVM_ERROR @ * us: (cip_base_vseq.sv:660) [chip_rv_dm_lc_disabled_vseq] Check failed masked_data == exp_data (* [*] vs * [*]) addr * read out mismatch 1 test run
chip_rv_dm_lc_disabled 43802242820436559198115489016902211568529234483738109982159242953812492924525 224
UVM_INFO @ 123.705000 us: (uvm_report_catcher.svh:705) [UVM/REPORT/CATCHER]
--- UVM Report catcher Summary ---
Error-[CNST-CIF] Constraints inconsistency failure 1 test run
chip_padctrl_attributes 93223651134298232751298304397876335809058511097153122948248221846749522144279 288
src/lowrisc_dv_dv_lib_0/dv_base_test.sv, 143
Constraints are inconsistent and cannot be solved.
Please check the inconsistent constraints being printed above and rewrite
them.
UVM_ERROR @ * us: (sw_test_status_if.sv:85) [tb.u_sim_sram.u_sim_sram_if.u_sw_test_status_if] ==== SW TEST FAILED ==== 1 test run
chip_sw_dma_abort 45914269963280846086294330749510643865297155072691555914383777131341832582195 347
UVM_INFO @ 213.027000 us: (uvm_report_catcher.svh:705) [UVM/REPORT/CATCHER]
--- UVM Report catcher Summary ---