Simulation Results: aes/gcm_unmasked

 
24/07/2026 15:00:35 DVSim: v1.49.0 sha: ffebaba json Branch: master Tool: xcelium [unknown]
Coverage statistics
  • Total
  • 92.20 %
  • code
  • 94.09 %
  • assert
  • 97.94 %
  • func
  • 84.57 %
  • block
  • 94.71 %
  • line
  • 95.57 %
  • branch
  • 89.89 %
  • toggle
  • 97.99 %
  • FSM
  • 92.91 %
Validation stages
V1
100.00%
V2
94.04%
V2S
89.08%
V3
0.00%
Testpoint Test Max Runtime Sim Time Pass Total %
wake_up 1 1 100.00
aes_wake_up 3.000s 71.867us 1 1 100.00
smoke 10 10 100.00
aes_smoke 4.000s 71.478us 10 10 100.00
csr_hw_reset 1 1 100.00
aes_csr_hw_reset 2.000s 67.534us 1 1 100.00
csr_rw 5 5 100.00
aes_csr_rw 3.000s 135.915us 5 5 100.00
csr_bit_bash 1 1 100.00
aes_csr_bit_bash 7.000s 3312.150us 1 1 100.00
csr_aliasing 1 1 100.00
aes_csr_aliasing 2.000s 198.140us 1 1 100.00
csr_mem_rw_with_rand_reset 5 5 100.00
aes_csr_mem_rw_with_rand_reset 3.000s 116.494us 5 5 100.00
regwen_csr_and_corresponding_lockable_csr 6 6 100.00
aes_csr_rw 3.000s 135.915us 5 5 100.00
aes_csr_aliasing 2.000s 198.140us 1 1 100.00
Testpoint Test Max Runtime Sim Time Pass Total %
algorithm 70 70 100.00
aes_smoke 4.000s 71.478us 10 10 100.00
aes_config_error 7.000s 244.407us 50 50 100.00
aes_stress 5.000s 800.435us 10 10 100.00
key_length 70 70 100.00
aes_smoke 4.000s 71.478us 10 10 100.00
aes_config_error 7.000s 244.407us 50 50 100.00
aes_stress 5.000s 800.435us 10 10 100.00
back2back 35 35 100.00
aes_stress 5.000s 800.435us 10 10 100.00
aes_b2b 10.000s 189.753us 25 25 100.00
backpressure 10 10 100.00
aes_stress 5.000s 800.435us 10 10 100.00
multi_message 88 95 92.63
aes_smoke 4.000s 71.478us 10 10 100.00
aes_config_error 7.000s 244.407us 50 50 100.00
aes_stress 5.000s 800.435us 10 10 100.00
aes_alert_reset 3601.000s 0.000us 18 25 72.00
failure_test 78 85 91.76
aes_man_cfg_err 3.000s 57.828us 10 10 100.00
aes_config_error 7.000s 244.407us 50 50 100.00
aes_alert_reset 3601.000s 0.000us 18 25 72.00
trigger_clear_test 10 10 100.00
aes_clear 5.000s 381.781us 10 10 100.00
nist_test_vectors 1 1 100.00
aes_nist_vectors 6.000s 1566.311us 1 1 100.00
reset_recovery 18 25 72.00
aes_alert_reset 3601.000s 0.000us 18 25 72.00
stress 10 10 100.00
aes_stress 5.000s 800.435us 10 10 100.00
sideload 20 20 100.00
aes_stress 5.000s 800.435us 10 10 100.00
aes_sideload 5.000s 275.930us 10 10 100.00
deinitialization 10 10 100.00
aes_deinit 4.000s 647.596us 10 10 100.00
stress_all 4 10 40.00
aes_stress_all 13.000s 4942.348us 4 10 40.00
alert_test 10 10 100.00
aes_alert_test 3.000s 77.611us 10 10 100.00
tl_d_oob_addr_access 25 25 100.00
aes_tl_errors 4.000s 525.079us 25 25 100.00
tl_d_illegal_access 25 25 100.00
aes_tl_errors 4.000s 525.079us 25 25 100.00
tl_d_outstanding_access 12 12 100.00
aes_csr_hw_reset 2.000s 67.534us 1 1 100.00
aes_csr_rw 3.000s 135.915us 5 5 100.00
aes_csr_aliasing 2.000s 198.140us 1 1 100.00
aes_same_csr_outstanding 3.000s 120.289us 5 5 100.00
tl_d_partial_access 12 12 100.00
aes_csr_hw_reset 2.000s 67.534us 1 1 100.00
aes_csr_rw 3.000s 135.915us 5 5 100.00
aes_csr_aliasing 2.000s 198.140us 1 1 100.00
aes_same_csr_outstanding 3.000s 120.289us 5 5 100.00
Testpoint Test Max Runtime Sim Time Pass Total %
reseeding 6 10 60.00
aes_reseed 4.000s 108.931us 6 10 60.00
fault_inject 577 660 87.42
aes_fi 3600.000s 0.000us 0 10 0.00
aes_control_fi 61.000s 0.000us 269 300 89.67
aes_cipher_fi 61.000s 0.000us 308 350 88.00
shadow_reg_update_error 20 20 100.00
aes_shadow_reg_errors 3.000s 150.341us 20 20 100.00
shadow_reg_read_clear_staged_value 20 20 100.00
aes_shadow_reg_errors 3.000s 150.341us 20 20 100.00
shadow_reg_storage_error 20 20 100.00
aes_shadow_reg_errors 3.000s 150.341us 20 20 100.00
shadowed_reset_glitch 20 20 100.00
aes_shadow_reg_errors 3.000s 150.341us 20 20 100.00
shadow_reg_update_error_with_csr_rw 20 20 100.00
aes_shadow_reg_errors_with_csr_rw 5.000s 477.024us 20 20 100.00
tl_intg_err 30 30 100.00
aes_sec_cm 6.000s 3492.189us 5 5 100.00
aes_tl_intg_err 4.000s 237.319us 25 25 100.00
sec_cm_bus_integrity 25 25 100.00
aes_tl_intg_err 4.000s 237.319us 25 25 100.00
sec_cm_lc_escalate_en_intersig_mubi 18 25 72.00
aes_alert_reset 3601.000s 0.000us 18 25 72.00
sec_cm_main_config_shadow 20 20 100.00
aes_shadow_reg_errors 3.000s 150.341us 20 20 100.00
sec_cm_gcm_config_shadow 20 20 100.00
aes_shadow_reg_errors 3.000s 150.341us 20 20 100.00
sec_cm_main_config_sparse 125 145 86.21
aes_smoke 4.000s 71.478us 10 10 100.00
aes_stress 5.000s 800.435us 10 10 100.00
aes_alert_reset 3601.000s 0.000us 18 25 72.00
aes_core_fi 1048.000s 200000.000us 87 100 87.00
sec_cm_gcm_config_sparse 147 160 91.88
aes_config_error 7.000s 244.407us 50 50 100.00
aes_stress 5.000s 800.435us 10 10 100.00
aes_core_fi 1048.000s 200000.000us 87 100 87.00
sec_cm_aux_config_shadow 20 20 100.00
aes_shadow_reg_errors 3.000s 150.341us 20 20 100.00
sec_cm_aux_config_regwen 20 20 100.00
aes_readability 3.000s 89.376us 10 10 100.00
aes_stress 5.000s 800.435us 10 10 100.00
sec_cm_key_sideload 20 20 100.00
aes_stress 5.000s 800.435us 10 10 100.00
aes_sideload 5.000s 275.930us 10 10 100.00
sec_cm_key_sw_unreadable 10 10 100.00
aes_readability 3.000s 89.376us 10 10 100.00
sec_cm_data_reg_sw_unreadable 10 10 100.00
aes_readability 3.000s 89.376us 10 10 100.00
sec_cm_key_sec_wipe 10 10 100.00
aes_readability 3.000s 89.376us 10 10 100.00
sec_cm_iv_config_sec_wipe 10 10 100.00
aes_readability 3.000s 89.376us 10 10 100.00
sec_cm_data_reg_sec_wipe 10 10 100.00
aes_readability 3.000s 89.376us 10 10 100.00
sec_cm_data_reg_key_sca 10 10 100.00
aes_stress 5.000s 800.435us 10 10 100.00
sec_cm_key_masking 10 10 100.00
aes_stress 5.000s 800.435us 10 10 100.00
sec_cm_main_fsm_sparse 0 10 0.00
aes_fi 3600.000s 0.000us 0 10 0.00
sec_cm_main_fsm_redun 602 685 87.88
aes_fi 3600.000s 0.000us 0 10 0.00
aes_control_fi 61.000s 0.000us 269 300 89.67
aes_cipher_fi 61.000s 0.000us 308 350 88.00
aes_ctr_fi 3.000s 58.286us 25 25 100.00
sec_cm_cipher_fsm_sparse 0 10 0.00
aes_fi 3600.000s 0.000us 0 10 0.00
sec_cm_cipher_fsm_redun 577 660 87.42
aes_fi 3600.000s 0.000us 0 10 0.00
aes_control_fi 61.000s 0.000us 269 300 89.67
aes_cipher_fi 61.000s 0.000us 308 350 88.00
sec_cm_cipher_ctr_redun 308 350 88.00
aes_cipher_fi 61.000s 0.000us 308 350 88.00
sec_cm_ctr_fsm_sparse 0 10 0.00
aes_fi 3600.000s 0.000us 0 10 0.00
sec_cm_ctr_fsm_redun 294 335 87.76
aes_fi 3600.000s 0.000us 0 10 0.00
aes_control_fi 61.000s 0.000us 269 300 89.67
aes_ctr_fi 3.000s 58.286us 25 25 100.00
sec_cm_ghash_fsm_sparse 0 10 0.00
aes_fi 3600.000s 0.000us 0 10 0.00
sec_cm_ctrl_sparse 602 685 87.88
aes_fi 3600.000s 0.000us 0 10 0.00
aes_control_fi 61.000s 0.000us 269 300 89.67
aes_cipher_fi 61.000s 0.000us 308 350 88.00
aes_ctr_fi 3.000s 58.286us 25 25 100.00
sec_cm_main_fsm_global_esc 18 25 72.00
aes_alert_reset 3601.000s 0.000us 18 25 72.00
sec_cm_main_fsm_local_esc 602 685 87.88
aes_fi 3600.000s 0.000us 0 10 0.00
aes_control_fi 61.000s 0.000us 269 300 89.67
aes_cipher_fi 61.000s 0.000us 308 350 88.00
aes_ctr_fi 3.000s 58.286us 25 25 100.00
sec_cm_cipher_fsm_local_esc 602 685 87.88
aes_fi 3600.000s 0.000us 0 10 0.00
aes_control_fi 61.000s 0.000us 269 300 89.67
aes_cipher_fi 61.000s 0.000us 308 350 88.00
aes_ctr_fi 3.000s 58.286us 25 25 100.00
sec_cm_ctr_fsm_local_esc 294 335 87.76
aes_fi 3600.000s 0.000us 0 10 0.00
aes_control_fi 61.000s 0.000us 269 300 89.67
aes_ctr_fi 3.000s 58.286us 25 25 100.00
sec_cm_ghash_fsm_local_esc 0 10 0.00
aes_fi 3600.000s 0.000us 0 10 0.00
sec_cm_data_reg_local_esc 577 660 87.42
aes_fi 3600.000s 0.000us 0 10 0.00
aes_control_fi 61.000s 0.000us 269 300 89.67
aes_cipher_fi 61.000s 0.000us 308 350 88.00
Testpoint Test Max Runtime Sim Time Pass Total %
stress_all_with_rand_reset 0 10 0.00
aes_stress_all_with_rand_reset 32.000s 1387.891us 0 10 0.00

Error Messages

   Test seed line log context
UVM_FATAL (aes_cipher_fi_vseq.sv:62) [aes_cipher_fi_vseq] wait timeout occurred! 26 test runs
aes_cipher_fi 58715383046122903846650411085259557552151454219299872446002710216912488345465 157
UVM_INFO @ 10020989975 ps: (uvm_report_catcher.svh:705) [UVM/REPORT/CATCHER]
--- UVM Report catcher Summary ---
aes_cipher_fi 92470076656309413019554011432743017320424465526745116787056140779557811695451 147
UVM_INFO @ 10005807126 ps: (uvm_report_catcher.svh:705) [UVM/REPORT/CATCHER]
--- UVM Report catcher Summary ---
aes_cipher_fi 52492576304012723947218604444495527870007083819558494397635579981219174483489 145
UVM_INFO @ 10011424936 ps: (uvm_report_catcher.svh:705) [UVM/REPORT/CATCHER]
--- UVM Report catcher Summary ---
aes_cipher_fi 263320795504483005181511551836452367851432046047109281275519455080620594800 152
UVM_INFO @ 10015092795 ps: (uvm_report_catcher.svh:705) [UVM/REPORT/CATCHER]
--- UVM Report catcher Summary ---
aes_cipher_fi 36766814570558713164795684082455715651157392030263774782787887916976807649236 153
UVM_INFO @ 10004161831 ps: (uvm_report_catcher.svh:705) [UVM/REPORT/CATCHER]
--- UVM Report catcher Summary ---
aes_cipher_fi 60642577639556092610506913207003728608048684144585084450449140741924910255478 153
UVM_INFO @ 10004933796 ps: (uvm_report_catcher.svh:705) [UVM/REPORT/CATCHER]
--- UVM Report catcher Summary ---
aes_cipher_fi 4953483524750745671482551504981658790939300600425175211274988749383372591274 148
UVM_INFO @ 10006598929 ps: (uvm_report_catcher.svh:705) [UVM/REPORT/CATCHER]
--- UVM Report catcher Summary ---
aes_cipher_fi 17829344803876353288863492486620509667191848576494506590414174094101627479243 142
UVM_INFO @ 10007915387 ps: (uvm_report_catcher.svh:705) [UVM/REPORT/CATCHER]
--- UVM Report catcher Summary ---
aes_cipher_fi 28378879055360548605743215951381579591572018566605586334955167085764752427552 148
UVM_INFO @ 10016214643 ps: (uvm_report_catcher.svh:705) [UVM/REPORT/CATCHER]
--- UVM Report catcher Summary ---
aes_cipher_fi 32986612085273827021227202865315097620904844203491838997287324202654071684412 141
UVM_INFO @ 10008089424 ps: (uvm_report_catcher.svh:705) [UVM/REPORT/CATCHER]
--- UVM Report catcher Summary ---
aes_cipher_fi 107554647212546623132529884134489088613739038507065511959076480972787872536059 147
UVM_INFO @ 10005878629 ps: (uvm_report_catcher.svh:705) [UVM/REPORT/CATCHER]
--- UVM Report catcher Summary ---
aes_cipher_fi 13982560067021346529490624507158112064085552335048704720281389027345197180262 150
UVM_INFO @ 10002106426 ps: (uvm_report_catcher.svh:705) [UVM/REPORT/CATCHER]
--- UVM Report catcher Summary ---
aes_cipher_fi 38132371718347496343219442824528956537038687057345569709570238902874937603480 151
UVM_INFO @ 10045510594 ps: (uvm_report_catcher.svh:705) [UVM/REPORT/CATCHER]
--- UVM Report catcher Summary ---
aes_cipher_fi 52618640634237600554260283943909555616016990232793835961747334635937729701780 145
UVM_INFO @ 10014892827 ps: (uvm_report_catcher.svh:705) [UVM/REPORT/CATCHER]
--- UVM Report catcher Summary ---
aes_cipher_fi 30880142419630395118995159563089561241893065041845652842013726474592902290013 144
UVM_INFO @ 10003765881 ps: (uvm_report_catcher.svh:705) [UVM/REPORT/CATCHER]
--- UVM Report catcher Summary ---
aes_cipher_fi 49247828998962875404992955124441395327820229425622015820631444045788256763832 140
UVM_INFO @ 10008178486 ps: (uvm_report_catcher.svh:705) [UVM/REPORT/CATCHER]
--- UVM Report catcher Summary ---
aes_cipher_fi 71441833393705681088291165457832577289370694197579334247485912217589129021634 141
UVM_INFO @ 10017609754 ps: (uvm_report_catcher.svh:705) [UVM/REPORT/CATCHER]
--- UVM Report catcher Summary ---
aes_cipher_fi 67926239416224683689717080594928119590241004028510143068004913011341640900954 143
UVM_INFO @ 10013207296 ps: (uvm_report_catcher.svh:705) [UVM/REPORT/CATCHER]
--- UVM Report catcher Summary ---
aes_cipher_fi 20950379535221721561025177341478325157504824486659356505495728894652980507498 148
UVM_INFO @ 10019087592 ps: (uvm_report_catcher.svh:705) [UVM/REPORT/CATCHER]
--- UVM Report catcher Summary ---
aes_cipher_fi 84562728107943418831916194145827439417093361054586809415205893801929572948054 148
UVM_INFO @ 10007441826 ps: (uvm_report_catcher.svh:705) [UVM/REPORT/CATCHER]
--- UVM Report catcher Summary ---
aes_cipher_fi 74762476478473980572336992161963318335053480169414363463028084388055523466588 151
UVM_INFO @ 10012525655 ps: (uvm_report_catcher.svh:705) [UVM/REPORT/CATCHER]
--- UVM Report catcher Summary ---
aes_cipher_fi 89997284879033596330943846006921505233708194940354631242743923419025732030942 143
UVM_INFO @ 10007259524 ps: (uvm_report_catcher.svh:705) [UVM/REPORT/CATCHER]
--- UVM Report catcher Summary ---
aes_cipher_fi 59356336509253221954577428061269284240852872187517649676756900388475973961789 151
UVM_INFO @ 10005659246 ps: (uvm_report_catcher.svh:705) [UVM/REPORT/CATCHER]
--- UVM Report catcher Summary ---
aes_cipher_fi 63669749188288571104514897554875736244121583738895981747903416638199710949221 155
UVM_INFO @ 10010568879 ps: (uvm_report_catcher.svh:705) [UVM/REPORT/CATCHER]
--- UVM Report catcher Summary ---
aes_cipher_fi 39791468504768744696263264881163657052197564273760003382990414084842641107361 147
UVM_INFO @ 10007454177 ps: (uvm_report_catcher.svh:705) [UVM/REPORT/CATCHER]
--- UVM Report catcher Summary ---
aes_cipher_fi 113840153284936564951477345962855698995746231033533291325657113366756996543059 152
UVM_INFO @ 10009843729 ps: (uvm_report_catcher.svh:705) [UVM/REPORT/CATCHER]
--- UVM Report catcher Summary ---
Job timed out after * minutes 25 test runs
aes_fi 34059051993279491125753243289992819563361877622592025950375292315942471561417 None
aes_alert_reset 52518905941729923899776009028192980983916349673763438837008954446579436894832 None
aes_alert_reset 34417293810475761113754671386682188681821534627134813700932292196893018708529 None
aes_alert_reset 31502883092803859726889941134363768292245724680098881176525135671824764385812 None
aes_control_fi 112012381519265007640772888697350899850307475504603068657922152763196474632301 None
aes_cipher_fi 14574793525107669540349039804683424094033272276998935585068089597258157980831 None
aes_control_fi 14305265406391447695890585096176127815053912088231703473114836614309439161280 None
aes_cipher_fi 49813217892193424271663876276907268682017810645268412102660037592452024298574 None
aes_cipher_fi 86500182188990654250276717768712132434350972127615493988743939186063969907630 None
aes_cipher_fi 67779617551720756622924726925441006641380625417530814861544757773891135223520 None
aes_control_fi 4729254724223044555637074839600692224303974192720297402353624838151154634256 None
aes_cipher_fi 87824025533975884218783006918429236262491136013064161841266499735549991443735 None
aes_cipher_fi 29477913246608320043252817072791554855047349573516927416856142950453777255402 None
aes_cipher_fi 109329827595016636793452240759078617087761051788056240257433937960043147155374 None
aes_control_fi 70047762843463894741775675369934142935795690247042801849142117446434742280038 None
aes_control_fi 21081343639065136145578799912139899123383861445638141982429540194987601371151 None
aes_cipher_fi 87449317401310922953989076327711917602117728074300372870159029148096114219460 None
aes_cipher_fi 67285789334747910901093758813148039975115274449999460714876585112060313560718 None
aes_cipher_fi 42844023396153109227683013296530863028815155628673914043615065918161891082985 None
aes_control_fi 18405227040613609951741208598060553677325723534718725086767064366180300468125 None
aes_control_fi 5627940747753491703764615196341861408029666897354845522800234590574661545432 None
aes_cipher_fi 113094133998417735948308817485356467239884733596137512931720157365407674999110 None
aes_cipher_fi 2913716734896016313781308061567482792114482555833543036703951709519495188601 None
aes_control_fi 58206350396938362949654150511842405076685533207125468335628105167307918890706 None
aes_cipher_fi 29000241380951920158563969182789151121124521655444486401244109479221628705415 None
UVM_FATAL (aes_control_fi_vseq.sv:62) [aes_control_fi_vseq] wait timeout occurred! 21 test runs
aes_control_fi 48943208916636605935519656598133245541721154750647771845233976278758853368555 146
UVM_INFO @ 10002851466 ps: (uvm_report_catcher.svh:705) [UVM/REPORT/CATCHER]
--- UVM Report catcher Summary ---
aes_control_fi 15364288282051838283227565349454622954438896183248288128531895141640489494209 143
UVM_INFO @ 10007432086 ps: (uvm_report_catcher.svh:705) [UVM/REPORT/CATCHER]
--- UVM Report catcher Summary ---
aes_control_fi 115402965341650891687328120356600958751065044439634897374650077852445098906475 140
UVM_INFO @ 10005305840 ps: (uvm_report_catcher.svh:705) [UVM/REPORT/CATCHER]
--- UVM Report catcher Summary ---
aes_control_fi 73568294821083769176200231938067588797012447154832834110369797100101377743732 144
UVM_INFO @ 10020672688 ps: (uvm_report_catcher.svh:705) [UVM/REPORT/CATCHER]
--- UVM Report catcher Summary ---
aes_control_fi 93528533373514368567885931474905060961205073280557641140852657376571149123160 149
UVM_INFO @ 10011089759 ps: (uvm_report_catcher.svh:705) [UVM/REPORT/CATCHER]
--- UVM Report catcher Summary ---
aes_control_fi 4235222365306754624641042085274728690662650336695893605234645370139127788989 153
UVM_INFO @ 10029003122 ps: (uvm_report_catcher.svh:705) [UVM/REPORT/CATCHER]
--- UVM Report catcher Summary ---
aes_control_fi 58083002318860045174047473167743261544974306639646904160643058721096644911071 145
UVM_INFO @ 10006115016 ps: (uvm_report_catcher.svh:705) [UVM/REPORT/CATCHER]
--- UVM Report catcher Summary ---
aes_control_fi 23975505245319729920464435350282167180942287697576114334176447095700050359397 146
UVM_INFO @ 10002839494 ps: (uvm_report_catcher.svh:705) [UVM/REPORT/CATCHER]
--- UVM Report catcher Summary ---
aes_control_fi 20513438050499147166858561886045704900695171319972343094676382120386529552886 147
UVM_INFO @ 10026308903 ps: (uvm_report_catcher.svh:705) [UVM/REPORT/CATCHER]
--- UVM Report catcher Summary ---
aes_control_fi 43259504300295368860706615672284365127767088540916699821727213050328956280027 152
UVM_INFO @ 10003188848 ps: (uvm_report_catcher.svh:705) [UVM/REPORT/CATCHER]
--- UVM Report catcher Summary ---
aes_control_fi 98604166231338134446450450352947488460084463398660955797664539139456329195295 143
UVM_INFO @ 10008344594 ps: (uvm_report_catcher.svh:705) [UVM/REPORT/CATCHER]
--- UVM Report catcher Summary ---
aes_control_fi 22409044147352059505123291060639332929771438180812031334942116520833447192049 146
UVM_INFO @ 10019430371 ps: (uvm_report_catcher.svh:705) [UVM/REPORT/CATCHER]
--- UVM Report catcher Summary ---
aes_control_fi 103925707766917482821694745141645815264823434364775780377914517115074084577948 146
UVM_INFO @ 10002138009 ps: (uvm_report_catcher.svh:705) [UVM/REPORT/CATCHER]
--- UVM Report catcher Summary ---
aes_control_fi 106096920381185532802845588950909380180807937445218149949623045652971585404903 141
UVM_INFO @ 10015425895 ps: (uvm_report_catcher.svh:705) [UVM/REPORT/CATCHER]
--- UVM Report catcher Summary ---
aes_control_fi 20595410957774777000788940970612064800481833190513694288284586227729200587375 143
UVM_INFO @ 10002750173 ps: (uvm_report_catcher.svh:705) [UVM/REPORT/CATCHER]
--- UVM Report catcher Summary ---
aes_control_fi 54147973930695290033013845082406590957516044424838266593095018590583372788576 147
UVM_INFO @ 10013467493 ps: (uvm_report_catcher.svh:705) [UVM/REPORT/CATCHER]
--- UVM Report catcher Summary ---
aes_control_fi 66894753808688405731793004479529272686947951091680002333692017086998850500873 154
UVM_INFO @ 10003121377 ps: (uvm_report_catcher.svh:705) [UVM/REPORT/CATCHER]
--- UVM Report catcher Summary ---
aes_control_fi 32434836863259589492128888663425837390349998743706449187840481338391633428045 150
UVM_INFO @ 10009111988 ps: (uvm_report_catcher.svh:705) [UVM/REPORT/CATCHER]
--- UVM Report catcher Summary ---
aes_control_fi 102555881535540653165106595689577748477600262655285218106628180195510979267035 148
UVM_INFO @ 10014234482 ps: (uvm_report_catcher.svh:705) [UVM/REPORT/CATCHER]
--- UVM Report catcher Summary ---
aes_control_fi 91942893751050840743873740784551246480163424033384239552017051126120834300009 146
UVM_INFO @ 10014813336 ps: (uvm_report_catcher.svh:705) [UVM/REPORT/CATCHER]
--- UVM Report catcher Summary ---
aes_control_fi 69915195187692308683509271008038063249486982847774038899437151531059034802242 145
UVM_INFO @ 10006686774 ps: (uvm_report_catcher.svh:705) [UVM/REPORT/CATCHER]
--- UVM Report catcher Summary ---
UVM_ERROR (uvm_sequencer_base.svh:757) sequencer [SEQREQZMB] The task responsible for requesting a wait_for_grant on sequencer 'sequencer' for sequence 'parent_sequence' has been killed, to avoid a deadlock the sequence will be removed from the arbitration queues 12 test runs
aes_stress_all 59716168150316947948887195786600236152618124693834347947675830229718510612294 4875
UVM_INFO @ 74508410 ps: (uvm_report_catcher.svh:705) [UVM/REPORT/CATCHER]
--- UVM Report catcher Summary ---
aes_stress_all_with_rand_reset 51951390693716873929363889308463082283374045064878533203347417786126979145585 160
UVM_INFO @ 60335372 ps: (uvm_report_catcher.svh:705) [UVM/REPORT/CATCHER]
--- UVM Report catcher Summary ---
aes_reseed 662307044938827431081932027485190306029298265807864575925959189305605037026 1212
UVM_INFO @ 56357156 ps: (uvm_report_catcher.svh:705) [UVM/REPORT/CATCHER]
--- UVM Report catcher Summary ---
aes_stress_all 60724260700636831413439883291555704872959758149800173536675053048464755653288 19717
UVM_INFO @ 139847027 ps: (uvm_report_catcher.svh:705) [UVM/REPORT/CATCHER]
--- UVM Report catcher Summary ---
aes_stress_all_with_rand_reset 71213336374341406273452982482634092272026815899002437441674155631880683192071 741
UVM_INFO @ 1387891046 ps: (uvm_report_catcher.svh:705) [UVM/REPORT/CATCHER]
--- UVM Report catcher Summary ---
aes_stress_all 9089400852897731930426469375799925814145827935580791485085264052738805694248 15151
UVM_INFO @ 1230803204 ps: (uvm_report_catcher.svh:705) [UVM/REPORT/CATCHER]
--- UVM Report catcher Summary ---
aes_stress_all 103612228680308239562210926203503156543557903900035985186147455764958205109519 2757
UVM_INFO @ 52046959 ps: (uvm_report_catcher.svh:705) [UVM/REPORT/CATCHER]
--- UVM Report catcher Summary ---
aes_reseed 36166204778978779418070063330310605646000456996818263496778586857177956522746 732
UVM_INFO @ 29375546 ps: (uvm_report_catcher.svh:705) [UVM/REPORT/CATCHER]
--- UVM Report catcher Summary ---
aes_stress_all 33349384603471176621286711322955901041726740018795911033206646193885958595741 8709
UVM_INFO @ 186709887 ps: (uvm_report_catcher.svh:705) [UVM/REPORT/CATCHER]
--- UVM Report catcher Summary ---
aes_reseed 2427719092243981978554327787410087088246406654046299054722648858014490318344 2345
UVM_INFO @ 17653814 ps: (uvm_report_catcher.svh:705) [UVM/REPORT/CATCHER]
--- UVM Report catcher Summary ---
aes_stress_all_with_rand_reset 98361594507867338045456673170008766776773863381792747537551694494223520829109 221
UVM_INFO @ 43293946 ps: (uvm_report_catcher.svh:705) [UVM/REPORT/CATCHER]
--- UVM Report catcher Summary ---
aes_reseed 20154738382979454633089820994395332788102462083368295074284840897639064575861 6040
UVM_INFO @ 159110470 ps: (uvm_report_catcher.svh:705) [UVM/REPORT/CATCHER]
--- UVM Report catcher Summary ---
UVM_FATAL (aes_scoreboard.sv:926) scoreboard [scoreboard] 7 test runs
aes_fi 27483125315092317686189950753192332913974276663354371763523010553342823851332 7079
----| NO FAILURES BUT NUMBER OF EXPECTED MESSAGES DOES NOT MATCH ACTUAL
----| Expected: 5
----| Seen: 3
----| Expected corrupted: 0
aes_fi 93913143059200906892638956888832109819883892066175090711514034120037830547758 9630
----| NO FAILURES BUT NUMBER OF EXPECTED MESSAGES DOES NOT MATCH ACTUAL
----| Expected: 6
----| Seen: 5
----| Expected corrupted: 0
aes_fi 61199203149569408339170245700656541418847482627766916737475603187514998543664 5137
----| NO FAILURES BUT NUMBER OF EXPECTED MESSAGES DOES NOT MATCH ACTUAL
----| Expected: 4
----| Seen: 2
----| Expected corrupted: 0
aes_fi 57751838240301158142095526256284066247548031705144818167742256674045320394567 3927
----| NO FAILURES BUT NUMBER OF EXPECTED MESSAGES DOES NOT MATCH ACTUAL
----| Expected: 4
----| Seen: 3
----| Expected corrupted: 0
aes_fi 77768948060479835010453115243898189445008676549568381261328753581032859038630 4453
----| NO FAILURES BUT NUMBER OF EXPECTED MESSAGES DOES NOT MATCH ACTUAL
----| Expected: 3
----| Seen: 1
----| Expected corrupted: 0
aes_fi 66533675689551881925659318398255739657875598033094688613993475532667719197357 3764
----| NO FAILURES BUT NUMBER OF EXPECTED MESSAGES DOES NOT MATCH ACTUAL
----| Expected: 3
----| Seen: 2
----| Expected corrupted: 0
aes_fi 84879570185117954580016858752309125367436827983452266012795965019662437041260 5502
----| NO FAILURES BUT NUMBER OF EXPECTED MESSAGES DOES NOT MATCH ACTUAL
----| Expected: 4
----| Seen: 3
----| Expected corrupted: 0
UVM_FATAL (uvm_phase.svh:1521) [PH_TIMEOUT] Explicit timeout of * ps hit, indicating a probable testbench issue 6 test runs
aes_fi 745200255722959793903185510615534674703252275614887461766633326251946665112 1360836
UVM_INFO @ 200000000000 ps: (uvm_report_catcher.svh:705) [UVM/REPORT/CATCHER]
--- UVM Report catcher Summary ---
aes_alert_reset 16260568056589714708244132025531081545094822025661923146689703326584500419566 13559980
UVM_INFO @ 200000000000 ps: (uvm_report_catcher.svh:705) [UVM/REPORT/CATCHER]
--- UVM Report catcher Summary ---
aes_alert_reset 66739685821649029647267395543384750737979241900895612094644864370474613224891 4520297
UVM_INFO @ 200000000000 ps: (uvm_report_catcher.svh:705) [UVM/REPORT/CATCHER]
--- UVM Report catcher Summary ---
aes_alert_reset 60298866238941551768852898394962966772398977498206127397741403184082112074534 467495
UVM_INFO @ 200000000000 ps: (uvm_report_catcher.svh:705) [UVM/REPORT/CATCHER]
--- UVM Report catcher Summary ---
aes_alert_reset 63849293458699138386952515090687500049371957090902247448092964384247430584137 3932189
UVM_INFO @ 200000000000 ps: (uvm_report_catcher.svh:705) [UVM/REPORT/CATCHER]
--- UVM Report catcher Summary ---
aes_core_fi 88028392077764533037767495623471627799960168760373349168482698495667824975579 147
UVM_INFO @ 200000000000 ps: (uvm_report_catcher.svh:705) [UVM/REPORT/CATCHER]
--- UVM Report catcher Summary ---
UVM_FATAL (aes_core_fi_vseq.sv:70) [aes_core_fi_vseq] wait timeout occurred! 6 test runs
aes_core_fi 67981818777279020266477302153780845166654761136868097006382322306220903365647 144
UVM_INFO @ 10002157409 ps: (uvm_report_catcher.svh:705) [UVM/REPORT/CATCHER]
--- UVM Report catcher Summary ---
aes_core_fi 41287161153234450474921235010872911459198562492789995276998198137610408880552 149
UVM_INFO @ 10003908651 ps: (uvm_report_catcher.svh:705) [UVM/REPORT/CATCHER]
--- UVM Report catcher Summary ---
aes_core_fi 10178497635947252374644131304596970621944365954640268743118784669462862704968 153
UVM_INFO @ 10017014285 ps: (uvm_report_catcher.svh:705) [UVM/REPORT/CATCHER]
--- UVM Report catcher Summary ---
aes_core_fi 81360371006625369656484712961610172470610235589156273013308035247211752886425 148
UVM_INFO @ 10002911981 ps: (uvm_report_catcher.svh:705) [UVM/REPORT/CATCHER]
--- UVM Report catcher Summary ---
aes_core_fi 20060488451672935523523836175896243769925266399217567549740483371004529498182 147
UVM_INFO @ 10015406980 ps: (uvm_report_catcher.svh:705) [UVM/REPORT/CATCHER]
--- UVM Report catcher Summary ---
aes_core_fi 1544840463101444244290674932435778772425173634925533008584231508076784357038 151
UVM_INFO @ 10008320151 ps: (uvm_report_catcher.svh:705) [UVM/REPORT/CATCHER]
--- UVM Report catcher Summary ---
UVM_FATAL (cip_base_vseq.sv:1220) [aes_common_vseq] Check failed (vseq_done) 4 test runs
aes_stress_all_with_rand_reset 21731381265478052926181435656073824594256771201438619228526835496358996632064 540
UVM_INFO @ 703172824 ps: (uvm_report_catcher.svh:705) [UVM/REPORT/CATCHER]
--- UVM Report catcher Summary ---
aes_stress_all_with_rand_reset 28535962816724421594962502546380661029911449951274987266641296481593264729593 138
UVM_INFO @ 20041390 ps: (uvm_report_catcher.svh:705) [UVM/REPORT/CATCHER]
--- UVM Report catcher Summary ---
aes_stress_all_with_rand_reset 94675062342831288501794408187393447673616012425781068287133959956834097158829 139
UVM_INFO @ 6425025 ps: (uvm_report_catcher.svh:705) [UVM/REPORT/CATCHER]
--- UVM Report catcher Summary ---
aes_stress_all_with_rand_reset 71012787532355984533188478144776875654339485968663003904418683476942361126323 162
UVM_INFO @ 13053913 ps: (uvm_report_catcher.svh:705) [UVM/REPORT/CATCHER]
--- UVM Report catcher Summary ---
UVM_FATAL (csr_utils_pkg.sv:618) [csr_utils_pkg::csr_spinwait.isolation_fork] timeout aes_reg_block_extended.status.idle (addr=*, Comparison=CompareOpEq, exp_data=*, call_count=5) 3 test runs
aes_core_fi 80759991870600288080580288922484867115414255652457063381948339210988909165532 156
UVM_INFO @ 10015843030 ps: (uvm_report_catcher.svh:705) [UVM/REPORT/CATCHER]
--- UVM Report catcher Summary ---
aes_control_fi 18288274560028823597088039597455054491829623134952355087165345091532873600739 141
UVM_INFO @ 10023713978 ps: (uvm_report_catcher.svh:705) [UVM/REPORT/CATCHER]
--- UVM Report catcher Summary ---
aes_cipher_fi 60264941744803930131403490681461030576964996090572904010275029815795662132289 141
UVM_INFO @ 10034611448 ps: (uvm_report_catcher.svh:705) [UVM/REPORT/CATCHER]
--- UVM Report catcher Summary ---
UVM_FATAL (aes_core_fi_vseq.sv:93) [aes_core_fi_vseq] wait timeout occurred! 2 test runs
aes_core_fi 2488687900046335617516230501553202949799676315656843774335526376213037726061 150
UVM_INFO @ 10043435124 ps: (uvm_report_catcher.svh:705) [UVM/REPORT/CATCHER]
--- UVM Report catcher Summary ---
aes_core_fi 35901881994811919402287542429094551103778360848444289727982902668781321818731 141
UVM_INFO @ 10027279517 ps: (uvm_report_catcher.svh:705) [UVM/REPORT/CATCHER]
--- UVM Report catcher Summary ---
UVM_FATAL (aes_scoreboard.sv:785) scoreboard [scoreboard] # * 1 test run
aes_fi 40425096136745628070950568168755113999066656867287716019896384952086143530406 3466
TEST FAILED MESSAGES DID NOT MATCH
0 7b 93 00 0
1 00 27 00 0
UVM_FATAL (aes_base_vseq.sv:97) [aes_stress_vseq] Check failed (aes_ctrl_aux[*] == cfg.do_reseed) 1 test run
aes_stress_all_with_rand_reset 39135614415955925415464757713613526983116250608134101811014293225204388103197 114
UVM_INFO @ 2707423 ps: (uvm_report_catcher.svh:705) [UVM/REPORT/CATCHER]
--- UVM Report catcher Summary ---
UVM_ERROR (cip_base_scoreboard.sv:255) scoreboard [scoreboard] alert fatal_fault has unexpected timeout error 1 test run
aes_stress_all 41442610524242551641362961763917765704975511457208812612742380267223500398259 491
UVM_INFO @ 307375383 ps: (uvm_report_catcher.svh:705) [UVM/REPORT/CATCHER]
--- UVM Report catcher Summary ---
UVM_FATAL (aes_base_vseq.sv:97) [aes_reseed_vseq] Check failed (aes_ctrl_aux[*] == cfg.do_reseed) 1 test run
aes_stress_all_with_rand_reset 109590528346348370548861755066880262290129521966123175894892834251762958260813 114
UVM_INFO @ 35586994 ps: (uvm_report_catcher.svh:705) [UVM/REPORT/CATCHER]
--- UVM Report catcher Summary ---
UVM_FATAL (aes_base_vseq.sv:104) [aes_reseed_vseq] Check failed (aes_ctrl_aux[*] == cfg.do_reseed) 1 test run
aes_stress_all_with_rand_reset 99381760114187715321187267377416100630733349985216357892036040117859106334264 380
UVM_INFO @ 743406044 ps: (uvm_report_catcher.svh:705) [UVM/REPORT/CATCHER]
--- UVM Report catcher Summary ---
UVM_FATAL (csr_utils_pkg.sv:618) [csr_utils_pkg::csr_spinwait.isolation_fork] timeout aes_reg_block_extended.status.idle (addr=*, Comparison=CompareOpEq, exp_data=*, call_count=12) 1 test run
aes_core_fi 30372626298367474451855419781150732465576358305055468716759345188011725342845 152
UVM_INFO @ 10130386737 ps: (uvm_report_catcher.svh:705) [UVM/REPORT/CATCHER]
--- UVM Report catcher Summary ---
UVM_FATAL (csr_utils_pkg.sv:618) [csr_utils_pkg::csr_spinwait.isolation_fork] timeout aes_reg_block_extended.status.idle (addr=*, Comparison=CompareOpEq, exp_data=*, call_count=10) 1 test run
aes_core_fi 21299248365387027170366283300715655350613345038177459963588922642879064454397 144
UVM_INFO @ 10012932502 ps: (uvm_report_catcher.svh:705) [UVM/REPORT/CATCHER]
--- UVM Report catcher Summary ---
UVM_FATAL (aes_core_fi_vseq.sv:76) [aes_core_fi_vseq] wait timeout occurred! 1 test run
aes_core_fi 36860798043725092145369220990055192888186961226745649013933269627288639158173 147
UVM_INFO @ 10003884964 ps: (uvm_report_catcher.svh:705) [UVM/REPORT/CATCHER]
--- UVM Report catcher Summary ---
UVM_FATAL (csr_utils_pkg.sv:618) [csr_utils_pkg::csr_spinwait.isolation_fork] timeout aes_reg_block_extended.status.idle (addr=*, Comparison=CompareOpEq, exp_data=*, call_count=4) 1 test run
aes_cipher_fi 22454072018575807191946468144106580825175921750336884063840333447613080096915 141
UVM_INFO @ 10016554287 ps: (uvm_report_catcher.svh:705) [UVM/REPORT/CATCHER]
--- UVM Report catcher Summary ---
UVM_FATAL (csr_utils_pkg.sv:618) [csr_utils_pkg::csr_spinwait.isolation_fork] timeout aes_reg_block_extended.status.idle (addr=*, Comparison=CompareOpEq, exp_data=*, call_count=6) 1 test run
aes_control_fi 110801075317103647814202651190242507285553635250451826185476286865352989473766 142
UVM_INFO @ 10025281428 ps: (uvm_report_catcher.svh:705) [UVM/REPORT/CATCHER]
--- UVM Report catcher Summary ---
UVM_FATAL (csr_utils_pkg.sv:618) [csr_utils_pkg::csr_spinwait.isolation_fork] timeout aes_reg_block_extended.status.idle (addr=*, Comparison=CompareOpEq, exp_data=*, call_count=8) 1 test run
aes_cipher_fi 111053376402685464506344211598096541276371431886402317078605108121280000879574 150
UVM_INFO @ 10032684857 ps: (uvm_report_catcher.svh:705) [UVM/REPORT/CATCHER]
--- UVM Report catcher Summary ---