Simulation Results: aes/gcm_masked

 
14/08/2026 15:00:29 DVSim: v1.49.0 sha: d3fa90d json Branch: master Tool: xcelium [unknown]
Coverage statistics
  • Total
  • 97.30 %
  • code
  • 98.06 %
  • assert
  • 98.57 %
  • func
  • 95.26 %
  • block
  • 98.10 %
  • line
  • 99.06 %
  • branch
  • 95.06 %
  • toggle
  • 98.14 %
  • FSM
  • 100.00 %
Validation stages
V1
100.00%
V2
95.61%
V2S
92.31%
V3
0.00%
Testpoint Test Max Runtime Sim Time Pass Total %
wake_up 1 1 100.00
aes_wake_up 6.000s 545.031us 1 1 100.00
smoke 10 10 100.00
aes_smoke 5.000s 254.410us 10 10 100.00
csr_hw_reset 1 1 100.00
aes_csr_hw_reset 1.000s 74.355us 1 1 100.00
csr_rw 5 5 100.00
aes_csr_rw 3.000s 264.803us 5 5 100.00
csr_bit_bash 1 1 100.00
aes_csr_bit_bash 6.000s 1341.373us 1 1 100.00
csr_aliasing 1 1 100.00
aes_csr_aliasing 4.000s 2813.919us 1 1 100.00
csr_mem_rw_with_rand_reset 5 5 100.00
aes_csr_mem_rw_with_rand_reset 3.000s 104.120us 5 5 100.00
regwen_csr_and_corresponding_lockable_csr 6 6 100.00
aes_csr_rw 3.000s 264.803us 5 5 100.00
aes_csr_aliasing 4.000s 2813.919us 1 1 100.00
Testpoint Test Max Runtime Sim Time Pass Total %
algorithm 69 70 98.57
aes_smoke 5.000s 254.410us 10 10 100.00
aes_config_error 12.000s 426.511us 49 50 98.00
aes_stress 43.000s 1510.851us 10 10 100.00
key_length 69 70 98.57
aes_smoke 5.000s 254.410us 10 10 100.00
aes_config_error 12.000s 426.511us 49 50 98.00
aes_stress 43.000s 1510.851us 10 10 100.00
back2back 35 35 100.00
aes_stress 43.000s 1510.851us 10 10 100.00
aes_b2b 32.000s 472.704us 25 25 100.00
backpressure 10 10 100.00
aes_stress 43.000s 1510.851us 10 10 100.00
multi_message 88 95 92.63
aes_smoke 5.000s 254.410us 10 10 100.00
aes_config_error 12.000s 426.511us 49 50 98.00
aes_stress 43.000s 1510.851us 10 10 100.00
aes_alert_reset 3601.000s 0.000us 19 25 76.00
failure_test 78 85 91.76
aes_man_cfg_err 4.000s 142.100us 10 10 100.00
aes_config_error 12.000s 426.511us 49 50 98.00
aes_alert_reset 3601.000s 0.000us 19 25 76.00
trigger_clear_test 9 10 90.00
aes_clear 10.000s 2392.186us 9 10 90.00
nist_test_vectors 1 1 100.00
aes_nist_vectors 17.000s 1109.425us 1 1 100.00
nist_test_vectors_gcm 1 1 100.00
aes_nist_vectors_gcm 11.000s 212.608us 1 1 100.00
reset_recovery 19 25 76.00
aes_alert_reset 3601.000s 0.000us 19 25 76.00
stress 10 10 100.00
aes_stress 43.000s 1510.851us 10 10 100.00
sideload 20 20 100.00
aes_stress 43.000s 1510.851us 10 10 100.00
aes_sideload 7.000s 111.956us 10 10 100.00
deinitialization 10 10 100.00
aes_deinit 5.000s 361.284us 10 10 100.00
stress_all 4 10 40.00
aes_stress_all 10845.000s 0.000us 4 10 40.00
gcm_save_and_restore 100 100 100.00
aes_gcm_save_restore 41.000s 2037.707us 100 100 100.00
alert_test 10 10 100.00
aes_alert_test 7.000s 83.597us 10 10 100.00
tl_d_oob_addr_access 25 25 100.00
aes_tl_errors 6.000s 1238.361us 25 25 100.00
tl_d_illegal_access 25 25 100.00
aes_tl_errors 6.000s 1238.361us 25 25 100.00
tl_d_outstanding_access 12 12 100.00
aes_csr_hw_reset 1.000s 74.355us 1 1 100.00
aes_csr_rw 3.000s 264.803us 5 5 100.00
aes_csr_aliasing 4.000s 2813.919us 1 1 100.00
aes_same_csr_outstanding 3.000s 83.787us 5 5 100.00
tl_d_partial_access 12 12 100.00
aes_csr_hw_reset 1.000s 74.355us 1 1 100.00
aes_csr_rw 3.000s 264.803us 5 5 100.00
aes_csr_aliasing 4.000s 2813.919us 1 1 100.00
aes_same_csr_outstanding 3.000s 83.787us 5 5 100.00
Testpoint Test Max Runtime Sim Time Pass Total %
reseeding 5 10 50.00
aes_reseed 12.000s 232.473us 5 10 50.00
fault_inject 589 660 89.24
aes_fi 3601.000s 0.000us 0 10 0.00
aes_control_fi 61.000s 0.000us 276 300 92.00
aes_cipher_fi 61.000s 0.000us 313 350 89.43
shadow_reg_update_error 20 20 100.00
aes_shadow_reg_errors 3.000s 272.512us 20 20 100.00
shadow_reg_read_clear_staged_value 20 20 100.00
aes_shadow_reg_errors 3.000s 272.512us 20 20 100.00
shadow_reg_storage_error 20 20 100.00
aes_shadow_reg_errors 3.000s 272.512us 20 20 100.00
shadowed_reset_glitch 20 20 100.00
aes_shadow_reg_errors 3.000s 272.512us 20 20 100.00
shadow_reg_update_error_with_csr_rw 20 20 100.00
aes_shadow_reg_errors_with_csr_rw 5.000s 276.045us 20 20 100.00
tl_intg_err 30 30 100.00
aes_sec_cm 21.000s 2284.673us 5 5 100.00
aes_tl_intg_err 10.000s 609.289us 25 25 100.00
sec_cm_bus_integrity 25 25 100.00
aes_tl_intg_err 10.000s 609.289us 25 25 100.00
sec_cm_lc_escalate_en_intersig_mubi 19 25 76.00
aes_alert_reset 3601.000s 0.000us 19 25 76.00
sec_cm_main_config_shadow 20 20 100.00
aes_shadow_reg_errors 3.000s 272.512us 20 20 100.00
sec_cm_gcm_config_shadow 20 20 100.00
aes_shadow_reg_errors 3.000s 272.512us 20 20 100.00
sec_cm_main_config_sparse 132 145 91.03
aes_smoke 5.000s 254.410us 10 10 100.00
aes_stress 43.000s 1510.851us 10 10 100.00
aes_alert_reset 3601.000s 0.000us 19 25 76.00
aes_core_fi 3239.000s 200000.000us 93 100 93.00
sec_cm_gcm_config_sparse 252 260 96.92
aes_gcm_save_restore 41.000s 2037.707us 100 100 100.00
aes_config_error 12.000s 426.511us 49 50 98.00
aes_stress 43.000s 1510.851us 10 10 100.00
aes_core_fi 3239.000s 200000.000us 93 100 93.00
sec_cm_aux_config_shadow 20 20 100.00
aes_shadow_reg_errors 3.000s 272.512us 20 20 100.00
sec_cm_aux_config_regwen 20 20 100.00
aes_readability 3.000s 91.963us 10 10 100.00
aes_stress 43.000s 1510.851us 10 10 100.00
sec_cm_key_sideload 20 20 100.00
aes_stress 43.000s 1510.851us 10 10 100.00
aes_sideload 7.000s 111.956us 10 10 100.00
sec_cm_key_sw_unreadable 10 10 100.00
aes_readability 3.000s 91.963us 10 10 100.00
sec_cm_data_reg_sw_unreadable 10 10 100.00
aes_readability 3.000s 91.963us 10 10 100.00
sec_cm_key_sec_wipe 10 10 100.00
aes_readability 3.000s 91.963us 10 10 100.00
sec_cm_iv_config_sec_wipe 10 10 100.00
aes_readability 3.000s 91.963us 10 10 100.00
sec_cm_data_reg_sec_wipe 10 10 100.00
aes_readability 3.000s 91.963us 10 10 100.00
sec_cm_data_reg_key_sca 10 10 100.00
aes_stress 43.000s 1510.851us 10 10 100.00
sec_cm_key_masking 10 10 100.00
aes_stress 43.000s 1510.851us 10 10 100.00
sec_cm_main_fsm_sparse 0 10 0.00
aes_fi 3601.000s 0.000us 0 10 0.00
sec_cm_main_fsm_redun 614 685 89.64
aes_fi 3601.000s 0.000us 0 10 0.00
aes_control_fi 61.000s 0.000us 276 300 92.00
aes_cipher_fi 61.000s 0.000us 313 350 89.43
aes_ctr_fi 7.000s 540.556us 25 25 100.00
sec_cm_cipher_fsm_sparse 0 10 0.00
aes_fi 3601.000s 0.000us 0 10 0.00
sec_cm_cipher_fsm_redun 589 660 89.24
aes_fi 3601.000s 0.000us 0 10 0.00
aes_control_fi 61.000s 0.000us 276 300 92.00
aes_cipher_fi 61.000s 0.000us 313 350 89.43
sec_cm_cipher_ctr_redun 313 350 89.43
aes_cipher_fi 61.000s 0.000us 313 350 89.43
sec_cm_ctr_fsm_sparse 0 10 0.00
aes_fi 3601.000s 0.000us 0 10 0.00
sec_cm_ctr_fsm_redun 301 335 89.85
aes_fi 3601.000s 0.000us 0 10 0.00
aes_control_fi 61.000s 0.000us 276 300 92.00
aes_ctr_fi 7.000s 540.556us 25 25 100.00
sec_cm_ghash_fsm_sparse 0 10 0.00
aes_fi 3601.000s 0.000us 0 10 0.00
sec_cm_ctrl_sparse 614 685 89.64
aes_fi 3601.000s 0.000us 0 10 0.00
aes_control_fi 61.000s 0.000us 276 300 92.00
aes_cipher_fi 61.000s 0.000us 313 350 89.43
aes_ctr_fi 7.000s 540.556us 25 25 100.00
sec_cm_main_fsm_global_esc 19 25 76.00
aes_alert_reset 3601.000s 0.000us 19 25 76.00
sec_cm_main_fsm_local_esc 614 685 89.64
aes_fi 3601.000s 0.000us 0 10 0.00
aes_control_fi 61.000s 0.000us 276 300 92.00
aes_cipher_fi 61.000s 0.000us 313 350 89.43
aes_ctr_fi 7.000s 540.556us 25 25 100.00
sec_cm_cipher_fsm_local_esc 614 685 89.64
aes_fi 3601.000s 0.000us 0 10 0.00
aes_control_fi 61.000s 0.000us 276 300 92.00
aes_cipher_fi 61.000s 0.000us 313 350 89.43
aes_ctr_fi 7.000s 540.556us 25 25 100.00
sec_cm_ctr_fsm_local_esc 301 335 89.85
aes_fi 3601.000s 0.000us 0 10 0.00
aes_control_fi 61.000s 0.000us 276 300 92.00
aes_ctr_fi 7.000s 540.556us 25 25 100.00
sec_cm_ghash_fsm_local_esc 90 100 90.00
aes_ghash_fi 6.000s 201.403us 90 90 100.00
aes_fi 3601.000s 0.000us 0 10 0.00
sec_cm_data_reg_local_esc 589 660 89.24
aes_fi 3601.000s 0.000us 0 10 0.00
aes_control_fi 61.000s 0.000us 276 300 92.00
aes_cipher_fi 61.000s 0.000us 313 350 89.43
Testpoint Test Max Runtime Sim Time Pass Total %
stress_all_with_rand_reset 0 10 0.00
aes_stress_all_with_rand_reset 27.000s 854.392us 0 10 0.00

Error Messages

   Test seed line log context
Job timed out after * minutes 29 test runs
aes_fi 8688392423483142722750401593512249281522017183145674496187412243692998413352 None
aes_fi 4843518586992284692487444133282276037892327577668762786609075529354071482587 None
aes_control_fi 35899862923872334538555010428868861547873105723176141581033802809914848894667 None
aes_stress_all 103629186923546628345836898714384133500404048821501424477234231045601461368734 None
aes_stress_all 12255774083740410590310779499864846877479422686280505265396800508848655852946 None
aes_fi 66854445624692858750084187561972961167628574807858488000513437008519621288999 None
aes_cipher_fi 107935893806462424749674040967978357200149517385529965870672453489867586106108 None
aes_alert_reset 11704441209042050976532606505876999542340890784434805000966340118671736524649 None
aes_alert_reset 71127324468825464090036012921235700261553610206486287103346339194915661519931 None
aes_alert_reset 64056778632731235681942843271460187548814821607895132181212187922216819650386 None
aes_alert_reset 47155766191575636124322945116140407157901275512783904476339013944360603039945 None
aes_cipher_fi 22202550762371917315774477090675446724413646240617825772443037863884111251259 None
aes_control_fi 64185913590110351965385271046845662237423093635932763812865398948295468697941 None
aes_cipher_fi 73423911264592860493803832797085216547205221752327070393427728512956885234924 None
aes_control_fi 114178267189241214690151961990237036906272370135364109237145096703695259794719 None
aes_cipher_fi 42815920142119923123680705218065635511879251881559171242541085226698151627145 None
aes_cipher_fi 59674490189960142491193324507196700451499460402182889044515135061265637813167 None
aes_cipher_fi 48696986729638537057266765230228907288478162004462030763985121661535234715734 None
aes_cipher_fi 98215644424997611390341943202185612533126291785093492163073707552643958116214 None
aes_cipher_fi 112326237131387981672784161214764254153566020686673014949633706847345483160281 None
aes_control_fi 16208842016598829470120625568850626324571416670663599722747180299878489619934 None
aes_cipher_fi 27298052769721058841797950645695258789671951636486323339891458345157171967333 None
aes_control_fi 33190230415980898107985466213388562373041962583645042067202815536594680361044 None
aes_cipher_fi 51904046659583919154866782126192184419783851494194945206317412305170161417093 None
aes_control_fi 108017715302339410978710541651788466319209743056986512431327200303076758580651 None
aes_control_fi 109843858501661096058269173841734172608758933176794350639382390188307497629081 None
aes_control_fi 20565502299627063507440059522380412734978891124373782655564581075090442561813 None
aes_cipher_fi 6518798000179557266018669583478473684978779600307374390149844051221335163259 None
aes_cipher_fi 47659324071842434378278662906354259091976461466547963831225349422882213011217 None
UVM_FATAL (aes_cipher_fi_vseq.sv:62) [aes_cipher_fi_vseq] wait timeout occurred! 25 test runs
aes_cipher_fi 79441554470605854427041193688300309408966434929016208794109968475350397487901 148
UVM_INFO @ 10025335067 ps: (uvm_report_catcher.svh:705) [UVM/REPORT/CATCHER]
--- UVM Report catcher Summary ---
aes_cipher_fi 95818052752864746873045147808068787089770691790945895880903705639338156522213 144
UVM_INFO @ 10116385894 ps: (uvm_report_catcher.svh:705) [UVM/REPORT/CATCHER]
--- UVM Report catcher Summary ---
aes_cipher_fi 108579686135644948252840447241220795240196754466287584986259413833069940044156 155
UVM_INFO @ 10012429481 ps: (uvm_report_catcher.svh:705) [UVM/REPORT/CATCHER]
--- UVM Report catcher Summary ---
aes_cipher_fi 76968577663017674333974992859940802425582549495164403238862589207112167018527 141
UVM_INFO @ 10036105546 ps: (uvm_report_catcher.svh:705) [UVM/REPORT/CATCHER]
--- UVM Report catcher Summary ---
aes_cipher_fi 59596280463856197798466281353642997934090519908164801991860833790297140447737 154
UVM_INFO @ 10010711047 ps: (uvm_report_catcher.svh:705) [UVM/REPORT/CATCHER]
--- UVM Report catcher Summary ---
aes_cipher_fi 105378721106554776845088159733128900889319300860988040152807977053045327749143 154
UVM_INFO @ 10008610212 ps: (uvm_report_catcher.svh:705) [UVM/REPORT/CATCHER]
--- UVM Report catcher Summary ---
aes_cipher_fi 68650304850246405430803962736688207866834767411002254592286264640808487892250 152
UVM_INFO @ 10007964359 ps: (uvm_report_catcher.svh:705) [UVM/REPORT/CATCHER]
--- UVM Report catcher Summary ---
aes_cipher_fi 102171817044911180788658198136781628857217427110198076732591797865455020236162 155
UVM_INFO @ 10006153094 ps: (uvm_report_catcher.svh:705) [UVM/REPORT/CATCHER]
--- UVM Report catcher Summary ---
aes_cipher_fi 57819978956227993771592241858000785678596356719333815658885057729163050101205 158
UVM_INFO @ 10009640226 ps: (uvm_report_catcher.svh:705) [UVM/REPORT/CATCHER]
--- UVM Report catcher Summary ---
aes_cipher_fi 80026104433049570580278873374784292258107230593923595278786152458069733591678 152
UVM_INFO @ 10009540009 ps: (uvm_report_catcher.svh:705) [UVM/REPORT/CATCHER]
--- UVM Report catcher Summary ---
aes_cipher_fi 109710367283658561346174463540359965196542507613508315040035047964791720193260 147
UVM_INFO @ 10010923705 ps: (uvm_report_catcher.svh:705) [UVM/REPORT/CATCHER]
--- UVM Report catcher Summary ---
aes_cipher_fi 107265008787849152072951078990964648283926536713969071774006934259639968179172 157
UVM_INFO @ 10021101833 ps: (uvm_report_catcher.svh:705) [UVM/REPORT/CATCHER]
--- UVM Report catcher Summary ---
aes_cipher_fi 51290770495270364291633171292182237282328060185944663409612727677816816706166 147
UVM_INFO @ 10017774765 ps: (uvm_report_catcher.svh:705) [UVM/REPORT/CATCHER]
--- UVM Report catcher Summary ---
aes_cipher_fi 54862248193816940675126773364235804166709633033446666816227488122808729663981 153
UVM_INFO @ 10019900105 ps: (uvm_report_catcher.svh:705) [UVM/REPORT/CATCHER]
--- UVM Report catcher Summary ---
aes_cipher_fi 86150533752848415461983630750213941134455616334070310376631534672168142764347 153
UVM_INFO @ 10007220243 ps: (uvm_report_catcher.svh:705) [UVM/REPORT/CATCHER]
--- UVM Report catcher Summary ---
aes_cipher_fi 8352448912622219149138651083912832861436058667848172978122606105017108936593 161
UVM_INFO @ 10011754745 ps: (uvm_report_catcher.svh:705) [UVM/REPORT/CATCHER]
--- UVM Report catcher Summary ---
aes_cipher_fi 33614117796419349841495625008518482826576174830837334084323903185275481637350 151
UVM_INFO @ 10024395363 ps: (uvm_report_catcher.svh:705) [UVM/REPORT/CATCHER]
--- UVM Report catcher Summary ---
aes_cipher_fi 42374193292972484696884696254658668145262397174455929644930262514062923657176 153
UVM_INFO @ 10020577134 ps: (uvm_report_catcher.svh:705) [UVM/REPORT/CATCHER]
--- UVM Report catcher Summary ---
aes_cipher_fi 69480546390757425669393051694439943388399793170812235918133588572263875683014 150
UVM_INFO @ 10028576877 ps: (uvm_report_catcher.svh:705) [UVM/REPORT/CATCHER]
--- UVM Report catcher Summary ---
aes_cipher_fi 112036703639465674289636901286831310089031606329987906682640444519827129439680 144
UVM_INFO @ 10004938116 ps: (uvm_report_catcher.svh:705) [UVM/REPORT/CATCHER]
--- UVM Report catcher Summary ---
aes_cipher_fi 77816222620358130349590518263994195317564990371482042599643121505032472871531 146
UVM_INFO @ 10011510560 ps: (uvm_report_catcher.svh:705) [UVM/REPORT/CATCHER]
--- UVM Report catcher Summary ---
aes_cipher_fi 33610832672497639077560469090464270202604090082931706274523647591353033268303 152
UVM_INFO @ 10014837453 ps: (uvm_report_catcher.svh:705) [UVM/REPORT/CATCHER]
--- UVM Report catcher Summary ---
aes_cipher_fi 74874208747158106400327986408143388141489886815686015827757318719193803569796 155
UVM_INFO @ 10048931055 ps: (uvm_report_catcher.svh:705) [UVM/REPORT/CATCHER]
--- UVM Report catcher Summary ---
aes_cipher_fi 33446968962302177561448969405614653017457437295180321943354027972593998301073 147
UVM_INFO @ 10022304938 ps: (uvm_report_catcher.svh:705) [UVM/REPORT/CATCHER]
--- UVM Report catcher Summary ---
aes_cipher_fi 110356809692070616023013855879802607467263153169055635253564553549476754899310 152
UVM_INFO @ 10060954650 ps: (uvm_report_catcher.svh:705) [UVM/REPORT/CATCHER]
--- UVM Report catcher Summary ---
UVM_FATAL (aes_control_fi_vseq.sv:62) [aes_control_fi_vseq] wait timeout occurred! 16 test runs
aes_control_fi 52586994230786215479918401869616477154686385153271984248454273516220534855383 146
UVM_INFO @ 10051932270 ps: (uvm_report_catcher.svh:705) [UVM/REPORT/CATCHER]
--- UVM Report catcher Summary ---
aes_control_fi 87192550502855762899137576296529315241651398736142316781317772054387392724355 149
UVM_INFO @ 10019695269 ps: (uvm_report_catcher.svh:705) [UVM/REPORT/CATCHER]
--- UVM Report catcher Summary ---
aes_control_fi 37662844738566978627810890449869655504566562717465620478387126816484283121655 142
UVM_INFO @ 10010255453 ps: (uvm_report_catcher.svh:705) [UVM/REPORT/CATCHER]
--- UVM Report catcher Summary ---
aes_control_fi 3424539691210710552405132100068572856115729526444488960246959101683020115048 158
UVM_INFO @ 10018501408 ps: (uvm_report_catcher.svh:705) [UVM/REPORT/CATCHER]
--- UVM Report catcher Summary ---
aes_control_fi 62698021912004023920995391328380253143508247575308232012316915955135153830447 143
UVM_INFO @ 10066267808 ps: (uvm_report_catcher.svh:705) [UVM/REPORT/CATCHER]
--- UVM Report catcher Summary ---
aes_control_fi 73409338582736369811716366308360425041543551264569257631786778078318442923148 150
UVM_INFO @ 10124140475 ps: (uvm_report_catcher.svh:705) [UVM/REPORT/CATCHER]
--- UVM Report catcher Summary ---
aes_control_fi 20169872728250191619310388701492360463195866412950406656158896171937941709226 148
UVM_INFO @ 10016952763 ps: (uvm_report_catcher.svh:705) [UVM/REPORT/CATCHER]
--- UVM Report catcher Summary ---
aes_control_fi 13622288743473272481906622748240639909101732194743559042501214739972624495617 156
UVM_INFO @ 10012564911 ps: (uvm_report_catcher.svh:705) [UVM/REPORT/CATCHER]
--- UVM Report catcher Summary ---
aes_control_fi 65285214371817121014869065092857037677661101967315163090438656216074717960361 155
UVM_INFO @ 10019415132 ps: (uvm_report_catcher.svh:705) [UVM/REPORT/CATCHER]
--- UVM Report catcher Summary ---
aes_control_fi 81994015996850290191517797393840758321434838910888623744409026776759084181508 154
UVM_INFO @ 10036360439 ps: (uvm_report_catcher.svh:705) [UVM/REPORT/CATCHER]
--- UVM Report catcher Summary ---
aes_control_fi 93225770774807571235651796585886852747941600088941086034323111306739567176916 152
UVM_INFO @ 10014763434 ps: (uvm_report_catcher.svh:705) [UVM/REPORT/CATCHER]
--- UVM Report catcher Summary ---
aes_control_fi 78499205066122949541963948813152267821073169118052860429342486966791098591344 144
UVM_INFO @ 10016815059 ps: (uvm_report_catcher.svh:705) [UVM/REPORT/CATCHER]
--- UVM Report catcher Summary ---
aes_control_fi 35471448518498092568176261462610121317087695335875733089750988989989422279833 147
UVM_INFO @ 10012787731 ps: (uvm_report_catcher.svh:705) [UVM/REPORT/CATCHER]
--- UVM Report catcher Summary ---
aes_control_fi 18802044112580915601165686052663724989611356401556329842242850610133893498890 151
UVM_INFO @ 10015097068 ps: (uvm_report_catcher.svh:705) [UVM/REPORT/CATCHER]
--- UVM Report catcher Summary ---
aes_control_fi 51671821732988685574475029221929963589880281341442904185902878723281433577442 150
UVM_INFO @ 10077108927 ps: (uvm_report_catcher.svh:705) [UVM/REPORT/CATCHER]
--- UVM Report catcher Summary ---
aes_control_fi 28969350241125461237647312187720017491584691722617863721160208814054811741599 156
UVM_INFO @ 10010419395 ps: (uvm_report_catcher.svh:705) [UVM/REPORT/CATCHER]
--- UVM Report catcher Summary ---
UVM_ERROR (uvm_sequencer_base.svh:757) sequencer [SEQREQZMB] The task responsible for requesting a wait_for_grant on sequencer 'sequencer' for sequence 'parent_sequence' has been killed, to avoid a deadlock the sequence will be removed from the arbitration queues 13 test runs
aes_reseed 17334306228274924787318244201457921602511465393795613244275416470575624716350 7631
UVM_INFO @ 346982845 ps: (uvm_report_catcher.svh:705) [UVM/REPORT/CATCHER]
--- UVM Report catcher Summary ---
aes_stress_all 76934694440685887249831093743309481571547369569164936032853339523730113066302 14569
UVM_INFO @ 693848942 ps: (uvm_report_catcher.svh:705) [UVM/REPORT/CATCHER]
--- UVM Report catcher Summary ---
aes_stress_all_with_rand_reset 43163220647725401868097906733481180184237920053086212291054240503716910884108 248
UVM_INFO @ 83294548 ps: (uvm_report_catcher.svh:705) [UVM/REPORT/CATCHER]
--- UVM Report catcher Summary ---
aes_stress_all 9115633776669752221246051942743014443107909352008074231152080854869615233759 9615
UVM_INFO @ 775051367 ps: (uvm_report_catcher.svh:705) [UVM/REPORT/CATCHER]
--- UVM Report catcher Summary ---
aes_stress_all_with_rand_reset 76691772872778295043979234938278995275048982212451514098774203860737290051274 159
UVM_INFO @ 53792305 ps: (uvm_report_catcher.svh:705) [UVM/REPORT/CATCHER]
--- UVM Report catcher Summary ---
aes_reseed 35294778677904484171216799033404103325143549740667995552570314070353316543463 4417
UVM_INFO @ 93024939 ps: (uvm_report_catcher.svh:705) [UVM/REPORT/CATCHER]
--- UVM Report catcher Summary ---
aes_reseed 88723804946776650193757654071635296775655734733387445755161278929967014002588 9308
UVM_INFO @ 73159005 ps: (uvm_report_catcher.svh:705) [UVM/REPORT/CATCHER]
--- UVM Report catcher Summary ---
aes_stress_all 99505678510189331522494697546126306550764708493569081171528123893347126183008 147501
UVM_INFO @ 2151792902 ps: (uvm_report_catcher.svh:705) [UVM/REPORT/CATCHER]
--- UVM Report catcher Summary ---
aes_stress_all_with_rand_reset 24769886238188632231127439016731781079689443332195036368298494522430671458063 524
UVM_INFO @ 2605415075 ps: (uvm_report_catcher.svh:705) [UVM/REPORT/CATCHER]
--- UVM Report catcher Summary ---
aes_reseed 97636494329281095376161905446328935778349390025276703850499317146024384645103 1973
UVM_INFO @ 32663384 ps: (uvm_report_catcher.svh:705) [UVM/REPORT/CATCHER]
--- UVM Report catcher Summary ---
aes_stress_all_with_rand_reset 48723974837761903593748524068923290152070465869230684971695449941834102316965 704
UVM_INFO @ 4618906310 ps: (uvm_report_catcher.svh:705) [UVM/REPORT/CATCHER]
--- UVM Report catcher Summary ---
aes_reseed 73155981423328367106208867534741824744754970807667376465761205370371691231449 36581
UVM_INFO @ 232473149 ps: (uvm_report_catcher.svh:705) [UVM/REPORT/CATCHER]
--- UVM Report catcher Summary ---
aes_stress_all_with_rand_reset 53054720157207050539310227701329418882433337644590196917083583286763837545980 184
UVM_INFO @ 489627914 ps: (uvm_report_catcher.svh:705) [UVM/REPORT/CATCHER]
--- UVM Report catcher Summary ---
UVM_FATAL (uvm_phase.svh:1521) [PH_TIMEOUT] Explicit timeout of * ps hit, indicating a probable testbench issue 5 test runs
aes_fi 10060488686244313165839793997630434832473087408982764191383762826582276712206 8183054
UVM_INFO @ 200000000000 ps: (uvm_report_catcher.svh:705) [UVM/REPORT/CATCHER]
--- UVM Report catcher Summary ---
aes_fi 106565882100664369359431000048040166078166007713677568865502744159987263791212 16665305
UVM_INFO @ 200000000000 ps: (uvm_report_catcher.svh:705) [UVM/REPORT/CATCHER]
--- UVM Report catcher Summary ---
aes_alert_reset 33078028873267248095734843045000889316426884369957983022771752207305241814043 1334016
UVM_INFO @ 200000000000 ps: (uvm_report_catcher.svh:705) [UVM/REPORT/CATCHER]
--- UVM Report catcher Summary ---
aes_core_fi 19461532195520304563145887372025781078883405740791003425596670414737211644892 147
UVM_INFO @ 200000000000 ps: (uvm_report_catcher.svh:705) [UVM/REPORT/CATCHER]
--- UVM Report catcher Summary ---
aes_core_fi 16257606591093823412221767080739608727728881549920988627375409992093272537382 146
UVM_INFO @ 200000000000 ps: (uvm_report_catcher.svh:705) [UVM/REPORT/CATCHER]
--- UVM Report catcher Summary ---
UVM_FATAL (aes_scoreboard.sv:923) scoreboard [scoreboard] 5 test runs
aes_fi 45373418309592139457278849462411043405822754885123969446979719950576762478654 8814
----| NO FAILURES BUT NUMBER OF EXPECTED MESSAGES DOES NOT MATCH ACTUAL
----| Expected: 3
----| Seen: 1
----| Expected corrupted: 0
aes_fi 55832687979062387208660689962137573911858155583891642610125173630833891253377 21849
----| NO FAILURES BUT NUMBER OF EXPECTED MESSAGES DOES NOT MATCH ACTUAL
----| Expected: 6
----| Seen: 5
----| Expected corrupted: 0
aes_fi 66991504107611478549706492505765940777941929549908042327980075735366497723775 15188
----| NO FAILURES BUT NUMBER OF EXPECTED MESSAGES DOES NOT MATCH ACTUAL
----| Expected: 4
----| Seen: 3
----| Expected corrupted: 0
aes_fi 54103635237006722999480608665097844106600447120437101058473866378990359442459 10810
----| NO FAILURES BUT NUMBER OF EXPECTED MESSAGES DOES NOT MATCH ACTUAL
----| Expected: 4
----| Seen: 3
----| Expected corrupted: 0
aes_fi 30656627115969094937161802379750858538939203632800648011522536829839113770217 6219
----| NO FAILURES BUT NUMBER OF EXPECTED MESSAGES DOES NOT MATCH ACTUAL
----| Expected: 4
----| Seen: 3
----| Expected corrupted: 0
UVM_FATAL (aes_core_fi_vseq.sv:70) [aes_core_fi_vseq] wait timeout occurred! 5 test runs
aes_core_fi 52875063816408288925638813119155880655283994962666570362112866667015386417149 144
UVM_INFO @ 10012425813 ps: (uvm_report_catcher.svh:705) [UVM/REPORT/CATCHER]
--- UVM Report catcher Summary ---
aes_core_fi 64331904276403977350369185446225380416524948323707208721179095989120591334908 154
UVM_INFO @ 10020463235 ps: (uvm_report_catcher.svh:705) [UVM/REPORT/CATCHER]
--- UVM Report catcher Summary ---
aes_core_fi 82418491611011433922102949808856465370793950116850895216465279246929616732950 147
UVM_INFO @ 10026772459 ps: (uvm_report_catcher.svh:705) [UVM/REPORT/CATCHER]
--- UVM Report catcher Summary ---
aes_core_fi 24339772512720157416754036913513091205076246490062375194582531813808979226879 149
UVM_INFO @ 10016454479 ps: (uvm_report_catcher.svh:705) [UVM/REPORT/CATCHER]
--- UVM Report catcher Summary ---
aes_core_fi 103074612179420016624925267378952964047247789983950411749254113228519026197776 151
UVM_INFO @ 10062522444 ps: (uvm_report_catcher.svh:705) [UVM/REPORT/CATCHER]
--- UVM Report catcher Summary ---
UVM_FATAL (aes_scoreboard.sv:782) scoreboard [scoreboard] # * 2 test runs
aes_clear 78992543818771315435260117163478086332491109035671163503796021833128897806258 1138
TEST FAILED MESSAGES DID NOT MATCH
0 af e0 17 0
1 00 29 d9 0
aes_stress_all 8458962930966922364043021939905554456254256212451322778176560704602206440513 20305
TEST FAILED MESSAGES DID NOT MATCH
0 6b 4e 4e 0
1 00 b8 b8 0
UVM_FATAL (aes_base_vseq.sv:322) virtual_sequencer [aes_reseed_vseq] Expected GCM phase GCM_TEXT, got GCM_TAG 1 test run
aes_stress_all_with_rand_reset 23222062968123858971381025998435383608242026901590710829659659450589397920203 799
UVM_INFO @ 854392096 ps: (uvm_report_catcher.svh:705) [UVM/REPORT/CATCHER]
--- UVM Report catcher Summary ---
UVM_FATAL (aes_base_vseq.sv:322) virtual_sequencer [aes_reseed_vseq] Expected GCM phase GCM_AAD, got GCM_TEXT 1 test run
aes_stress_all_with_rand_reset 89727753912675671083669875677928317387810533145147841946441413743842082919123 298
UVM_INFO @ 133194823 ps: (uvm_report_catcher.svh:705) [UVM/REPORT/CATCHER]
--- UVM Report catcher Summary ---
UVM_FATAL (aes_base_vseq.sv:87) [aes_stress_all_vseq] Check failed (aes_ctrl_aux[*] == cfg.do_reseed) 1 test run
aes_stress_all_with_rand_reset 82836137212869883744466340147155509660792390124297908574070947382878257622668 112
UVM_INFO @ 12204882 ps: (uvm_report_catcher.svh:705) [UVM/REPORT/CATCHER]
--- UVM Report catcher Summary ---
UVM_FATAL (cip_base_vseq.sv:1230) [aes_common_vseq] Check failed (vseq_done) 1 test run
aes_stress_all_with_rand_reset 43123593902050175324631481481741737372186314626819687291028937836704533622668 310
UVM_INFO @ 368378333 ps: (uvm_report_catcher.svh:705) [UVM/REPORT/CATCHER]
--- UVM Report catcher Summary ---
UVM_ERROR (cip_base_scoreboard.sv:255) scoreboard [scoreboard] alert fatal_fault has unexpected timeout error 1 test run
aes_alert_reset 5320961252749616362507353214605661520440230141715375116004658303349972918337 73313
UVM_INFO @ 895149456 ps: (uvm_report_catcher.svh:705) [UVM/REPORT/CATCHER]
--- UVM Report catcher Summary ---
UVM_ERROR (uvm_sequencer_base.svh:757) sequencer [SEQREQZMB] The task responsible for requesting a wait_for_grant on sequencer 'sequencer' for sequence 'sideload_seq' has been killed, to avoid a deadlock the sequence will be removed from the arbitration queues 1 test run
aes_stress_all_with_rand_reset 94029848978877801432835089371985656203318858289650522634862568089699036214583 590
UVM_INFO @ 716227066 ps: (uvm_report_catcher.svh:705) [UVM/REPORT/CATCHER]
--- UVM Report catcher Summary ---
xmsim: *E,MEMALC: Memory not allocated for actual argument 'input_msg', passed to DPI task/function 'c_dpi_aes_crypt_message' call at line '*' in file '/nightly/current_run/scratch/master/aes_gcm_masked-sim-xcelium/default/fusesoc-work/src/lowrisc_dv_aes_env_*/aes_scoreboard.sv' at time * PS + *. 1 test run
aes_config_error 53494835856427597690915007928932311906561379048301062441538747731961222707505 5162
xmsim: *E,MEMALC: Memory not allocated for actual argument 'input_msg', passed to DPI task/function 'c_dpi_aes_crypt_message' call at line '745' in file '/nightly/current_run/scratch/master/aes_gcm_masked-sim-xcelium/default/fusesoc-work/src/lowrisc_dv_aes_env_0.1/aes_scoreboard.sv' at time 23461561 PS + 10.
xmsim: *E,MEMALC: Memory not allocated for actual argument 'input_msg', passed to DPI task/function 'c_dpi_aes_crypt_message' call at line '745' in file '/nightly/current_run/scratch/master/aes_gcm_masked-sim-xcelium/default/fusesoc-work/src/lowrisc_dv_aes_env_0.1/aes_scoreboard.sv' at time 23461561 PS + 10.
ERROR: Decryption finalizing failed
xmsim: *E,MEMALC: Memory not allocated for actual argument 'predicted_msg', passed to DPI task/function 'c_dpi_aes_crypt_message' call at line '745' in file '/nightly/current_run/scratch/master/aes_gcm_masked-sim-xcelium/default/fusesoc-work/src/lowrisc_dv_aes_env_0.1/aes_scoreboard.sv' at time 23461561 PS + 10.