Simulation Results: aes/gcm_masked

 
21/08/2026 15:00:36 DVSim: v1.49.0 sha: ffb3622 json Branch: master Tool: xcelium [unknown]
Coverage statistics
  • Total
  • 97.08 %
  • code
  • 98.02 %
  • assert
  • 98.57 %
  • func
  • 94.65 %
  • block
  • 98.05 %
  • line
  • 99.06 %
  • branch
  • 94.96 %
  • toggle
  • 98.05 %
  • FSM
  • 100.00 %
Validation stages
V1
100.00%
V2
96.55%
V2S
93.68%
V3
0.00%
Testpoint Test Max Runtime Sim Time Pass Total %
wake_up 1 1 100.00
aes_wake_up 3.000s 102.736us 1 1 100.00
smoke 10 10 100.00
aes_smoke 5.000s 330.143us 10 10 100.00
csr_hw_reset 1 1 100.00
aes_csr_hw_reset 2.000s 58.770us 1 1 100.00
csr_rw 5 5 100.00
aes_csr_rw 2.000s 109.853us 5 5 100.00
csr_bit_bash 1 1 100.00
aes_csr_bit_bash 6.000s 698.205us 1 1 100.00
csr_aliasing 1 1 100.00
aes_csr_aliasing 2.000s 68.411us 1 1 100.00
csr_mem_rw_with_rand_reset 5 5 100.00
aes_csr_mem_rw_with_rand_reset 2.000s 52.500us 5 5 100.00
regwen_csr_and_corresponding_lockable_csr 6 6 100.00
aes_csr_rw 2.000s 109.853us 5 5 100.00
aes_csr_aliasing 2.000s 68.411us 1 1 100.00
Testpoint Test Max Runtime Sim Time Pass Total %
algorithm 70 70 100.00
aes_smoke 5.000s 330.143us 10 10 100.00
aes_config_error 64.000s 2561.782us 50 50 100.00
aes_stress 8.000s 244.571us 10 10 100.00
key_length 70 70 100.00
aes_smoke 5.000s 330.143us 10 10 100.00
aes_config_error 64.000s 2561.782us 50 50 100.00
aes_stress 8.000s 244.571us 10 10 100.00
back2back 35 35 100.00
aes_stress 8.000s 244.571us 10 10 100.00
aes_b2b 22.000s 1066.665us 25 25 100.00
backpressure 10 10 100.00
aes_stress 8.000s 244.571us 10 10 100.00
multi_message 92 95 96.84
aes_smoke 5.000s 330.143us 10 10 100.00
aes_config_error 64.000s 2561.782us 50 50 100.00
aes_stress 8.000s 244.571us 10 10 100.00
aes_alert_reset 3601.000s 0.000us 22 25 88.00
failure_test 82 85 96.47
aes_man_cfg_err 4.000s 69.295us 10 10 100.00
aes_config_error 64.000s 2561.782us 50 50 100.00
aes_alert_reset 3601.000s 0.000us 22 25 88.00
trigger_clear_test 9 10 90.00
aes_clear 10.000s 372.492us 9 10 90.00
nist_test_vectors 1 1 100.00
aes_nist_vectors 22.000s 2621.096us 1 1 100.00
nist_test_vectors_gcm 1 1 100.00
aes_nist_vectors_gcm 10.000s 756.457us 1 1 100.00
reset_recovery 22 25 88.00
aes_alert_reset 3601.000s 0.000us 22 25 88.00
stress 10 10 100.00
aes_stress 8.000s 244.571us 10 10 100.00
sideload 20 20 100.00
aes_stress 8.000s 244.571us 10 10 100.00
aes_sideload 8.000s 312.189us 10 10 100.00
deinitialization 10 10 100.00
aes_deinit 4.000s 198.016us 10 10 100.00
stress_all 3 10 30.00
aes_stress_all 10802.176s 0.000us 3 10 30.00
gcm_save_and_restore 100 100 100.00
aes_gcm_save_restore 9.000s 775.760us 100 100 100.00
alert_test 10 10 100.00
aes_alert_test 3.000s 98.314us 10 10 100.00
tl_d_oob_addr_access 25 25 100.00
aes_tl_errors 5.000s 621.097us 25 25 100.00
tl_d_illegal_access 25 25 100.00
aes_tl_errors 5.000s 621.097us 25 25 100.00
tl_d_outstanding_access 12 12 100.00
aes_csr_hw_reset 2.000s 58.770us 1 1 100.00
aes_csr_rw 2.000s 109.853us 5 5 100.00
aes_csr_aliasing 2.000s 68.411us 1 1 100.00
aes_same_csr_outstanding 3.000s 90.663us 5 5 100.00
tl_d_partial_access 12 12 100.00
aes_csr_hw_reset 2.000s 58.770us 1 1 100.00
aes_csr_rw 2.000s 109.853us 5 5 100.00
aes_csr_aliasing 2.000s 68.411us 1 1 100.00
aes_same_csr_outstanding 3.000s 90.663us 5 5 100.00
Testpoint Test Max Runtime Sim Time Pass Total %
reseeding 5 10 50.00
aes_reseed 26.000s 1313.446us 5 10 50.00
fault_inject 603 660 91.36
aes_fi 3602.066s 0.000us 0 10 0.00
aes_control_fi 61.000s 0.000us 277 300 92.33
aes_cipher_fi 61.000s 0.000us 326 350 93.14
shadow_reg_update_error 20 20 100.00
aes_shadow_reg_errors 4.000s 1162.984us 20 20 100.00
shadow_reg_read_clear_staged_value 20 20 100.00
aes_shadow_reg_errors 4.000s 1162.984us 20 20 100.00
shadow_reg_storage_error 20 20 100.00
aes_shadow_reg_errors 4.000s 1162.984us 20 20 100.00
shadowed_reset_glitch 20 20 100.00
aes_shadow_reg_errors 4.000s 1162.984us 20 20 100.00
shadow_reg_update_error_with_csr_rw 20 20 100.00
aes_shadow_reg_errors_with_csr_rw 5.000s 827.587us 20 20 100.00
tl_intg_err 30 30 100.00
aes_sec_cm 21.000s 2414.176us 5 5 100.00
aes_tl_intg_err 4.000s 286.987us 25 25 100.00
sec_cm_bus_integrity 25 25 100.00
aes_tl_intg_err 4.000s 286.987us 25 25 100.00
sec_cm_lc_escalate_en_intersig_mubi 22 25 88.00
aes_alert_reset 3601.000s 0.000us 22 25 88.00
sec_cm_main_config_shadow 20 20 100.00
aes_shadow_reg_errors 4.000s 1162.984us 20 20 100.00
sec_cm_gcm_config_shadow 20 20 100.00
aes_shadow_reg_errors 4.000s 1162.984us 20 20 100.00
sec_cm_main_config_sparse 133 145 91.72
aes_smoke 5.000s 330.143us 10 10 100.00
aes_stress 8.000s 244.571us 10 10 100.00
aes_alert_reset 3601.000s 0.000us 22 25 88.00
aes_core_fi 83.000s 10080.941us 91 100 91.00
sec_cm_gcm_config_sparse 251 260 96.54
aes_gcm_save_restore 9.000s 775.760us 100 100 100.00
aes_config_error 64.000s 2561.782us 50 50 100.00
aes_stress 8.000s 244.571us 10 10 100.00
aes_core_fi 83.000s 10080.941us 91 100 91.00
sec_cm_aux_config_shadow 20 20 100.00
aes_shadow_reg_errors 4.000s 1162.984us 20 20 100.00
sec_cm_aux_config_regwen 20 20 100.00
aes_readability 3.000s 52.992us 10 10 100.00
aes_stress 8.000s 244.571us 10 10 100.00
sec_cm_key_sideload 20 20 100.00
aes_stress 8.000s 244.571us 10 10 100.00
aes_sideload 8.000s 312.189us 10 10 100.00
sec_cm_key_sw_unreadable 10 10 100.00
aes_readability 3.000s 52.992us 10 10 100.00
sec_cm_data_reg_sw_unreadable 10 10 100.00
aes_readability 3.000s 52.992us 10 10 100.00
sec_cm_key_sec_wipe 10 10 100.00
aes_readability 3.000s 52.992us 10 10 100.00
sec_cm_iv_config_sec_wipe 10 10 100.00
aes_readability 3.000s 52.992us 10 10 100.00
sec_cm_data_reg_sec_wipe 10 10 100.00
aes_readability 3.000s 52.992us 10 10 100.00
sec_cm_data_reg_key_sca 10 10 100.00
aes_stress 8.000s 244.571us 10 10 100.00
sec_cm_key_masking 10 10 100.00
aes_stress 8.000s 244.571us 10 10 100.00
sec_cm_main_fsm_sparse 0 10 0.00
aes_fi 3602.066s 0.000us 0 10 0.00
sec_cm_main_fsm_redun 628 685 91.68
aes_fi 3602.066s 0.000us 0 10 0.00
aes_control_fi 61.000s 0.000us 277 300 92.33
aes_cipher_fi 61.000s 0.000us 326 350 93.14
aes_ctr_fi 6.000s 126.461us 25 25 100.00
sec_cm_cipher_fsm_sparse 0 10 0.00
aes_fi 3602.066s 0.000us 0 10 0.00
sec_cm_cipher_fsm_redun 603 660 91.36
aes_fi 3602.066s 0.000us 0 10 0.00
aes_control_fi 61.000s 0.000us 277 300 92.33
aes_cipher_fi 61.000s 0.000us 326 350 93.14
sec_cm_cipher_ctr_redun 326 350 93.14
aes_cipher_fi 61.000s 0.000us 326 350 93.14
sec_cm_ctr_fsm_sparse 0 10 0.00
aes_fi 3602.066s 0.000us 0 10 0.00
sec_cm_ctr_fsm_redun 302 335 90.15
aes_fi 3602.066s 0.000us 0 10 0.00
aes_control_fi 61.000s 0.000us 277 300 92.33
aes_ctr_fi 6.000s 126.461us 25 25 100.00
sec_cm_ghash_fsm_sparse 0 10 0.00
aes_fi 3602.066s 0.000us 0 10 0.00
sec_cm_ctrl_sparse 628 685 91.68
aes_fi 3602.066s 0.000us 0 10 0.00
aes_control_fi 61.000s 0.000us 277 300 92.33
aes_cipher_fi 61.000s 0.000us 326 350 93.14
aes_ctr_fi 6.000s 126.461us 25 25 100.00
sec_cm_main_fsm_global_esc 22 25 88.00
aes_alert_reset 3601.000s 0.000us 22 25 88.00
sec_cm_main_fsm_local_esc 628 685 91.68
aes_fi 3602.066s 0.000us 0 10 0.00
aes_control_fi 61.000s 0.000us 277 300 92.33
aes_cipher_fi 61.000s 0.000us 326 350 93.14
aes_ctr_fi 6.000s 126.461us 25 25 100.00
sec_cm_cipher_fsm_local_esc 628 685 91.68
aes_fi 3602.066s 0.000us 0 10 0.00
aes_control_fi 61.000s 0.000us 277 300 92.33
aes_cipher_fi 61.000s 0.000us 326 350 93.14
aes_ctr_fi 6.000s 126.461us 25 25 100.00
sec_cm_ctr_fsm_local_esc 302 335 90.15
aes_fi 3602.066s 0.000us 0 10 0.00
aes_control_fi 61.000s 0.000us 277 300 92.33
aes_ctr_fi 6.000s 126.461us 25 25 100.00
sec_cm_ghash_fsm_local_esc 90 100 90.00
aes_ghash_fi 7.000s 380.831us 90 90 100.00
aes_fi 3602.066s 0.000us 0 10 0.00
sec_cm_data_reg_local_esc 603 660 91.36
aes_fi 3602.066s 0.000us 0 10 0.00
aes_control_fi 61.000s 0.000us 277 300 92.33
aes_cipher_fi 61.000s 0.000us 326 350 93.14
Testpoint Test Max Runtime Sim Time Pass Total %
stress_all_with_rand_reset 0 10 0.00
aes_stress_all_with_rand_reset 74.000s 15321.553us 0 10 0.00

Error Messages

   Test seed line log context
Job timed out after * minutes 27 test runs
aes_fi 101143430056045216462108900932261131390961055320474368537369703531030761986362 None
aes_alert_reset 51971179382141223912880884156154078126229144042549590226968237354974631096748 None
aes_stress_all 28862266859205244238288599658506465214256939923245510422578052046258285172570 None
aes_control_fi 40617068936561100708825889726278166981510556761207494487483606084015721002277 None
aes_cipher_fi 83025772687843717127964910309752712036068756598532936942280690011966795899351 None
aes_cipher_fi 10259103864581810170857258325238756063901263284298228877101962021971672884958 None
aes_control_fi 90931668932371151955075056499615577502420661659166193554200040509454705210376 None
aes_cipher_fi 113015361159661371659655190941941813906096614068941020942608103609795511367380 None
aes_cipher_fi 22895152321563118100452893966638566661383376204312771799950843397451395278786 None
aes_control_fi 33050336677543320528919398698398276964358998916313325786586930547351679116625 None
aes_control_fi 11641173328704196947112847397708091349307858805835516188361966465479148573034 None
aes_control_fi 56900377331642735386005635691597323054184162580684570332173271202583956891386 None
aes_control_fi 105849686523852183226178841885253904324316778140948710736427473556982028707846 None
aes_cipher_fi 70611175706785898260838528227220755683572112095788308775804223032990808293892 None
aes_control_fi 97257244118867608323262207865406970557213825667190752571368868615217441884356 None
aes_cipher_fi 41847601789245986619882429514350840676194916729182406662680577112243846392874 None
aes_cipher_fi 85665276032802627222499904751322319907285088521220811282208906394591273262348 None
aes_cipher_fi 72633783503549964560723771271385656999221146851260909723576799982818989878804 None
aes_control_fi 52597801265255150785468510524010177095348906600316533090502543544097484411961 None
aes_cipher_fi 18371630150493505012275511354326425600989142470994112161660850410539953787045 None
aes_cipher_fi 60780660107717075212396379712713883170927377942525792024108452759216840925824 None
aes_control_fi 65835258956634750140151830366489535899935349298187990622472242957163545787497 None
aes_control_fi 13713646756257763391458138313584384128279260951182283670914876565333971931215 None
aes_control_fi 51782462705926213958469035479358044690282212198519540560382029142505388457626 None
aes_control_fi 89980199725873612864614066971576827026314590798879186888018832846734851264245 None
aes_cipher_fi 85461936071184838407878589129185064593487792514747994599237666489644169496420 None
aes_cipher_fi 37855663695485240659658364037656618517077777262288134390148259802426720368558 None
UVM_ERROR (uvm_sequencer_base.svh:757) sequencer [SEQREQZMB] The task responsible for requesting a wait_for_grant on sequencer 'sequencer' for sequence 'parent_sequence' has been killed, to avoid a deadlock the sequence will be removed from the arbitration queues 13 test runs
aes_reseed 31349210186594314674600279744553812354702279352687647347628755535444094464201 15233
UVM_INFO @ 240037451 ps: (uvm_report_catcher.svh:705) [UVM/REPORT/CATCHER]
--- UVM Report catcher Summary ---
aes_reseed 27103849877372331714787589002095281606766148985079655692551072300289664337547 10165
UVM_INFO @ 66269070 ps: (uvm_report_catcher.svh:705) [UVM/REPORT/CATCHER]
--- UVM Report catcher Summary ---
aes_stress_all 62646429778743827093746193656229880689089043262382736397558862150228596812423 2357
UVM_INFO @ 192355995 ps: (uvm_report_catcher.svh:705) [UVM/REPORT/CATCHER]
--- UVM Report catcher Summary ---
aes_reseed 8901883023053879918809117488108751178704712446958183584686914873386570807006 3698
UVM_INFO @ 124132146 ps: (uvm_report_catcher.svh:705) [UVM/REPORT/CATCHER]
--- UVM Report catcher Summary ---
aes_stress_all 72682264012702173148412137165533004835924254361343233043833418796816767110700 106978
UVM_INFO @ 444139486 ps: (uvm_report_catcher.svh:705) [UVM/REPORT/CATCHER]
--- UVM Report catcher Summary ---
aes_stress_all_with_rand_reset 47786448730702139570515663043228559886227949850803475301063506554351649959388 569
UVM_INFO @ 2849464027 ps: (uvm_report_catcher.svh:705) [UVM/REPORT/CATCHER]
--- UVM Report catcher Summary ---
aes_stress_all 112646981922433744060692518601153949335934799133768942221394003877228398638677 11402
UVM_INFO @ 657959493 ps: (uvm_report_catcher.svh:705) [UVM/REPORT/CATCHER]
--- UVM Report catcher Summary ---
aes_stress_all 70722152947593055898153630657452086281866660098530712356416590059860519906239 7558
UVM_INFO @ 548724712 ps: (uvm_report_catcher.svh:705) [UVM/REPORT/CATCHER]
--- UVM Report catcher Summary ---
aes_stress_all_with_rand_reset 25372224275160524483743465508798068339313297362705517388638191576479469276015 274
UVM_INFO @ 537973993 ps: (uvm_report_catcher.svh:705) [UVM/REPORT/CATCHER]
--- UVM Report catcher Summary ---
aes_reseed 92866525060292622167666471539542832823821882325587424682689478498305939008831 5638
UVM_INFO @ 446399919 ps: (uvm_report_catcher.svh:705) [UVM/REPORT/CATCHER]
--- UVM Report catcher Summary ---
aes_reseed 106205033739545222345094235478774350640484564362719412591262491393019342308196 20440
UVM_INFO @ 70071743 ps: (uvm_report_catcher.svh:705) [UVM/REPORT/CATCHER]
--- UVM Report catcher Summary ---
aes_stress_all 94120396049336523615216183620592985793034782210242220610008514155909859405344 260678
UVM_INFO @ 2323505450 ps: (uvm_report_catcher.svh:705) [UVM/REPORT/CATCHER]
--- UVM Report catcher Summary ---
aes_stress_all_with_rand_reset 109271224068883817625484035747135466508271133271877461654029441618697072234238 164
UVM_INFO @ 68739773 ps: (uvm_report_catcher.svh:705) [UVM/REPORT/CATCHER]
--- UVM Report catcher Summary ---
UVM_FATAL (aes_control_fi_vseq.sv:62) [aes_control_fi_vseq] wait timeout occurred! 11 test runs
aes_control_fi 27036956569613833722892669648192826228757238241253385458255286903872052261862 153
UVM_INFO @ 10012948061 ps: (uvm_report_catcher.svh:705) [UVM/REPORT/CATCHER]
--- UVM Report catcher Summary ---
aes_control_fi 12360548194867138367150283410404184383422687170889982263033894177539999491793 151
UVM_INFO @ 10058435826 ps: (uvm_report_catcher.svh:705) [UVM/REPORT/CATCHER]
--- UVM Report catcher Summary ---
aes_control_fi 115661102770296390908605533370067716690592270577236562927723547744207787861786 149
UVM_INFO @ 10008129834 ps: (uvm_report_catcher.svh:705) [UVM/REPORT/CATCHER]
--- UVM Report catcher Summary ---
aes_control_fi 75393486210946844390898978931986598194193988447787880458070023803260549716912 167
UVM_INFO @ 10030332399 ps: (uvm_report_catcher.svh:705) [UVM/REPORT/CATCHER]
--- UVM Report catcher Summary ---
aes_control_fi 85397223078927160902987144038292771678870003286652093594795822041883342676857 150
UVM_INFO @ 10072705429 ps: (uvm_report_catcher.svh:705) [UVM/REPORT/CATCHER]
--- UVM Report catcher Summary ---
aes_control_fi 91269359421286552980426787115808021996672031318703118779307967431578280762241 148
UVM_INFO @ 10023981913 ps: (uvm_report_catcher.svh:705) [UVM/REPORT/CATCHER]
--- UVM Report catcher Summary ---
aes_control_fi 114284068878801952180228320319520859902331816960439307714773257105862507095635 144
UVM_INFO @ 10012720231 ps: (uvm_report_catcher.svh:705) [UVM/REPORT/CATCHER]
--- UVM Report catcher Summary ---
aes_control_fi 58595393440970357096181879770705401899179328963584389053302055586740920908703 152
UVM_INFO @ 10032048715 ps: (uvm_report_catcher.svh:705) [UVM/REPORT/CATCHER]
--- UVM Report catcher Summary ---
aes_control_fi 16454906593535000227099151761921008870397330708756936771877664918751352069858 149
UVM_INFO @ 10018923036 ps: (uvm_report_catcher.svh:705) [UVM/REPORT/CATCHER]
--- UVM Report catcher Summary ---
aes_control_fi 78306074748805191364775934197184991199729771112997083369792126273883155095428 160
UVM_INFO @ 10011695192 ps: (uvm_report_catcher.svh:705) [UVM/REPORT/CATCHER]
--- UVM Report catcher Summary ---
aes_control_fi 53363935245133127457364805505264881928153555409059509256667469283155945199268 148
UVM_INFO @ 10016348738 ps: (uvm_report_catcher.svh:705) [UVM/REPORT/CATCHER]
--- UVM Report catcher Summary ---
UVM_FATAL (aes_cipher_fi_vseq.sv:62) [aes_cipher_fi_vseq] wait timeout occurred! 11 test runs
aes_cipher_fi 27316747145083668850322686606088898890771452488304620422850534038156747821575 150
UVM_INFO @ 10007908472 ps: (uvm_report_catcher.svh:705) [UVM/REPORT/CATCHER]
--- UVM Report catcher Summary ---
aes_cipher_fi 78980044041167854297923121648781594945839926487566593447140025445598251389791 160
UVM_INFO @ 10019873590 ps: (uvm_report_catcher.svh:705) [UVM/REPORT/CATCHER]
--- UVM Report catcher Summary ---
aes_cipher_fi 51142386797712331278985258325425088727646291521349286017992925077578872309202 152
UVM_INFO @ 10026011279 ps: (uvm_report_catcher.svh:705) [UVM/REPORT/CATCHER]
--- UVM Report catcher Summary ---
aes_cipher_fi 90135464029360046325434256260591935261445951937245562305243083183386113787054 149
UVM_INFO @ 10021158835 ps: (uvm_report_catcher.svh:705) [UVM/REPORT/CATCHER]
--- UVM Report catcher Summary ---
aes_cipher_fi 9971893319158048425727484183779811620335138413888507334879957879021101171111 151
UVM_INFO @ 10012137110 ps: (uvm_report_catcher.svh:705) [UVM/REPORT/CATCHER]
--- UVM Report catcher Summary ---
aes_cipher_fi 25877021444130195456396244555902894521621390241714096160462477454120882375402 156
UVM_INFO @ 10031024362 ps: (uvm_report_catcher.svh:705) [UVM/REPORT/CATCHER]
--- UVM Report catcher Summary ---
aes_cipher_fi 21671112985584925719196525961628955314831845427805404628642862573861251301620 144
UVM_INFO @ 10005898799 ps: (uvm_report_catcher.svh:705) [UVM/REPORT/CATCHER]
--- UVM Report catcher Summary ---
aes_cipher_fi 61587155397077656052717577763277066513343678043903289550320646709959654485645 154
UVM_INFO @ 10009429725 ps: (uvm_report_catcher.svh:705) [UVM/REPORT/CATCHER]
--- UVM Report catcher Summary ---
aes_cipher_fi 22900561125654753742321469806486766099229818159693171523125968133824666051768 150
UVM_INFO @ 10042701758 ps: (uvm_report_catcher.svh:705) [UVM/REPORT/CATCHER]
--- UVM Report catcher Summary ---
aes_cipher_fi 99674068552439767610838672036071623399045197694908501220059141288208726601993 149
UVM_INFO @ 10014002264 ps: (uvm_report_catcher.svh:705) [UVM/REPORT/CATCHER]
--- UVM Report catcher Summary ---
aes_cipher_fi 56095206666241054278145586228740622515468178078142069576398448122836796221072 150
UVM_INFO @ 10066975258 ps: (uvm_report_catcher.svh:705) [UVM/REPORT/CATCHER]
--- UVM Report catcher Summary ---
UVM_FATAL (aes_core_fi_vseq.sv:70) [aes_core_fi_vseq] wait timeout occurred! 9 test runs
aes_core_fi 49343711628405136232030780682953726984880773614898740209732056749281582072185 143
UVM_INFO @ 10040280967 ps: (uvm_report_catcher.svh:705) [UVM/REPORT/CATCHER]
--- UVM Report catcher Summary ---
aes_core_fi 79223783063583345059174722107405504289357294897315260614388006744735620752360 146
UVM_INFO @ 10013307080 ps: (uvm_report_catcher.svh:705) [UVM/REPORT/CATCHER]
--- UVM Report catcher Summary ---
aes_core_fi 86251246019755974529948382272640192373172711059583906449771075059433975886904 144
UVM_INFO @ 10041346636 ps: (uvm_report_catcher.svh:705) [UVM/REPORT/CATCHER]
--- UVM Report catcher Summary ---
aes_core_fi 50369635243258423803631212024423359712022746653413924426627592362900746385146 153
UVM_INFO @ 10080940593 ps: (uvm_report_catcher.svh:705) [UVM/REPORT/CATCHER]
--- UVM Report catcher Summary ---
aes_core_fi 78319208571670986013709812286089236835093214113141269068241711551785883799655 150
UVM_INFO @ 10009112788 ps: (uvm_report_catcher.svh:705) [UVM/REPORT/CATCHER]
--- UVM Report catcher Summary ---
aes_core_fi 5332481545290955519095295771634260866090615945783984333969983815995532324439 157
UVM_INFO @ 10012370254 ps: (uvm_report_catcher.svh:705) [UVM/REPORT/CATCHER]
--- UVM Report catcher Summary ---
aes_core_fi 67048760246353340510455403903267843964362912427201942637267782507213291468761 143
UVM_INFO @ 10072024491 ps: (uvm_report_catcher.svh:705) [UVM/REPORT/CATCHER]
--- UVM Report catcher Summary ---
aes_core_fi 32359181606488497043556939878421184767961476800182804364807979247966243740409 147
UVM_INFO @ 10044771572 ps: (uvm_report_catcher.svh:705) [UVM/REPORT/CATCHER]
--- UVM Report catcher Summary ---
aes_core_fi 34556643678340544979138514318100490292283870095456468561146362056806905789198 156
UVM_INFO @ 10009651060 ps: (uvm_report_catcher.svh:705) [UVM/REPORT/CATCHER]
--- UVM Report catcher Summary ---
UVM_FATAL (aes_scoreboard.sv:923) scoreboard [scoreboard] 8 test runs
aes_fi 30174511523377620086327017780416049656689563043776363924463443368452907194609 18918
----| NO FAILURES BUT NUMBER OF EXPECTED MESSAGES DOES NOT MATCH ACTUAL
----| Expected: 4
----| Seen: 2
----| Expected corrupted: 0
aes_fi 37063785090652615955508733543066591779744120492667346352846046301750916286478 16333
----| NO FAILURES BUT NUMBER OF EXPECTED MESSAGES DOES NOT MATCH ACTUAL
----| Expected: 4
----| Seen: 3
----| Expected corrupted: 0
aes_fi 87504488061150357971001507868175195944510975064876959714562467731618715668502 23352
----| NO FAILURES BUT NUMBER OF EXPECTED MESSAGES DOES NOT MATCH ACTUAL
----| Expected: 5
----| Seen: 4
----| Expected corrupted: 0
aes_fi 110275525006815004331568330111649542005919503989659343157776256592176796076608 22422
----| NO FAILURES BUT NUMBER OF EXPECTED MESSAGES DOES NOT MATCH ACTUAL
----| Expected: 5
----| Seen: 4
----| Expected corrupted: 0
aes_fi 19172527357919914614894609845112362687337102745773474256632534369371981663563 20732
----| NO FAILURES BUT NUMBER OF EXPECTED MESSAGES DOES NOT MATCH ACTUAL
----| Expected: 6
----| Seen: 5
----| Expected corrupted: 0
aes_fi 99007123069459761261784961363207995684650708236823403652714202822573533466333 24021
----| NO FAILURES BUT NUMBER OF EXPECTED MESSAGES DOES NOT MATCH ACTUAL
----| Expected: 6
----| Seen: 5
----| Expected corrupted: 0
aes_fi 80767349034495566168562948554756504189562388085153248505013375136781955794208 16255
----| NO FAILURES BUT NUMBER OF EXPECTED MESSAGES DOES NOT MATCH ACTUAL
----| Expected: 4
----| Seen: 3
----| Expected corrupted: 0
aes_fi 9679597556956570309780881285934742463212472193340010164718056383557436297005 4639
----| NO FAILURES BUT NUMBER OF EXPECTED MESSAGES DOES NOT MATCH ACTUAL
----| Expected: 6
----| Seen: 5
----| Expected corrupted: 0
UVM_FATAL (cip_base_vseq.sv:1230) [aes_common_vseq] Check failed (vseq_done) 5 test runs
aes_stress_all_with_rand_reset 51519002617574555645762698567152637285637284804136188836740869287769502491187 669
UVM_INFO @ 1789099509 ps: (uvm_report_catcher.svh:705) [UVM/REPORT/CATCHER]
--- UVM Report catcher Summary ---
aes_stress_all_with_rand_reset 73108578573854618300476736468475276184523704094361679530995554565746759517821 439
UVM_INFO @ 1473267491 ps: (uvm_report_catcher.svh:705) [UVM/REPORT/CATCHER]
--- UVM Report catcher Summary ---
aes_stress_all_with_rand_reset 113973041182752891315081711788463045699594476023000823429593908342962399278987 627
UVM_INFO @ 608328136 ps: (uvm_report_catcher.svh:705) [UVM/REPORT/CATCHER]
--- UVM Report catcher Summary ---
aes_stress_all_with_rand_reset 88112429025879998382826389935796596111037878179258470075591168697973206797296 471
UVM_INFO @ 550270121 ps: (uvm_report_catcher.svh:705) [UVM/REPORT/CATCHER]
--- UVM Report catcher Summary ---
aes_stress_all_with_rand_reset 72195449485488811761346183398078164810957579174931254175916296229605138351526 1372
UVM_INFO @ 15321553270 ps: (uvm_report_catcher.svh:705) [UVM/REPORT/CATCHER]
--- UVM Report catcher Summary ---
UVM_FATAL (uvm_phase.svh:1521) [PH_TIMEOUT] Explicit timeout of * ps hit, indicating a probable testbench issue 3 test runs
aes_alert_reset 29536042636899410369103339252349790294942549920962303567553453180129931481212 9998763
UVM_INFO @ 200000000000 ps: (uvm_report_catcher.svh:705) [UVM/REPORT/CATCHER]
--- UVM Report catcher Summary ---
aes_fi 84173470866096910728028442186273697827540379606337871958064048181646315431032 15997882
UVM_INFO @ 200000000000 ps: (uvm_report_catcher.svh:705) [UVM/REPORT/CATCHER]
--- UVM Report catcher Summary ---
aes_alert_reset 13659455911018931632602145263442662618894509048208288577064095916289136433091 2065172
UVM_INFO @ 200000000000 ps: (uvm_report_catcher.svh:705) [UVM/REPORT/CATCHER]
--- UVM Report catcher Summary ---
UVM_FATAL (aes_base_vseq.sv:87) [aes_stress_all_vseq] Check failed (aes_ctrl_aux[*] == cfg.do_reseed) 1 test run
aes_stress_all_with_rand_reset 17799189466376699655741538897277920476503309967850833447715462009157654345772 112
UVM_INFO @ 12447147 ps: (uvm_report_catcher.svh:705) [UVM/REPORT/CATCHER]
--- UVM Report catcher Summary ---
UVM_FATAL (aes_base_vseq.sv:1082) virtual_sequencer [aes_reseed_vseq] 1 test run
aes_stress_all_with_rand_reset 19242208823634674704788415489662110476914013883934183650923581224334908450005 175
Was able to clear FATAL ALERT without reset
---| Idle: 0
---| Stall: 0
UVM_FATAL (aes_scoreboard.sv:782) scoreboard [scoreboard] # * 1 test run
aes_clear 30170981541462305655451080261946658518124872902295350806175138890803331745183 2717
TEST FAILED MESSAGES DID NOT MATCH
0 84 a4 32 0
1 00 07 2f 0
UVM_FATAL (csr_utils_pkg.sv:623) [csr_utils_pkg::csr_spinwait.isolation_fork] timeout aes_reg_block_extended.status.output_valid (addr=*, Comparison=CompareOpEq, exp_data=*, call_count=67) 1 test run
aes_stress_all 12553438433931054673763940764255752721331581478612264736650551470331357955835 190011
UVM_INFO @ 12220751935 ps: (uvm_report_catcher.svh:705) [UVM/REPORT/CATCHER]
--- UVM Report catcher Summary ---
UVM_FATAL (csr_utils_pkg.sv:623) [csr_utils_pkg::csr_spinwait.isolation_fork] timeout aes_reg_block_extended.status.idle (addr=*, Comparison=CompareOpEq, exp_data=*, call_count=4) 1 test run
aes_cipher_fi 49307008142668231122299100372715587420237704982132304101983779058148671042467 139
UVM_INFO @ 10036553192 ps: (uvm_report_catcher.svh:705) [UVM/REPORT/CATCHER]
--- UVM Report catcher Summary ---