Simulation Results: tl_agent

 
28/08/2026 21:54:34 DVSim: v1.49.0 sha: a099412 json Branch: master Tool: vcs [unknown]
Validation stages
unmapped
0.00%
Testpoint Test Max Runtime Sim Time Pass Total %
Unmapped 0 10 0.00
tl_agent_smoke 1.671s 0.000us 0 10 0.00

Error Messages

   Test seed line log context
Some pass patterns missing: ['^TEST PASSED (UVM_)?CHECKS$'] 10 test runs
tl_agent_smoke 58966779111279035829737151034330837570910785385863024033634185803770682935537 None
[Executing]:
make -f /nightly/current_run/opentitan/hw/dv/tools/dvsim/sim.mk run build_seed=None post_run_cmds='' pre_run_cmds='' proj_root=/nightly/current_run/opentitan run_cmd=/nightly/current_run/scratch/master/tl_host_if-sim-vcs/default/simv run_dir=/nightly/current_run/scratch/master/tl_host_if-sim-vcs/0.tl_agent_smoke/latest run_opts='-covg_disable_cg +cdc_instrumentation_enabled=1 +UVM_NO_RELNOTES +UVM_VERBOSITY=UVM_LOW -licqueue -ucli -do /nightly/current_run/opentitan/hw/dv/tools/sim.tcl +ntb_random_seed=902039793 -xlrm hier_inst_seed -assert nopostproc +UVM_TESTNAME=tl_agent_base_test +UVM_TEST_SEQ=tl_agent_base_vseq +en_cov=1 -cm line+cond+fsm+tgl+branch+assert -cm_dir /nightly/current_run/scratch/master/tl_host_if-sim-vcs/coverage/default.vdb -cm_log /dev/null -cm_name 0.tl_agent_smoke.902039793' seed=58966779111279035829737151034330837570910785385863024033634185803770682935537 sw_build_cmd='python /nightly/current_run/opentitan/util/py/scripts/build_sw_collateral_for_sim.py --sw-images='"'"''"'"' --sw-build-opts='"'"''"'"' --sw-build-device= --seed=58966779111279035829737151034330837570910785385863024033634185803770682935537 --run-dir=/nightly/current_run/scratch/master/tl_host_if-sim-vcs/0.tl_agent_smoke/latest' sw_build_device='' sw_build_opts='' sw_images='' uvm_test=tl_agent_base_test uvm_test_seq=tl_agent_base_vseq
/usr/bin/env: ‘bash’: Input/output error
make: *** [/nightly/current_run/opentitan/hw/dv/tools/dvsim/sim.mk:50: pre_run] Error 126
tl_agent_smoke 13049439556545680763086619382399560373336731563315706913353439738377113900592 None
[Executing]:
make -f /nightly/current_run/opentitan/hw/dv/tools/dvsim/sim.mk run build_seed=None post_run_cmds='' pre_run_cmds='' proj_root=/nightly/current_run/opentitan run_cmd=/nightly/current_run/scratch/master/tl_host_if-sim-vcs/default/simv run_dir=/nightly/current_run/scratch/master/tl_host_if-sim-vcs/1.tl_agent_smoke/latest run_opts='-covg_disable_cg +cdc_instrumentation_enabled=1 +UVM_NO_RELNOTES +UVM_VERBOSITY=UVM_LOW -licqueue -ucli -do /nightly/current_run/opentitan/hw/dv/tools/sim.tcl +ntb_random_seed=1702827568 -xlrm hier_inst_seed -assert nopostproc +UVM_TESTNAME=tl_agent_base_test +UVM_TEST_SEQ=tl_agent_base_vseq +en_cov=1 -cm line+cond+fsm+tgl+branch+assert -cm_dir /nightly/current_run/scratch/master/tl_host_if-sim-vcs/coverage/default.vdb -cm_log /dev/null -cm_name 1.tl_agent_smoke.1702827568' seed=13049439556545680763086619382399560373336731563315706913353439738377113900592 sw_build_cmd='python /nightly/current_run/opentitan/util/py/scripts/build_sw_collateral_for_sim.py --sw-images='"'"''"'"' --sw-build-opts='"'"''"'"' --sw-build-device= --seed=13049439556545680763086619382399560373336731563315706913353439738377113900592 --run-dir=/nightly/current_run/scratch/master/tl_host_if-sim-vcs/1.tl_agent_smoke/latest' sw_build_device='' sw_build_opts='' sw_images='' uvm_test=tl_agent_base_test uvm_test_seq=tl_agent_base_vseq
/usr/bin/env: ‘bash’: Input/output error
make: *** [/nightly/current_run/opentitan/hw/dv/tools/dvsim/sim.mk:50: pre_run] Error 126
tl_agent_smoke 115472596084171519628634930374801092082721443276044311161361306888212421948946 None
[Executing]:
make -f /nightly/current_run/opentitan/hw/dv/tools/dvsim/sim.mk run build_seed=None post_run_cmds='' pre_run_cmds='' proj_root=/nightly/current_run/opentitan run_cmd=/nightly/current_run/scratch/master/tl_host_if-sim-vcs/default/simv run_dir=/nightly/current_run/scratch/master/tl_host_if-sim-vcs/2.tl_agent_smoke/latest run_opts='-covg_disable_cg +cdc_instrumentation_enabled=1 +UVM_NO_RELNOTES +UVM_VERBOSITY=UVM_LOW -licqueue -ucli -do /nightly/current_run/opentitan/hw/dv/tools/sim.tcl +ntb_random_seed=2362324498 -xlrm hier_inst_seed -assert nopostproc +UVM_TESTNAME=tl_agent_base_test +UVM_TEST_SEQ=tl_agent_base_vseq +en_cov=1 -cm line+cond+fsm+tgl+branch+assert -cm_dir /nightly/current_run/scratch/master/tl_host_if-sim-vcs/coverage/default.vdb -cm_log /dev/null -cm_name 2.tl_agent_smoke.2362324498' seed=115472596084171519628634930374801092082721443276044311161361306888212421948946 sw_build_cmd='python /nightly/current_run/opentitan/util/py/scripts/build_sw_collateral_for_sim.py --sw-images='"'"''"'"' --sw-build-opts='"'"''"'"' --sw-build-device= --seed=115472596084171519628634930374801092082721443276044311161361306888212421948946 --run-dir=/nightly/current_run/scratch/master/tl_host_if-sim-vcs/2.tl_agent_smoke/latest' sw_build_device='' sw_build_opts='' sw_images='' uvm_test=tl_agent_base_test uvm_test_seq=tl_agent_base_vseq
/usr/bin/env: ‘bash’: Input/output error
make: *** [/nightly/current_run/opentitan/hw/dv/tools/dvsim/sim.mk:50: pre_run] Error 126
tl_agent_smoke 6092749760771932153130454698650908977434877600833943679995426520974495411932 None
[Executing]:
make -f /nightly/current_run/opentitan/hw/dv/tools/dvsim/sim.mk run build_seed=None post_run_cmds='' pre_run_cmds='' proj_root=/nightly/current_run/opentitan run_cmd=/nightly/current_run/scratch/master/tl_host_if-sim-vcs/default/simv run_dir=/nightly/current_run/scratch/master/tl_host_if-sim-vcs/3.tl_agent_smoke/latest run_opts='-covg_disable_cg +cdc_instrumentation_enabled=1 +UVM_NO_RELNOTES +UVM_VERBOSITY=UVM_LOW -licqueue -ucli -do /nightly/current_run/opentitan/hw/dv/tools/sim.tcl +ntb_random_seed=286879452 -xlrm hier_inst_seed -assert nopostproc +UVM_TESTNAME=tl_agent_base_test +UVM_TEST_SEQ=tl_agent_base_vseq +en_cov=1 -cm line+cond+fsm+tgl+branch+assert -cm_dir /nightly/current_run/scratch/master/tl_host_if-sim-vcs/coverage/default.vdb -cm_log /dev/null -cm_name 3.tl_agent_smoke.286879452' seed=6092749760771932153130454698650908977434877600833943679995426520974495411932 sw_build_cmd='python /nightly/current_run/opentitan/util/py/scripts/build_sw_collateral_for_sim.py --sw-images='"'"''"'"' --sw-build-opts='"'"''"'"' --sw-build-device= --seed=6092749760771932153130454698650908977434877600833943679995426520974495411932 --run-dir=/nightly/current_run/scratch/master/tl_host_if-sim-vcs/3.tl_agent_smoke/latest' sw_build_device='' sw_build_opts='' sw_images='' uvm_test=tl_agent_base_test uvm_test_seq=tl_agent_base_vseq
/usr/bin/env: ‘bash’: Input/output error
make: *** [/nightly/current_run/opentitan/hw/dv/tools/dvsim/sim.mk:50: pre_run] Error 126
tl_agent_smoke 10759544173364959991941050728277988525871133495355458968264355726090798512172 None
[Executing]:
make -f /nightly/current_run/opentitan/hw/dv/tools/dvsim/sim.mk run build_seed=None post_run_cmds='' pre_run_cmds='' proj_root=/nightly/current_run/opentitan run_cmd=/nightly/current_run/scratch/master/tl_host_if-sim-vcs/default/simv run_dir=/nightly/current_run/scratch/master/tl_host_if-sim-vcs/4.tl_agent_smoke/latest run_opts='-covg_disable_cg +cdc_instrumentation_enabled=1 +UVM_NO_RELNOTES +UVM_VERBOSITY=UVM_LOW -licqueue -ucli -do /nightly/current_run/opentitan/hw/dv/tools/sim.tcl +ntb_random_seed=2642556972 -xlrm hier_inst_seed -assert nopostproc +UVM_TESTNAME=tl_agent_base_test +UVM_TEST_SEQ=tl_agent_base_vseq +en_cov=1 -cm line+cond+fsm+tgl+branch+assert -cm_dir /nightly/current_run/scratch/master/tl_host_if-sim-vcs/coverage/default.vdb -cm_log /dev/null -cm_name 4.tl_agent_smoke.2642556972' seed=10759544173364959991941050728277988525871133495355458968264355726090798512172 sw_build_cmd='python /nightly/current_run/opentitan/util/py/scripts/build_sw_collateral_for_sim.py --sw-images='"'"''"'"' --sw-build-opts='"'"''"'"' --sw-build-device= --seed=10759544173364959991941050728277988525871133495355458968264355726090798512172 --run-dir=/nightly/current_run/scratch/master/tl_host_if-sim-vcs/4.tl_agent_smoke/latest' sw_build_device='' sw_build_opts='' sw_images='' uvm_test=tl_agent_base_test uvm_test_seq=tl_agent_base_vseq
/usr/bin/env: ‘bash’: Input/output error
make: *** [/nightly/current_run/opentitan/hw/dv/tools/dvsim/sim.mk:50: pre_run] Error 126
tl_agent_smoke 20889209193546408552048658544097055047707928977593000694246062174850262472710 None
[Executing]:
make -f /nightly/current_run/opentitan/hw/dv/tools/dvsim/sim.mk run build_seed=None post_run_cmds='' pre_run_cmds='' proj_root=/nightly/current_run/opentitan run_cmd=/nightly/current_run/scratch/master/tl_host_if-sim-vcs/default/simv run_dir=/nightly/current_run/scratch/master/tl_host_if-sim-vcs/5.tl_agent_smoke/latest run_opts='-covg_disable_cg +cdc_instrumentation_enabled=1 +UVM_NO_RELNOTES +UVM_VERBOSITY=UVM_LOW -licqueue -ucli -do /nightly/current_run/opentitan/hw/dv/tools/sim.tcl +ntb_random_seed=1874040838 -xlrm hier_inst_seed -assert nopostproc +UVM_TESTNAME=tl_agent_base_test +UVM_TEST_SEQ=tl_agent_base_vseq +en_cov=1 -cm line+cond+fsm+tgl+branch+assert -cm_dir /nightly/current_run/scratch/master/tl_host_if-sim-vcs/coverage/default.vdb -cm_log /dev/null -cm_name 5.tl_agent_smoke.1874040838' seed=20889209193546408552048658544097055047707928977593000694246062174850262472710 sw_build_cmd='python /nightly/current_run/opentitan/util/py/scripts/build_sw_collateral_for_sim.py --sw-images='"'"''"'"' --sw-build-opts='"'"''"'"' --sw-build-device= --seed=20889209193546408552048658544097055047707928977593000694246062174850262472710 --run-dir=/nightly/current_run/scratch/master/tl_host_if-sim-vcs/5.tl_agent_smoke/latest' sw_build_device='' sw_build_opts='' sw_images='' uvm_test=tl_agent_base_test uvm_test_seq=tl_agent_base_vseq
/usr/bin/env: ‘bash’: Input/output error
make: *** [/nightly/current_run/opentitan/hw/dv/tools/dvsim/sim.mk:50: pre_run] Error 126
tl_agent_smoke 44670852349043050863249995601910714432716556687712215689630786119212189636557 None
[Executing]:
make -f /nightly/current_run/opentitan/hw/dv/tools/dvsim/sim.mk run build_seed=None post_run_cmds='' pre_run_cmds='' proj_root=/nightly/current_run/opentitan run_cmd=/nightly/current_run/scratch/master/tl_host_if-sim-vcs/default/simv run_dir=/nightly/current_run/scratch/master/tl_host_if-sim-vcs/6.tl_agent_smoke/latest run_opts='-covg_disable_cg +cdc_instrumentation_enabled=1 +UVM_NO_RELNOTES +UVM_VERBOSITY=UVM_LOW -licqueue -ucli -do /nightly/current_run/opentitan/hw/dv/tools/sim.tcl +ntb_random_seed=2103728077 -xlrm hier_inst_seed -assert nopostproc +UVM_TESTNAME=tl_agent_base_test +UVM_TEST_SEQ=tl_agent_base_vseq +en_cov=1 -cm line+cond+fsm+tgl+branch+assert -cm_dir /nightly/current_run/scratch/master/tl_host_if-sim-vcs/coverage/default.vdb -cm_log /dev/null -cm_name 6.tl_agent_smoke.2103728077' seed=44670852349043050863249995601910714432716556687712215689630786119212189636557 sw_build_cmd='python /nightly/current_run/opentitan/util/py/scripts/build_sw_collateral_for_sim.py --sw-images='"'"''"'"' --sw-build-opts='"'"''"'"' --sw-build-device= --seed=44670852349043050863249995601910714432716556687712215689630786119212189636557 --run-dir=/nightly/current_run/scratch/master/tl_host_if-sim-vcs/6.tl_agent_smoke/latest' sw_build_device='' sw_build_opts='' sw_images='' uvm_test=tl_agent_base_test uvm_test_seq=tl_agent_base_vseq
/usr/bin/env: ‘bash’: Input/output error
make: *** [/nightly/current_run/opentitan/hw/dv/tools/dvsim/sim.mk:50: pre_run] Error 126
tl_agent_smoke 73986569074854045057622337206934639747329214790308627507535669024761265043039 None
[Executing]:
make -f /nightly/current_run/opentitan/hw/dv/tools/dvsim/sim.mk run build_seed=None post_run_cmds='' pre_run_cmds='' proj_root=/nightly/current_run/opentitan run_cmd=/nightly/current_run/scratch/master/tl_host_if-sim-vcs/default/simv run_dir=/nightly/current_run/scratch/master/tl_host_if-sim-vcs/7.tl_agent_smoke/latest run_opts='-covg_disable_cg +cdc_instrumentation_enabled=1 +UVM_NO_RELNOTES +UVM_VERBOSITY=UVM_LOW -licqueue -ucli -do /nightly/current_run/opentitan/hw/dv/tools/sim.tcl +ntb_random_seed=1962980959 -xlrm hier_inst_seed -assert nopostproc +UVM_TESTNAME=tl_agent_base_test +UVM_TEST_SEQ=tl_agent_base_vseq +en_cov=1 -cm line+cond+fsm+tgl+branch+assert -cm_dir /nightly/current_run/scratch/master/tl_host_if-sim-vcs/coverage/default.vdb -cm_log /dev/null -cm_name 7.tl_agent_smoke.1962980959' seed=73986569074854045057622337206934639747329214790308627507535669024761265043039 sw_build_cmd='python /nightly/current_run/opentitan/util/py/scripts/build_sw_collateral_for_sim.py --sw-images='"'"''"'"' --sw-build-opts='"'"''"'"' --sw-build-device= --seed=73986569074854045057622337206934639747329214790308627507535669024761265043039 --run-dir=/nightly/current_run/scratch/master/tl_host_if-sim-vcs/7.tl_agent_smoke/latest' sw_build_device='' sw_build_opts='' sw_images='' uvm_test=tl_agent_base_test uvm_test_seq=tl_agent_base_vseq
/usr/bin/env: ‘bash’: Input/output error
make: *** [/nightly/current_run/opentitan/hw/dv/tools/dvsim/sim.mk:50: pre_run] Error 126
tl_agent_smoke 47798413171394409630463339791330677866672974214986391709183051167876605423913 None
[Executing]:
make -f /nightly/current_run/opentitan/hw/dv/tools/dvsim/sim.mk run build_seed=None post_run_cmds='' pre_run_cmds='' proj_root=/nightly/current_run/opentitan run_cmd=/nightly/current_run/scratch/master/tl_host_if-sim-vcs/default/simv run_dir=/nightly/current_run/scratch/master/tl_host_if-sim-vcs/8.tl_agent_smoke/latest run_opts='-covg_disable_cg +cdc_instrumentation_enabled=1 +UVM_NO_RELNOTES +UVM_VERBOSITY=UVM_LOW -licqueue -ucli -do /nightly/current_run/opentitan/hw/dv/tools/sim.tcl +ntb_random_seed=3583389993 -xlrm hier_inst_seed -assert nopostproc +UVM_TESTNAME=tl_agent_base_test +UVM_TEST_SEQ=tl_agent_base_vseq +en_cov=1 -cm line+cond+fsm+tgl+branch+assert -cm_dir /nightly/current_run/scratch/master/tl_host_if-sim-vcs/coverage/default.vdb -cm_log /dev/null -cm_name 8.tl_agent_smoke.3583389993' seed=47798413171394409630463339791330677866672974214986391709183051167876605423913 sw_build_cmd='python /nightly/current_run/opentitan/util/py/scripts/build_sw_collateral_for_sim.py --sw-images='"'"''"'"' --sw-build-opts='"'"''"'"' --sw-build-device= --seed=47798413171394409630463339791330677866672974214986391709183051167876605423913 --run-dir=/nightly/current_run/scratch/master/tl_host_if-sim-vcs/8.tl_agent_smoke/latest' sw_build_device='' sw_build_opts='' sw_images='' uvm_test=tl_agent_base_test uvm_test_seq=tl_agent_base_vseq
/usr/bin/env: ‘bash’: Input/output error
make: *** [/nightly/current_run/opentitan/hw/dv/tools/dvsim/sim.mk:50: pre_run] Error 126
tl_agent_smoke 12930494464919032997804504490565700434500421953002156948369189025932508446720 None
[Executing]:
make -f /nightly/current_run/opentitan/hw/dv/tools/dvsim/sim.mk run build_seed=None post_run_cmds='' pre_run_cmds='' proj_root=/nightly/current_run/opentitan run_cmd=/nightly/current_run/scratch/master/tl_host_if-sim-vcs/default/simv run_dir=/nightly/current_run/scratch/master/tl_host_if-sim-vcs/9.tl_agent_smoke/latest run_opts='-covg_disable_cg +cdc_instrumentation_enabled=1 +UVM_NO_RELNOTES +UVM_VERBOSITY=UVM_LOW -licqueue -ucli -do /nightly/current_run/opentitan/hw/dv/tools/sim.tcl +ntb_random_seed=1680130048 -xlrm hier_inst_seed -assert nopostproc +UVM_TESTNAME=tl_agent_base_test +UVM_TEST_SEQ=tl_agent_base_vseq +en_cov=1 -cm line+cond+fsm+tgl+branch+assert -cm_dir /nightly/current_run/scratch/master/tl_host_if-sim-vcs/coverage/default.vdb -cm_log /dev/null -cm_name 9.tl_agent_smoke.1680130048' seed=12930494464919032997804504490565700434500421953002156948369189025932508446720 sw_build_cmd='python /nightly/current_run/opentitan/util/py/scripts/build_sw_collateral_for_sim.py --sw-images='"'"''"'"' --sw-build-opts='"'"''"'"' --sw-build-device= --seed=12930494464919032997804504490565700434500421953002156948369189025932508446720 --run-dir=/nightly/current_run/scratch/master/tl_host_if-sim-vcs/9.tl_agent_smoke/latest' sw_build_device='' sw_build_opts='' sw_images='' uvm_test=tl_agent_base_test uvm_test_seq=tl_agent_base_vseq
/usr/bin/env: ‘bash’: Input/output error
make: *** [/nightly/current_run/opentitan/hw/dv/tools/dvsim/sim.mk:50: pre_run] Error 126
Job cancelled because all of its dependencies failed or were killed. 1 test run
tl_agent None None
Job cancelled because one of its dependencies failed or was killed. 1 test run
tl_agent None None