Simulation Results: chip

 
06/06/2026 15:22:54 DVSim: v1.49.0 sha: 2348eb2 json Branch: master Tool: vcs [unknown]
Coverage statistics
  • Total
  • 94.48 %
  • code
  • 86.05 %
  • assert
  • 98.00 %
  • func
  • 99.39 %
  • line
  • 94.56 %
  • branch
  • 94.20 %
  • cond
  • 92.71 %
  • toggle
  • 91.62 %
  • FSM
  • 57.14 %
Validation stages
V1
98.44%
V2
85.77%
V2S
100.00%
V3
87.42%
unmapped
58.06%
Testpoint Test Max Runtime Sim Time Pass Total %
chip_sw_example_tests 12 12 100.00
chip_sw_example_flash 237.890s 3498.299us 3 3 100.00
chip_sw_example_rom 124.880s 3279.475us 3 3 100.00
chip_sw_example_manufacturer 211.190s 3438.141us 3 3 100.00
chip_sw_example_concurrency 266.320s 3516.934us 3 3 100.00
csr_hw_reset 1 1 100.00
chip_csr_hw_reset 186.470s 5008.789us 1 1 100.00
csr_rw 5 5 100.00
chip_csr_rw 589.760s 6456.342us 5 5 100.00
csr_bit_bash 1 1 100.00
chip_csr_bit_bash 631.380s 5780.096us 1 1 100.00
csr_aliasing 1 1 100.00
chip_csr_aliasing 5994.390s 36171.640us 1 1 100.00
csr_mem_rw_with_rand_reset 3 5 60.00
chip_csr_mem_rw_with_rand_reset 848.800s 11642.681us 3 5 60.00
regwen_csr_and_corresponding_lockable_csr 6 6 100.00
chip_csr_aliasing 5994.390s 36171.640us 1 1 100.00
chip_csr_rw 589.760s 6456.342us 5 5 100.00
xbar_smoke 50 50 100.00
xbar_smoke 12.140s 276.616us 50 50 100.00
chip_sw_gpio_out 3 3 100.00
chip_sw_gpio 421.150s 5025.643us 3 3 100.00
chip_sw_gpio_in 3 3 100.00
chip_sw_gpio 421.150s 5025.643us 3 3 100.00
chip_sw_gpio_irq 3 3 100.00
chip_sw_gpio 421.150s 5025.643us 3 3 100.00
chip_sw_uart_tx_rx 5 5 100.00
chip_sw_uart_tx_rx 523.270s 4881.758us 5 5 100.00
chip_sw_uart_rx_overflow 20 20 100.00
chip_sw_uart_tx_rx 523.270s 4881.758us 5 5 100.00
chip_sw_uart_tx_rx_idx1 537.430s 4593.238us 5 5 100.00
chip_sw_uart_tx_rx_idx2 511.770s 3769.473us 5 5 100.00
chip_sw_uart_tx_rx_idx3 540.280s 4306.021us 5 5 100.00
chip_sw_uart_baud_rate 20 20 100.00
chip_sw_uart_rand_baudrate 2340.340s 13187.092us 20 20 100.00
chip_sw_uart_tx_rx_alt_clk_freq 10 10 100.00
chip_sw_uart_tx_rx_alt_clk_freq 1426.210s 9098.582us 5 5 100.00
chip_sw_uart_tx_rx_alt_clk_freq_low_speed 1382.000s 13578.349us 5 5 100.00
Testpoint Test Max Runtime Sim Time Pass Total %
chip_pin_mux 10 10 100.00
chip_padctrl_attributes 304.050s 5451.195us 10 10 100.00
chip_padctrl_attributes 10 10 100.00
chip_padctrl_attributes 304.050s 5451.195us 10 10 100.00
chip_sw_sleep_pin_mio_dio_val 2 3 66.67
chip_sw_sleep_pin_mio_dio_val 278.850s 3405.130us 2 3 66.67
chip_sw_sleep_pin_wake 3 3 100.00
chip_sw_sleep_pin_wake 386.230s 5582.449us 3 3 100.00
chip_sw_sleep_pin_retention 3 3 100.00
chip_sw_sleep_pin_retention 285.270s 3914.312us 3 3 100.00
chip_sw_tap_strap_sampling 20 20 100.00
chip_tap_straps_dev 597.510s 8208.097us 5 5 100.00
chip_tap_straps_testunlock0 509.350s 6921.132us 5 5 100.00
chip_tap_straps_rma 618.950s 7513.769us 5 5 100.00
chip_tap_straps_prod 435.970s 5855.186us 5 5 100.00
chip_sw_pattgen_ios 3 3 100.00
chip_sw_pattgen_ios 264.950s 3375.319us 3 3 100.00
chip_sw_sleep_pwm_pulses 3 3 100.00
chip_sw_sleep_pwm_pulses 1116.630s 8260.782us 3 3 100.00
chip_sw_data_integrity 6 6 100.00
chip_sw_data_integrity_escalation 629.730s 6385.337us 6 6 100.00
chip_sw_instruction_integrity 6 6 100.00
chip_sw_data_integrity_escalation 629.730s 6385.337us 6 6 100.00
chip_sw_ast_clk_outputs 3 3 100.00
chip_sw_ast_clk_outputs 827.930s 8831.038us 3 3 100.00
chip_sw_ast_clk_rst_inputs 0 3 0.00
chip_sw_ast_clk_rst_inputs 2511.910s 14704.800us 0 3 0.00
chip_sw_ast_sys_clk_jitter 30 30 100.00
chip_sw_flash_ctrl_ops_jitter_en 531.890s 4591.797us 3 3 100.00
chip_sw_flash_ctrl_access_jitter_en 835.200s 6454.089us 3 3 100.00
chip_sw_otbn_ecdsa_op_irq_jitter_en 4757.230s 18708.080us 3 3 100.00
chip_sw_aes_enc_jitter_en 275.360s 3015.131us 3 3 100.00
chip_sw_edn_entropy_reqs_jitter 926.240s 6268.344us 3 3 100.00
chip_sw_hmac_enc_jitter_en 229.480s 3196.065us 3 3 100.00
chip_sw_keymgr_key_derivation_jitter_en 2546.630s 12659.436us 3 3 100.00
chip_sw_kmac_mode_kmac_jitter_en 275.720s 3439.499us 3 3 100.00
chip_sw_sram_ctrl_scrambled_access_jitter_en 585.830s 5136.199us 3 3 100.00
chip_sw_clkmgr_jitter 241.440s 2655.436us 3 3 100.00
chip_sw_ast_usb_clk_calib 1 1 100.00
chip_sw_usb_ast_clk_calib 250.620s 2495.007us 1 1 100.00
chip_sw_sensor_ctrl_ast_alerts 6 8 75.00
chip_sw_sensor_ctrl_alert 743.670s 9087.407us 3 5 60.00
chip_sw_pwrmgr_sleep_sensor_ctrl_alert_wakeup 329.410s 5813.253us 3 3 100.00
chip_sw_sensor_ctrl_ast_status 3 3 100.00
chip_sw_sensor_ctrl_status 201.030s 2995.652us 3 3 100.00
chip_sw_pwrmgr_sleep_sensor_ctrl_alert_wakeup 3 3 100.00
chip_sw_pwrmgr_sleep_sensor_ctrl_alert_wakeup 329.410s 5813.253us 3 3 100.00
chip_sw_smoketest 51 51 100.00
chip_sw_flash_scrambling_smoketest 256.640s 2861.617us 3 3 100.00
chip_sw_aes_smoketest 306.580s 2932.535us 3 3 100.00
chip_sw_aon_timer_smoketest 250.660s 3822.454us 3 3 100.00
chip_sw_clkmgr_smoketest 224.750s 2846.646us 3 3 100.00
chip_sw_csrng_smoketest 221.650s 3195.985us 3 3 100.00
chip_sw_entropy_src_smoketest 1157.780s 7217.021us 3 3 100.00
chip_sw_gpio_smoketest 281.100s 3496.790us 3 3 100.00
chip_sw_hmac_smoketest 301.380s 3640.034us 3 3 100.00
chip_sw_kmac_smoketest 308.940s 2782.183us 3 3 100.00
chip_sw_otbn_smoketest 1722.440s 9422.327us 3 3 100.00
chip_sw_pwrmgr_smoketest 458.540s 6863.324us 3 3 100.00
chip_sw_pwrmgr_usbdev_smoketest 423.950s 6369.663us 3 3 100.00
chip_sw_rv_plic_smoketest 246.450s 3710.339us 3 3 100.00
chip_sw_rv_timer_smoketest 261.000s 3427.738us 3 3 100.00
chip_sw_rstmgr_smoketest 189.140s 2295.805us 3 3 100.00
chip_sw_sram_ctrl_smoketest 193.810s 3134.803us 3 3 100.00
chip_sw_uart_smoketest 244.770s 3598.122us 3 3 100.00
chip_sw_otp_smoketest 3 3 100.00
chip_sw_otp_ctrl_smoketest 258.630s 3253.406us 3 3 100.00
chip_sw_rom_functests 0 3 0.00
rom_keymgr_functest 475.070s 4858.297us 0 3 0.00
chip_sw_boot 3 3 100.00
chip_sw_uart_tx_rx_bootstrap 13118.200s 62781.268us 3 3 100.00
chip_sw_secure_boot 3 3 100.00
rom_e2e_smoke 3850.050s 15855.490us 3 3 100.00
chip_sw_rom_raw_unlock 0 3 0.00
rom_raw_unlock 85.765s 0.000us 0 3 0.00
chip_sw_power_idle_load 0 3 0.00
chip_sw_power_idle_load 263.870s 2876.896us 0 3 0.00
chip_sw_power_sleep_load 0 3 0.00
chip_sw_power_sleep_load 235.490s 3991.700us 0 3 0.00
chip_sw_exit_test_unlocked_bootstrap 3 3 100.00
chip_sw_exit_test_unlocked_bootstrap 12056.430s 55209.733us 3 3 100.00
chip_sw_inject_scramble_seed 3 3 100.00
chip_sw_inject_scramble_seed 12314.770s 58980.267us 3 3 100.00
tl_d_oob_addr_access 4 30 13.33
chip_tl_errors 409.320s 3980.786us 4 30 13.33
tl_d_illegal_access 4 30 13.33
chip_tl_errors 409.320s 3980.786us 4 30 13.33
tl_d_outstanding_access 12 12 100.00
chip_csr_aliasing 5994.390s 36171.640us 1 1 100.00
chip_same_csr_outstanding 4143.660s 31144.202us 5 5 100.00
chip_csr_hw_reset 186.470s 5008.789us 1 1 100.00
chip_csr_rw 589.760s 6456.342us 5 5 100.00
tl_d_partial_access 12 12 100.00
chip_csr_aliasing 5994.390s 36171.640us 1 1 100.00
chip_same_csr_outstanding 4143.660s 31144.202us 5 5 100.00
chip_csr_hw_reset 186.470s 5008.789us 1 1 100.00
chip_csr_rw 589.760s 6456.342us 5 5 100.00
xbar_base_random_sequence 50 50 100.00
xbar_random 87.670s 2266.870us 50 50 100.00
xbar_random_delay 300 300 100.00
xbar_smoke_zero_delays 7.150s 61.323us 50 50 100.00
xbar_smoke_large_delays 102.360s 9709.650us 50 50 100.00
xbar_smoke_slow_rsp 100.640s 5996.524us 50 50 100.00
xbar_random_zero_delays 45.650s 563.337us 50 50 100.00
xbar_random_large_delays 463.480s 54592.095us 50 50 100.00
xbar_random_slow_rsp 415.290s 35240.303us 50 50 100.00
xbar_unmapped_address 100 100 100.00
xbar_unmapped_addr 53.700s 1256.154us 50 50 100.00
xbar_error_and_unmapped_addr 54.530s 1462.676us 50 50 100.00
xbar_error_cases 100 100 100.00
xbar_error_random 79.380s 2654.104us 50 50 100.00
xbar_error_and_unmapped_addr 54.530s 1462.676us 50 50 100.00
xbar_all_access_same_device 100 100 100.00
xbar_access_same_device 127.900s 2905.059us 50 50 100.00
xbar_access_same_device_slow_rsp 1061.480s 82523.617us 50 50 100.00
xbar_all_hosts_use_same_source_id 50 50 100.00
xbar_same_source 81.900s 2446.438us 50 50 100.00
xbar_stress_all 100 100 100.00
xbar_stress_all 642.380s 20222.923us 50 50 100.00
xbar_stress_all_with_error 670.660s 22282.796us 50 50 100.00
xbar_stress_with_reset 100 100 100.00
xbar_stress_all_with_rand_reset 951.580s 11378.758us 50 50 100.00
xbar_stress_all_with_reset_error 601.660s 8974.734us 50 50 100.00
rom_e2e_smoke 3 3 100.00
rom_e2e_smoke 3850.050s 15855.490us 3 3 100.00
rom_e2e_shutdown_output 3 3 100.00
rom_e2e_shutdown_output 3633.440s 27707.354us 3 3 100.00
rom_e2e_shutdown_exception_c 3 3 100.00
rom_e2e_shutdown_exception_c 3797.610s 17312.744us 3 3 100.00
rom_e2e_boot_policy_valid 0 15 0.00
rom_e2e_boot_policy_valid_a_good_b_good_test_unlocked0 22.501s 0.000us 0 1 0.00
rom_e2e_boot_policy_valid_a_good_b_good_dev 10.741s 0.000us 0 1 0.00
rom_e2e_boot_policy_valid_a_good_b_good_prod 11.745s 0.000us 0 1 0.00
rom_e2e_boot_policy_valid_a_good_b_good_prod_end 11.539s 0.000us 0 1 0.00
rom_e2e_boot_policy_valid_a_good_b_good_rma 11.419s 0.000us 0 1 0.00
rom_e2e_boot_policy_valid_a_good_b_bad_test_unlocked0 23.529s 0.000us 0 1 0.00
rom_e2e_boot_policy_valid_a_good_b_bad_dev 10.639s 0.000us 0 1 0.00
rom_e2e_boot_policy_valid_a_good_b_bad_prod 11.469s 0.000us 0 1 0.00
rom_e2e_boot_policy_valid_a_good_b_bad_prod_end 12.163s 0.000us 0 1 0.00
rom_e2e_boot_policy_valid_a_good_b_bad_rma 11.340s 0.000us 0 1 0.00
rom_e2e_boot_policy_valid_a_bad_b_good_test_unlocked0 77.954s 0.000us 0 1 0.00
rom_e2e_boot_policy_valid_a_bad_b_good_dev 12.336s 0.000us 0 1 0.00
rom_e2e_boot_policy_valid_a_bad_b_good_prod 11.994s 0.000us 0 1 0.00
rom_e2e_boot_policy_valid_a_bad_b_good_prod_end 12.381s 0.000us 0 1 0.00
rom_e2e_boot_policy_valid_a_bad_b_good_rma 11.930s 0.000us 0 1 0.00
rom_e2e_sigverify_always 0 15 0.00
rom_e2e_sigverify_always_a_bad_b_bad_test_unlocked0 55.428s 0.000us 0 1 0.00
rom_e2e_sigverify_always_a_bad_b_bad_dev 33.510s 10.340us 0 1 0.00
rom_e2e_sigverify_always_a_bad_b_bad_prod 21.260s 10.160us 0 1 0.00
rom_e2e_sigverify_always_a_bad_b_bad_prod_end 27.320s 10.120us 0 1 0.00
rom_e2e_sigverify_always_a_bad_b_bad_rma 25.740s 10.160us 0 1 0.00
rom_e2e_sigverify_always_a_bad_b_nothing_test_unlocked0 34.970s 10.340us 0 1 0.00
rom_e2e_sigverify_always_a_bad_b_nothing_dev 25.890s 10.360us 0 1 0.00
rom_e2e_sigverify_always_a_bad_b_nothing_prod 23.390s 10.140us 0 1 0.00
rom_e2e_sigverify_always_a_bad_b_nothing_prod_end 27.600s 10.300us 0 1 0.00
rom_e2e_sigverify_always_a_bad_b_nothing_rma 25.020s 10.320us 0 1 0.00
rom_e2e_sigverify_always_a_nothing_b_bad_test_unlocked0 33.690s 10.220us 0 1 0.00
rom_e2e_sigverify_always_a_nothing_b_bad_dev 25.210s 10.360us 0 1 0.00
rom_e2e_sigverify_always_a_nothing_b_bad_prod 29.330s 10.160us 0 1 0.00
rom_e2e_sigverify_always_a_nothing_b_bad_prod_end 28.860s 10.160us 0 1 0.00
rom_e2e_sigverify_always_a_nothing_b_bad_rma 29.860s 10.320us 0 1 0.00
rom_e2e_asm_init 0 15 0.00
rom_e2e_asm_init_test_unlocked0 91.775s 0.000us 0 3 0.00
rom_e2e_asm_init_dev 11.336s 0.000us 0 3 0.00
rom_e2e_asm_init_prod 12.669s 0.000us 0 3 0.00
rom_e2e_asm_init_prod_end 11.574s 0.000us 0 3 0.00
rom_e2e_asm_init_rma 10.753s 0.000us 0 3 0.00
rom_e2e_keymgr_init 4 9 44.44
rom_e2e_keymgr_init_rom_ext_meas 7993.490s 29396.003us 2 3 66.67
rom_e2e_keymgr_init_rom_ext_no_meas 8086.670s 31243.819us 2 3 66.67
rom_e2e_keymgr_init_rom_ext_invalid_meas 4188.230s 19311.321us 0 3 0.00
rom_e2e_static_critical 3 3 100.00
rom_e2e_static_critical 4107.590s 16477.347us 3 3 100.00
chip_sw_adc_ctrl_debug_cable_irq 0 3 0.00
chip_sw_adc_ctrl_sleep_debug_cable_wakeup 3600.304s 0.000us 0 3 0.00
chip_sw_adc_ctrl_sleep_debug_cable_wakeup 0 3 0.00
chip_sw_adc_ctrl_sleep_debug_cable_wakeup 3600.304s 0.000us 0 3 0.00
chip_sw_aes_enc 6 6 100.00
chip_sw_aes_enc 254.600s 3339.575us 3 3 100.00
chip_sw_aes_enc_jitter_en 275.360s 3015.131us 3 3 100.00
chip_sw_aes_entropy 3 3 100.00
chip_sw_aes_entropy 213.240s 2672.960us 3 3 100.00
chip_sw_aes_idle 3 3 100.00
chip_sw_aes_idle 235.640s 2546.303us 3 3 100.00
chip_sw_aes_sideload 3 3 100.00
chip_sw_keymgr_sideload_aes 1870.440s 10875.579us 3 3 100.00
chip_sw_alert_handler_alerts 0 3 0.00
chip_sw_alert_test 238.010s 3071.076us 0 3 0.00
chip_sw_alert_handler_escalations 3 3 100.00
chip_sw_alert_handler_escalation 536.710s 6466.419us 3 3 100.00
chip_sw_all_escalation_resets 95 100 95.00
chip_sw_all_escalation_resets 663.200s 6660.758us 95 100 95.00
chip_sw_alert_handler_irqs 9 9 100.00
chip_plic_all_irqs_0 771.380s 5703.165us 3 3 100.00
chip_plic_all_irqs_10 413.700s 3936.049us 3 3 100.00
chip_plic_all_irqs_20 534.890s 4411.941us 3 3 100.00
chip_sw_alert_handler_entropy 3 3 100.00
chip_sw_alert_handler_entropy 289.780s 3624.878us 3 3 100.00
chip_sw_alert_handler_crashdump 3 3 100.00
chip_sw_rstmgr_alert_info 1700.690s 14207.375us 3 3 100.00
chip_sw_alert_handler_ping_timeout 3 3 100.00
chip_sw_alert_handler_ping_timeout 415.140s 4945.062us 3 3 100.00
chip_sw_alert_handler_lpg_sleep_mode_alerts 0 90 0.00
chip_sw_alert_handler_lpg_sleep_mode_alerts 266.890s 3277.434us 0 90 0.00
chip_sw_alert_handler_lpg_sleep_mode_pings 0 3 0.00
chip_sw_alert_handler_lpg_sleep_mode_pings 14400.175s 0.000us 0 3 0.00
chip_sw_alert_handler_lpg_clock_off 3 3 100.00
chip_sw_alert_handler_lpg_clkoff 1389.800s 7448.907us 3 3 100.00
chip_sw_alert_handler_lpg_reset_toggle 3 3 100.00
chip_sw_alert_handler_lpg_reset_toggle 1280.450s 7162.785us 3 3 100.00
chip_sw_alert_handler_ping_ok 3 3 100.00
chip_sw_alert_handler_ping_ok 1156.840s 8370.032us 3 3 100.00
chip_sw_alert_handler_reverse_ping_in_deep_sleep 3 3 100.00
chip_sw_alert_handler_reverse_ping_in_deep_sleep 13981.430s 256027.436us 3 3 100.00
chip_sw_aon_timer_wakeup_irq 3 3 100.00
chip_sw_aon_timer_irq 364.220s 4760.028us 3 3 100.00
chip_sw_aon_timer_sleep_wakeup 3 3 100.00
chip_sw_pwrmgr_smoketest 458.540s 6863.324us 3 3 100.00
chip_sw_aon_timer_wdog_bark_irq 3 3 100.00
chip_sw_aon_timer_irq 364.220s 4760.028us 3 3 100.00
chip_sw_aon_timer_wdog_bite_reset 2 3 66.67
chip_sw_aon_timer_wdog_bite_reset 746.250s 7924.653us 2 3 66.67
chip_sw_aon_timer_sleep_wdog_bite_reset 2 3 66.67
chip_sw_aon_timer_wdog_bite_reset 746.250s 7924.653us 2 3 66.67
chip_sw_aon_timer_sleep_wdog_sleep_pause 5 5 100.00
chip_sw_aon_timer_sleep_wdog_sleep_pause 543.970s 8101.164us 5 5 100.00
chip_sw_aon_timer_wdog_lc_escalate 3 3 100.00
chip_sw_aon_timer_wdog_lc_escalate 532.020s 5661.180us 3 3 100.00
chip_sw_clkmgr_idle_trans 12 12 100.00
chip_sw_otbn_randomness 826.000s 6247.156us 3 3 100.00
chip_sw_aes_idle 235.640s 2546.303us 3 3 100.00
chip_sw_hmac_enc_idle 316.150s 3764.466us 3 3 100.00
chip_sw_kmac_idle 255.410s 3548.547us 3 3 100.00
chip_sw_clkmgr_off_trans 12 12 100.00
chip_sw_clkmgr_off_aes_trans 473.230s 5193.526us 3 3 100.00
chip_sw_clkmgr_off_hmac_trans 503.280s 5455.617us 3 3 100.00
chip_sw_clkmgr_off_kmac_trans 434.220s 4462.099us 3 3 100.00
chip_sw_clkmgr_off_otbn_trans 411.720s 4560.957us 3 3 100.00
chip_sw_clkmgr_off_peri 3 3 100.00
chip_sw_clkmgr_off_peri 1323.610s 11033.915us 3 3 100.00
chip_sw_clkmgr_div 21 21 100.00
chip_sw_clkmgr_external_clk_src_for_sw_fast_test_unlocked0 530.360s 3831.712us 3 3 100.00
chip_sw_clkmgr_external_clk_src_for_sw_slow_test_unlocked0 478.420s 4543.362us 3 3 100.00
chip_sw_clkmgr_external_clk_src_for_sw_fast_dev 542.920s 4243.884us 3 3 100.00
chip_sw_clkmgr_external_clk_src_for_sw_slow_dev 520.620s 5638.148us 3 3 100.00
chip_sw_clkmgr_external_clk_src_for_sw_fast_rma 551.690s 4518.367us 3 3 100.00
chip_sw_clkmgr_external_clk_src_for_sw_slow_rma 565.930s 5368.796us 3 3 100.00
chip_sw_ast_clk_outputs 827.930s 8831.038us 3 3 100.00
chip_sw_clkmgr_external_clk_src_for_lc 2 3 66.67
chip_sw_clkmgr_external_clk_src_for_lc 1109.270s 26090.099us 2 3 66.67
chip_sw_clkmgr_external_clk_src_for_sw 6 6 100.00
chip_sw_clkmgr_external_clk_src_for_sw_fast_dev 542.920s 4243.884us 3 3 100.00
chip_sw_clkmgr_external_clk_src_for_sw_slow_dev 520.620s 5638.148us 3 3 100.00
chip_sw_clkmgr_jitter 30 30 100.00
chip_sw_flash_ctrl_ops_jitter_en 531.890s 4591.797us 3 3 100.00
chip_sw_flash_ctrl_access_jitter_en 835.200s 6454.089us 3 3 100.00
chip_sw_otbn_ecdsa_op_irq_jitter_en 4757.230s 18708.080us 3 3 100.00
chip_sw_aes_enc_jitter_en 275.360s 3015.131us 3 3 100.00
chip_sw_edn_entropy_reqs_jitter 926.240s 6268.344us 3 3 100.00
chip_sw_hmac_enc_jitter_en 229.480s 3196.065us 3 3 100.00
chip_sw_keymgr_key_derivation_jitter_en 2546.630s 12659.436us 3 3 100.00
chip_sw_kmac_mode_kmac_jitter_en 275.720s 3439.499us 3 3 100.00
chip_sw_sram_ctrl_scrambled_access_jitter_en 585.830s 5136.199us 3 3 100.00
chip_sw_clkmgr_jitter 241.440s 2655.436us 3 3 100.00
chip_sw_clkmgr_extended_range 30 33 90.91
chip_sw_clkmgr_jitter_reduced_freq 224.190s 3799.350us 3 3 100.00
chip_sw_flash_ctrl_ops_jitter_en_reduced_freq 548.860s 4646.361us 3 3 100.00
chip_sw_flash_ctrl_access_jitter_en_reduced_freq 908.870s 7714.353us 3 3 100.00
chip_sw_otbn_ecdsa_op_irq_jitter_en_reduced_freq 4869.120s 25276.506us 1 3 33.33
chip_sw_aes_enc_jitter_en_reduced_freq 251.650s 3730.574us 3 3 100.00
chip_sw_hmac_enc_jitter_en_reduced_freq 243.040s 3104.338us 3 3 100.00
chip_sw_keymgr_key_derivation_jitter_en_reduced_freq 1201.300s 10016.096us 3 3 100.00
chip_sw_kmac_mode_kmac_jitter_en_reduced_freq 285.950s 3649.377us 3 3 100.00
chip_sw_sram_ctrl_scrambled_access_jitter_en_reduced_freq 525.490s 5479.320us 3 3 100.00
chip_sw_flash_init_reduced_freq 1863.010s 22698.478us 3 3 100.00
chip_sw_csrng_edn_concurrency_reduced_freq 19808.650s 115629.634us 2 3 66.67
chip_sw_clkmgr_deep_sleep_frequency 3 3 100.00
chip_sw_ast_clk_outputs 827.930s 8831.038us 3 3 100.00
chip_sw_clkmgr_sleep_frequency 3 3 100.00
chip_sw_clkmgr_sleep_frequency 533.020s 5198.026us 3 3 100.00
chip_sw_clkmgr_reset_frequency 3 3 100.00
chip_sw_clkmgr_reset_frequency 358.750s 3340.908us 3 3 100.00
chip_sw_clkmgr_escalation_reset 95 100 95.00
chip_sw_all_escalation_resets 663.200s 6660.758us 95 100 95.00
chip_sw_clkmgr_alert_handler_clock_enables 3 3 100.00
chip_sw_alert_handler_lpg_clkoff 1389.800s 7448.907us 3 3 100.00
chip_sw_csrng_edn_cmd 3 3 100.00
chip_sw_entropy_src_csrng 3020.140s 24665.564us 3 3 100.00
chip_sw_csrng_fuse_en_sw_app_read 1 3 33.33
chip_sw_csrng_fuse_en_sw_app_read_test 379.270s 4545.688us 1 3 33.33
chip_sw_csrng_lc_hw_debug_en 3 3 100.00
chip_sw_csrng_lc_hw_debug_en_test 704.220s 7460.158us 3 3 100.00
chip_sw_csrng_known_answer_tests 3 3 100.00
chip_sw_csrng_kat_test 256.010s 2798.487us 3 3 100.00
chip_sw_edn_entropy_reqs 16 16 100.00
chip_sw_csrng_edn_concurrency 7500.190s 30017.870us 10 10 100.00
chip_sw_entropy_src_ast_rng_req 237.490s 2776.157us 3 3 100.00
chip_sw_edn_entropy_reqs 986.150s 6640.961us 3 3 100.00
chip_sw_entropy_src_ast_rng_req 3 3 100.00
chip_sw_entropy_src_ast_rng_req 237.490s 2776.157us 3 3 100.00
chip_sw_entropy_src_csrng 3 3 100.00
chip_sw_entropy_src_csrng 3020.140s 24665.564us 3 3 100.00
chip_sw_entropy_src_known_answer_tests 3 3 100.00
chip_sw_entropy_src_kat_test 239.750s 3451.869us 3 3 100.00
chip_sw_flash_init 3 3 100.00
chip_sw_flash_init 1904.060s 21467.372us 3 3 100.00
chip_sw_flash_host_access 6 6 100.00
chip_sw_flash_ctrl_access 824.300s 5998.367us 3 3 100.00
chip_sw_flash_ctrl_access_jitter_en 835.200s 6454.089us 3 3 100.00
chip_sw_flash_ctrl_ops 6 6 100.00
chip_sw_flash_ctrl_ops 530.890s 4899.021us 3 3 100.00
chip_sw_flash_ctrl_ops_jitter_en 531.890s 4591.797us 3 3 100.00
chip_sw_flash_rma_unlocked 2 3 66.67
chip_sw_flash_rma_unlocked 12000.177s 0.000us 2 3 66.67
chip_sw_flash_scramble 3 3 100.00
chip_sw_flash_init 1904.060s 21467.372us 3 3 100.00
chip_sw_flash_idle_low_power 3 3 100.00
chip_sw_flash_ctrl_idle_low_power 264.230s 3186.657us 3 3 100.00
chip_sw_flash_keymgr_seeds 3 3 100.00
chip_sw_keymgr_key_derivation 1930.560s 12073.469us 3 3 100.00
chip_sw_flash_lc_creator_seed_sw_rw_en 0 3 0.00
chip_sw_flash_ctrl_lc_rw_en 232.920s 3164.238us 0 3 0.00
chip_sw_flash_creator_seed_wipe_on_rma 2 3 66.67
chip_sw_flash_rma_unlocked 12000.177s 0.000us 2 3 66.67
chip_sw_flash_lc_owner_seed_sw_rw_en 0 3 0.00
chip_sw_flash_ctrl_lc_rw_en 232.920s 3164.238us 0 3 0.00
chip_sw_flash_lc_iso_part_sw_rd_en 0 3 0.00
chip_sw_flash_ctrl_lc_rw_en 232.920s 3164.238us 0 3 0.00
chip_sw_flash_lc_iso_part_sw_wr_en 0 3 0.00
chip_sw_flash_ctrl_lc_rw_en 232.920s 3164.238us 0 3 0.00
chip_sw_flash_lc_seed_hw_rd_en 0 3 0.00
chip_sw_flash_ctrl_lc_rw_en 232.920s 3164.238us 0 3 0.00
chip_sw_flash_lc_escalate_en 95 100 95.00
chip_sw_all_escalation_resets 663.200s 6660.758us 95 100 95.00
chip_sw_flash_prim_tl_access 3 3 100.00
chip_prim_tl_access 284.270s 7604.056us 3 3 100.00
chip_sw_flash_ctrl_clock_freqs 3 3 100.00
chip_sw_flash_ctrl_clock_freqs 680.400s 5259.241us 3 3 100.00
chip_sw_flash_ctrl_escalation_reset 3 3 100.00
chip_sw_flash_crash_alert 614.760s 6030.243us 3 3 100.00
chip_sw_flash_ctrl_write_clear 3 3 100.00
chip_sw_flash_crash_alert 614.760s 6030.243us 3 3 100.00
chip_sw_hmac_enc 6 6 100.00
chip_sw_hmac_enc 296.060s 3154.387us 3 3 100.00
chip_sw_hmac_enc_jitter_en 229.480s 3196.065us 3 3 100.00
chip_sw_hmac_idle 3 3 100.00
chip_sw_hmac_enc_idle 316.150s 3764.466us 3 3 100.00
chip_sw_hmac_all_configurations 0 3 0.00
chip_sw_hmac_oneshot 2234.720s 12018.474us 0 3 0.00
chip_sw_hmac_multistream_mode 0 3 0.00
chip_sw_hmac_multistream 2149.180s 12018.579us 0 3 0.00
chip_sw_i2c_host_tx_rx 9 9 100.00
chip_sw_i2c_host_tx_rx 643.540s 5590.203us 3 3 100.00
chip_sw_i2c_host_tx_rx_idx1 542.980s 5306.116us 3 3 100.00
chip_sw_i2c_host_tx_rx_idx2 643.790s 6020.294us 3 3 100.00
chip_sw_i2c_device_tx_rx 3 3 100.00
chip_sw_i2c_device_tx_rx 376.740s 3563.855us 3 3 100.00
chip_sw_keymgr_key_derivation 6 6 100.00
chip_sw_keymgr_key_derivation 1930.560s 12073.469us 3 3 100.00
chip_sw_keymgr_key_derivation_jitter_en 2546.630s 12659.436us 3 3 100.00
chip_sw_keymgr_sideload_kmac 3 3 100.00
chip_sw_keymgr_sideload_kmac 2206.970s 12334.562us 3 3 100.00
chip_sw_keymgr_sideload_aes 3 3 100.00
chip_sw_keymgr_sideload_aes 1870.440s 10875.579us 3 3 100.00
chip_sw_keymgr_sideload_otbn 2 3 66.67
chip_sw_keymgr_sideload_otbn 5074.840s 20026.743us 2 3 66.67
chip_sw_kmac_enc 9 9 100.00
chip_sw_kmac_mode_cshake 184.850s 2457.016us 3 3 100.00
chip_sw_kmac_mode_kmac 299.270s 2956.884us 3 3 100.00
chip_sw_kmac_mode_kmac_jitter_en 275.720s 3439.499us 3 3 100.00
chip_sw_kmac_app_keymgr 3 3 100.00
chip_sw_keymgr_key_derivation 1930.560s 12073.469us 3 3 100.00
chip_sw_kmac_app_lc 15 15 100.00
chip_sw_lc_ctrl_transition 1050.200s 13421.883us 15 15 100.00
chip_sw_kmac_app_rom 3 3 100.00
chip_sw_kmac_app_rom 260.510s 3070.290us 3 3 100.00
chip_sw_kmac_entropy 3 3 100.00
chip_sw_kmac_entropy 2088.440s 10854.367us 3 3 100.00
chip_sw_kmac_idle 3 3 100.00
chip_sw_kmac_idle 255.410s 3548.547us 3 3 100.00
chip_sw_lc_ctrl_alert_handler_escalation 3 3 100.00
chip_sw_alert_handler_escalation 536.710s 6466.419us 3 3 100.00
chip_sw_lc_ctrl_jtag_access 15 15 100.00
chip_tap_straps_dev 597.510s 8208.097us 5 5 100.00
chip_tap_straps_rma 618.950s 7513.769us 5 5 100.00
chip_tap_straps_prod 435.970s 5855.186us 5 5 100.00
chip_sw_lc_ctrl_otp_hw_cfg0 3 3 100.00
chip_sw_lc_ctrl_otp_hw_cfg0 198.790s 3017.041us 3 3 100.00
chip_sw_lc_ctrl_init 15 15 100.00
chip_sw_lc_ctrl_transition 1050.200s 13421.883us 15 15 100.00
chip_sw_lc_ctrl_transitions 15 15 100.00
chip_sw_lc_ctrl_transition 1050.200s 13421.883us 15 15 100.00
chip_sw_lc_ctrl_kmac_req 15 15 100.00
chip_sw_lc_ctrl_transition 1050.200s 13421.883us 15 15 100.00
chip_sw_lc_ctrl_key_div 3 3 100.00
chip_sw_keymgr_key_derivation_prod 1915.380s 11332.011us 3 3 100.00
chip_sw_lc_ctrl_broadcast 75 84 89.29
chip_sw_flash_ctrl_lc_rw_en 232.920s 3164.238us 0 3 0.00
chip_sw_flash_rma_unlocked 12000.177s 0.000us 2 3 66.67
chip_sw_otp_ctrl_lc_signals_test_unlocked0 311.320s 3924.462us 3 3 100.00
chip_sw_otp_ctrl_lc_signals_dev 769.850s 6891.946us 3 3 100.00
chip_sw_otp_ctrl_lc_signals_prod 700.740s 7280.527us 3 3 100.00
chip_sw_otp_ctrl_lc_signals_rma 593.360s 5558.259us 0 3 0.00
chip_sw_lc_ctrl_transition 1050.200s 13421.883us 15 15 100.00
chip_sw_keymgr_key_derivation 1930.560s 12073.469us 3 3 100.00
chip_sw_rom_ctrl_integrity_check 457.930s 9918.714us 3 3 100.00
chip_sw_sram_ctrl_execution_main 705.560s 9207.484us 3 3 100.00
chip_prim_tl_access 284.270s 7604.056us 3 3 100.00
chip_sw_clkmgr_external_clk_src_for_lc 1109.270s 26090.099us 2 3 66.67
chip_sw_clkmgr_external_clk_src_for_sw_fast_test_unlocked0 530.360s 3831.712us 3 3 100.00
chip_sw_clkmgr_external_clk_src_for_sw_slow_test_unlocked0 478.420s 4543.362us 3 3 100.00
chip_sw_clkmgr_external_clk_src_for_sw_fast_dev 542.920s 4243.884us 3 3 100.00
chip_sw_clkmgr_external_clk_src_for_sw_slow_dev 520.620s 5638.148us 3 3 100.00
chip_sw_clkmgr_external_clk_src_for_sw_fast_rma 551.690s 4518.367us 3 3 100.00
chip_sw_clkmgr_external_clk_src_for_sw_slow_rma 565.930s 5368.796us 3 3 100.00
chip_tap_straps_dev 597.510s 8208.097us 5 5 100.00
chip_tap_straps_rma 618.950s 7513.769us 5 5 100.00
chip_tap_straps_prod 435.970s 5855.186us 5 5 100.00
chip_rv_dm_lc_disabled 681.270s 17763.030us 2 3 66.67
chip_lc_scrap 5 6 83.33
chip_sw_lc_ctrl_rma_to_scrap 239.930s 3747.475us 1 1 100.00
chip_sw_lc_ctrl_raw_to_scrap 123.400s 3169.294us 1 1 100.00
chip_sw_lc_ctrl_test_locked0_to_scrap 104.120s 2573.127us 1 1 100.00
chip_sw_lc_ctrl_rand_to_scrap 2415.970s 27186.839us 2 3 66.67
chip_lc_test_locked 5 6 83.33
chip_sw_lc_walkthrough_testunlocks 2589.090s 32543.263us 3 3 100.00
chip_rv_dm_lc_disabled 681.270s 17763.030us 2 3 66.67
chip_sw_lc_walkthrough 6 15 40.00
chip_sw_lc_walkthrough_dev 927.240s 9936.824us 0 3 0.00
chip_sw_lc_walkthrough_prod 1545.280s 25395.934us 0 3 0.00
chip_sw_lc_walkthrough_prodend 942.380s 11164.389us 3 3 100.00
chip_sw_lc_walkthrough_rma 564.600s 6206.379us 0 3 0.00
chip_sw_lc_walkthrough_testunlocks 2589.090s 32543.263us 3 3 100.00
chip_sw_lc_ctrl_volatile_raw_unlock 6 9 66.67
chip_sw_lc_ctrl_volatile_raw_unlock 109.960s 2592.496us 3 3 100.00
chip_sw_lc_ctrl_volatile_raw_unlock_ext_clk_48mhz 92.940s 2629.579us 3 3 100.00
rom_volatile_raw_unlock 63.805s 0.000us 0 3 0.00
chip_sw_otbn_op 6 6 100.00
chip_sw_otbn_ecdsa_op_irq 4764.830s 17271.647us 3 3 100.00
chip_sw_otbn_ecdsa_op_irq_jitter_en 4757.230s 18708.080us 3 3 100.00
chip_sw_otbn_rnd_entropy 3 3 100.00
chip_sw_otbn_randomness 826.000s 6247.156us 3 3 100.00
chip_sw_otbn_urnd_entropy 3 3 100.00
chip_sw_otbn_randomness 826.000s 6247.156us 3 3 100.00
chip_sw_otbn_idle 3 3 100.00
chip_sw_otbn_randomness 826.000s 6247.156us 3 3 100.00
chip_sw_otbn_mem_scramble 3 3 100.00
chip_sw_otbn_mem_scramble 434.560s 3364.383us 3 3 100.00
chip_otp_ctrl_init 15 15 100.00
chip_sw_lc_ctrl_transition 1050.200s 13421.883us 15 15 100.00
chip_sw_otp_ctrl_keys 15 15 100.00
chip_sw_flash_init 1904.060s 21467.372us 3 3 100.00
chip_sw_otbn_mem_scramble 434.560s 3364.383us 3 3 100.00
chip_sw_keymgr_key_derivation 1930.560s 12073.469us 3 3 100.00
chip_sw_sram_ctrl_scrambled_access 468.350s 5133.210us 3 3 100.00
chip_sw_rv_core_ibex_icache_invalidate 228.150s 3048.106us 3 3 100.00
chip_sw_otp_ctrl_entropy 15 15 100.00
chip_sw_flash_init 1904.060s 21467.372us 3 3 100.00
chip_sw_otbn_mem_scramble 434.560s 3364.383us 3 3 100.00
chip_sw_keymgr_key_derivation 1930.560s 12073.469us 3 3 100.00
chip_sw_sram_ctrl_scrambled_access 468.350s 5133.210us 3 3 100.00
chip_sw_rv_core_ibex_icache_invalidate 228.150s 3048.106us 3 3 100.00
chip_sw_otp_ctrl_program 15 15 100.00
chip_sw_lc_ctrl_transition 1050.200s 13421.883us 15 15 100.00
chip_sw_otp_ctrl_program_error 3 3 100.00
chip_sw_lc_ctrl_program_error 563.170s 6181.129us 3 3 100.00
chip_sw_otp_ctrl_hw_cfg0 3 3 100.00
chip_sw_lc_ctrl_otp_hw_cfg0 198.790s 3017.041us 3 3 100.00
chip_sw_otp_ctrl_lc_signals 27 30 90.00
chip_sw_otp_ctrl_lc_signals_test_unlocked0 311.320s 3924.462us 3 3 100.00
chip_sw_otp_ctrl_lc_signals_dev 769.850s 6891.946us 3 3 100.00
chip_sw_otp_ctrl_lc_signals_prod 700.740s 7280.527us 3 3 100.00
chip_sw_otp_ctrl_lc_signals_rma 593.360s 5558.259us 0 3 0.00
chip_sw_lc_ctrl_transition 1050.200s 13421.883us 15 15 100.00
chip_prim_tl_access 284.270s 7604.056us 3 3 100.00
chip_sw_otp_prim_tl_access 3 3 100.00
chip_prim_tl_access 284.270s 7604.056us 3 3 100.00
chip_sw_otp_ctrl_dai_lock 1 1 100.00
chip_sw_otp_ctrl_dai_lock 1101.030s 6721.873us 1 1 100.00
chip_sw_pwrmgr_external_full_reset 0 3 0.00
chip_sw_pwrmgr_full_aon_reset 290.540s 6172.325us 0 3 0.00
chip_sw_pwrmgr_random_sleep_all_wake_ups 3 3 100.00
chip_sw_pwrmgr_random_sleep_all_wake_ups 1502.500s 28342.541us 3 3 100.00
chip_sw_pwrmgr_normal_sleep_all_wake_ups 3 3 100.00
chip_sw_pwrmgr_normal_sleep_all_wake_ups 337.130s 7118.902us 3 3 100.00
chip_sw_pwrmgr_deep_sleep_por_reset 0 3 0.00
chip_sw_pwrmgr_deep_sleep_por_reset 508.160s 7856.144us 0 3 0.00
chip_sw_pwrmgr_normal_sleep_por_reset 3 3 100.00
chip_sw_pwrmgr_normal_sleep_por_reset 661.140s 7516.770us 3 3 100.00
chip_sw_pwrmgr_deep_sleep_all_wake_ups 3 3 100.00
chip_sw_pwrmgr_deep_sleep_all_wake_ups 1445.930s 25134.915us 3 3 100.00
chip_sw_pwrmgr_deep_sleep_all_reset_reqs 3 6 50.00
chip_sw_pwrmgr_deep_sleep_all_reset_reqs 1105.660s 13140.745us 1 3 33.33
chip_sw_aon_timer_wdog_bite_reset 746.250s 7924.653us 2 3 66.67
chip_sw_pwrmgr_normal_sleep_all_reset_reqs 3 3 100.00
chip_sw_pwrmgr_normal_sleep_all_reset_reqs 1530.150s 15135.258us 3 3 100.00
chip_sw_pwrmgr_wdog_reset 3 3 100.00
chip_sw_pwrmgr_wdog_reset 426.810s 4434.802us 3 3 100.00
chip_sw_pwrmgr_aon_power_glitch_reset 0 3 0.00
chip_sw_pwrmgr_full_aon_reset 290.540s 6172.325us 0 3 0.00
chip_sw_pwrmgr_main_power_glitch_reset 3 3 100.00
chip_sw_pwrmgr_main_power_glitch_reset 422.090s 4469.911us 3 3 100.00
chip_sw_pwrmgr_random_sleep_power_glitch_reset 0 3 0.00
chip_sw_pwrmgr_random_sleep_power_glitch_reset 2487.840s 23561.179us 0 3 0.00
chip_sw_pwrmgr_deep_sleep_power_glitch_reset 3 3 100.00
chip_sw_pwrmgr_deep_sleep_power_glitch_reset 509.890s 7198.346us 3 3 100.00
chip_sw_pwrmgr_sleep_power_glitch_reset 0 3 0.00
chip_sw_pwrmgr_sleep_power_glitch_reset 232.290s 3092.238us 0 3 0.00
chip_sw_pwrmgr_random_sleep_all_reset_reqs 1 3 33.33
chip_sw_pwrmgr_random_sleep_all_reset_reqs 1828.900s 22309.312us 1 3 33.33
chip_sw_pwrmgr_sysrst_ctrl_reset 6 6 100.00
chip_sw_pwrmgr_sysrst_ctrl_reset 917.680s 7751.383us 3 3 100.00
chip_sw_pwrmgr_all_reset_reqs 1583.590s 14514.459us 3 3 100.00
chip_sw_pwrmgr_b2b_sleep_reset_req 3 3 100.00
chip_sw_pwrmgr_b2b_sleep_reset_req 2315.380s 26138.977us 3 3 100.00
chip_sw_pwrmgr_sleep_disabled 3 3 100.00
chip_sw_pwrmgr_sleep_disabled 223.810s 3173.985us 3 3 100.00
chip_sw_pwrmgr_escalation_reset 95 100 95.00
chip_sw_all_escalation_resets 663.200s 6660.758us 95 100 95.00
chip_sw_rom_access 3 3 100.00
chip_sw_rom_ctrl_integrity_check 457.930s 9918.714us 3 3 100.00
chip_sw_rom_ctrl_integrity_check 3 3 100.00
chip_sw_rom_ctrl_integrity_check 457.930s 9918.714us 3 3 100.00
chip_sw_rstmgr_non_sys_reset_info 10 12 83.33
chip_sw_pwrmgr_all_reset_reqs 1583.590s 14514.459us 3 3 100.00
chip_sw_pwrmgr_random_sleep_all_reset_reqs 1828.900s 22309.312us 1 3 33.33
chip_sw_pwrmgr_wdog_reset 426.810s 4434.802us 3 3 100.00
chip_sw_pwrmgr_smoketest 458.540s 6863.324us 3 3 100.00
chip_sw_rstmgr_sys_reset_info 3 3 100.00
chip_rv_dm_ndm_reset_req 409.490s 4401.687us 3 3 100.00
chip_sw_rstmgr_cpu_info 3 3 100.00
chip_sw_rstmgr_cpu_info 642.020s 7119.505us 3 3 100.00
chip_sw_rstmgr_sw_req_reset 3 3 100.00
chip_sw_rstmgr_sw_req 415.180s 4703.226us 3 3 100.00
chip_sw_rstmgr_alert_info 3 3 100.00
chip_sw_rstmgr_alert_info 1700.690s 14207.375us 3 3 100.00
chip_sw_rstmgr_sw_rst 3 3 100.00
chip_sw_rstmgr_sw_rst 201.540s 3706.974us 3 3 100.00
chip_sw_rstmgr_escalation_reset 95 100 95.00
chip_sw_all_escalation_resets 663.200s 6660.758us 95 100 95.00
chip_sw_rstmgr_alert_handler_reset_enables 3 3 100.00
chip_sw_alert_handler_lpg_reset_toggle 1280.450s 7162.785us 3 3 100.00
chip_sw_nmi_irq 3 3 100.00
chip_sw_rv_core_ibex_nmi_irq 619.470s 4703.252us 3 3 100.00
chip_sw_rv_core_ibex_rnd 3 3 100.00
chip_sw_rv_core_ibex_rnd 637.120s 5119.676us 3 3 100.00
chip_sw_rv_core_ibex_address_translation 3 3 100.00
chip_sw_rv_core_ibex_address_translation 271.960s 3894.459us 3 3 100.00
chip_sw_rv_core_ibex_icache_scrambled_access 3 3 100.00
chip_sw_rv_core_ibex_icache_invalidate 228.150s 3048.106us 3 3 100.00
chip_sw_rv_core_ibex_fault_dump 3 3 100.00
chip_sw_rstmgr_cpu_info 642.020s 7119.505us 3 3 100.00
chip_sw_rv_core_ibex_double_fault 3 3 100.00
chip_sw_rstmgr_cpu_info 642.020s 7119.505us 3 3 100.00
chip_jtag_csr_rw 3 3 100.00
chip_jtag_csr_rw 1817.280s 18466.009us 3 3 100.00
chip_jtag_mem_access 3 3 100.00
chip_jtag_mem_access 1304.520s 14258.032us 3 3 100.00
chip_rv_dm_ndm_reset_req 3 3 100.00
chip_rv_dm_ndm_reset_req 409.490s 4401.687us 3 3 100.00
chip_sw_rv_dm_ndm_reset_req_when_cpu_halted 0 3 0.00
chip_sw_rv_dm_ndm_reset_req_when_cpu_halted 310.000s 4007.323us 0 3 0.00
chip_rv_dm_access_after_wakeup 3 3 100.00
chip_sw_rv_dm_access_after_wakeup 446.200s 5960.859us 3 3 100.00
chip_sw_rv_dm_jtag_tap_sel 5 5 100.00
chip_tap_straps_rma 618.950s 7513.769us 5 5 100.00
chip_rv_dm_lc_disabled 2 3 66.67
chip_rv_dm_lc_disabled 681.270s 17763.030us 2 3 66.67
chip_sw_plic_all_irqs 9 9 100.00
chip_plic_all_irqs_0 771.380s 5703.165us 3 3 100.00
chip_plic_all_irqs_10 413.700s 3936.049us 3 3 100.00
chip_plic_all_irqs_20 534.890s 4411.941us 3 3 100.00
chip_sw_plic_sw_irq 3 3 100.00
chip_sw_plic_sw_irq 225.290s 3348.677us 3 3 100.00
chip_sw_timer 3 3 100.00
chip_sw_rv_timer_irq 302.300s 3295.881us 3 3 100.00
chip_sw_spi_device_flash_mode 3 3 100.00
rom_e2e_smoke 3850.050s 15855.490us 3 3 100.00
chip_sw_spi_device_pass_through 3 3 100.00
chip_sw_spi_device_pass_through 315.310s 3444.075us 3 3 100.00
chip_sw_spi_device_pass_through_collision 0 3 0.00
chip_sw_spi_device_pass_through_collision 266.210s 3662.640us 0 3 0.00
chip_sw_spi_device_tpm 3 3 100.00
chip_sw_spi_device_tpm 350.240s 3913.768us 3 3 100.00
chip_sw_spi_host_tx_rx 3 3 100.00
chip_sw_spi_host_tx_rx 273.640s 2618.426us 3 3 100.00
chip_sw_sram_scrambled_access 6 6 100.00
chip_sw_sram_ctrl_scrambled_access 468.350s 5133.210us 3 3 100.00
chip_sw_sram_ctrl_scrambled_access_jitter_en 585.830s 5136.199us 3 3 100.00
chip_sw_sleep_sram_ret_contents 6 6 100.00
chip_sw_sleep_sram_ret_contents_no_scramble 706.710s 8354.916us 3 3 100.00
chip_sw_sleep_sram_ret_contents_scramble 593.970s 8808.612us 3 3 100.00
chip_sw_sram_execution 3 3 100.00
chip_sw_sram_ctrl_execution_main 705.560s 9207.484us 3 3 100.00
chip_sw_sram_lc_escalation 101 106 95.28
chip_sw_all_escalation_resets 663.200s 6660.758us 95 100 95.00
chip_sw_data_integrity_escalation 629.730s 6385.337us 6 6 100.00
chip_sw_sysrst_ctrl_reset 5 6 83.33
chip_sw_pwrmgr_sysrst_ctrl_reset 917.680s 7751.383us 3 3 100.00
chip_sw_sysrst_ctrl_reset 1409.440s 24190.243us 2 3 66.67
chip_sw_sysrst_ctrl_inputs 3 3 100.00
chip_sw_sysrst_ctrl_inputs 258.170s 2798.346us 3 3 100.00
chip_sw_sysrst_ctrl_outputs 3 3 100.00
chip_sw_sysrst_ctrl_outputs 305.610s 3501.404us 3 3 100.00
chip_sw_sysrst_ctrl_in_irq 3 3 100.00
chip_sw_sysrst_ctrl_in_irq 481.240s 5385.092us 3 3 100.00
chip_sw_sysrst_ctrl_sleep_wakeup 2 3 66.67
chip_sw_sysrst_ctrl_reset 1409.440s 24190.243us 2 3 66.67
chip_sw_sysrst_ctrl_sleep_reset 2 3 66.67
chip_sw_sysrst_ctrl_reset 1409.440s 24190.243us 2 3 66.67
chip_sw_sysrst_ctrl_ec_rst_l 3 3 100.00
chip_sw_sysrst_ctrl_ec_rst_l 3137.540s 20165.011us 3 3 100.00
chip_sw_sysrst_ctrl_flash_wp_l 3 3 100.00
chip_sw_sysrst_ctrl_ec_rst_l 3137.540s 20165.011us 3 3 100.00
chip_sw_sysrst_ctrl_ulp_z3_wakeup 3 6 50.00
chip_sw_sysrst_ctrl_ulp_z3_wakeup 404.330s 5968.935us 3 3 100.00
chip_sw_adc_ctrl_sleep_debug_cable_wakeup 3600.304s 0.000us 0 3 0.00
chip_sw_usbdev_vbus 1 1 100.00
chip_sw_usbdev_vbus 209.200s 3152.315us 1 1 100.00
chip_sw_usbdev_pullup 1 1 100.00
chip_sw_usbdev_pullup 233.230s 3367.458us 1 1 100.00
chip_sw_usbdev_aon_pullup 1 1 100.00
chip_sw_usbdev_aon_pullup 323.850s 3994.977us 1 1 100.00
chip_sw_usbdev_setup_rx 1 1 100.00
chip_sw_usbdev_setuprx 438.550s 4171.175us 1 1 100.00
chip_sw_usbdev_config_host 1 1 100.00
chip_sw_usbdev_config_host 1329.540s 8323.821us 1 1 100.00
chip_sw_usbdev_pincfg 1 1 100.00
chip_sw_usbdev_pincfg 6637.130s 32305.280us 1 1 100.00
chip_sw_usbdev_tx_rx 1 1 100.00
chip_sw_usbdev_dpi 2382.470s 11876.169us 1 1 100.00
chip_sw_usbdev_toggle_restore 1 1 100.00
chip_sw_usbdev_toggle_restore 179.290s 2683.781us 1 1 100.00
Testpoint Test Max Runtime Sim Time Pass Total %
chip_sw_aes_masking_off 3 3 100.00
chip_sw_aes_masking_off 296.790s 3757.788us 3 3 100.00
chip_sw_rv_core_ibex_lockstep_glitch 3 3 100.00
chip_sw_rv_core_ibex_lockstep_glitch 223.670s 3244.977us 3 3 100.00
Testpoint Test Max Runtime Sim Time Pass Total %
chip_sw_coremark 1 1 100.00
chip_sw_coremark 16697.640s 71772.503us 1 1 100.00
chip_sw_power_max_load 3 3 100.00
chip_sw_power_virus 1442.340s 6413.011us 3 3 100.00
rom_e2e_debug 0 3 0.00
rom_e2e_jtag_debug_test_unlocked0 294.220s 4020.654us 0 1 0.00
rom_e2e_jtag_debug_dev 884.710s 14629.960us 0 1 0.00
rom_e2e_jtag_debug_rma 724.860s 7320.987us 0 1 0.00
rom_e2e_jtag_inject 1 3 33.33
rom_e2e_jtag_inject_test_unlocked0 66.950s 2049.814us 0 1 0.00
rom_e2e_jtag_inject_dev 280.940s 3828.264us 1 1 100.00
rom_e2e_jtag_inject_rma 82.620s 1881.623us 0 1 0.00
rom_e2e_self_hash 0 3 0.00
rom_e2e_self_hash 153.710s 0.000us 0 3 0.00
chip_sw_clkmgr_jitter_cycle_measurements 0 3 0.00
chip_sw_clkmgr_jitter_frequency 395.490s 4073.302us 0 3 0.00
chip_sw_edn_boot_mode 3 3 100.00
chip_sw_edn_boot_mode 529.950s 2812.191us 3 3 100.00
chip_sw_edn_auto_mode 3 3 100.00
chip_sw_edn_auto_mode 1290.930s 6276.773us 3 3 100.00
chip_sw_edn_sw_mode 3 3 100.00
chip_sw_edn_sw_mode 1537.690s 8957.140us 3 3 100.00
chip_sw_edn_kat 3 3 100.00
chip_sw_edn_kat 324.150s 2414.367us 3 3 100.00
chip_sw_flash_memory_protection 3 3 100.00
chip_sw_flash_ctrl_mem_protection 833.180s 5629.895us 3 3 100.00
chip_sw_otp_ctrl_vendor_test_csr_access 3 3 100.00
chip_sw_otp_ctrl_vendor_test_csr_access 191.930s 3413.438us 3 3 100.00
chip_sw_otp_ctrl_escalation 0 1 0.00
chip_sw_otp_ctrl_escalation 265.840s 3435.074us 0 1 0.00
chip_sw_sensor_ctrl_deep_sleep_wake_up 3 3 100.00
chip_sw_pwrmgr_sensor_ctrl_deep_sleep_wake_up 440.200s 6451.216us 3 3 100.00
chip_sw_pwrmgr_usb_clk_disabled_when_active 3 3 100.00
chip_sw_pwrmgr_usb_clk_disabled_when_active 435.180s 6217.555us 3 3 100.00
chip_sw_all_resets 3 3 100.00
chip_sw_pwrmgr_all_reset_reqs 1583.590s 14514.459us 3 3 100.00
chip_rv_dm_perform_debug 0 3 0.00
rom_e2e_jtag_debug_test_unlocked0 294.220s 4020.654us 0 1 0.00
rom_e2e_jtag_debug_dev 884.710s 14629.960us 0 1 0.00
rom_e2e_jtag_debug_rma 724.860s 7320.987us 0 1 0.00
chip_sw_rv_dm_access_after_hw_reset 3 3 100.00
chip_sw_rv_dm_access_after_escalation_reset 438.690s 5604.989us 3 3 100.00
chip_sw_plic_alerts 95 100 95.00
chip_sw_all_escalation_resets 663.200s 6660.758us 95 100 95.00
tick_configuration 0 3 0.00
chip_sw_rv_timer_systick_test 7200.178s 0.000us 0 3 0.00
counter_wrap 0 3 0.00
chip_sw_rv_timer_systick_test 7200.178s 0.000us 0 3 0.00
chip_sw_spi_device_output_when_disabled_or_sleeping 3 3 100.00
chip_sw_spi_device_pinmux_sleep_retention 232.630s 3716.712us 3 3 100.00
chip_sw_uart_watermarks 5 5 100.00
chip_sw_uart_tx_rx 523.270s 4881.758us 5 5 100.00
chip_sw_usbdev_stream 1 1 100.00
chip_sw_usbdev_stream 4052.060s 19451.739us 1 1 100.00
Testpoint Test Max Runtime Sim Time Pass Total %
Unmapped 18 31 58.06
chip_sival_flash_info_access 304.180s 3378.499us 3 3 100.00
chip_sw_rstmgr_rst_cnsty_escalation 26.030s 10.360us 0 3 0.00
chip_sw_otp_ctrl_rot_auth_config 8.810s 0.000us 0 1 0.00
chip_sw_otp_ctrl_ecc_error_vendor_test 246.160s 3421.693us 3 3 100.00
chip_sw_otp_ctrl_descrambling 316.030s 3244.517us 3 3 100.00
chip_sw_pwrmgr_lowpower_cancel 379.760s 4215.347us 3 3 100.00
chip_sw_pwrmgr_sleep_wake_5_bug 13.042s 0.000us 0 3 0.00
chip_sw_flash_ctrl_write_clear 286.030s 3329.612us 3 3 100.00
ate_bootstrap_flash_erase 816.940s 10010.120us 0 3 0.00
ate_bootstrap_one_frame 9991.870s 44850.001us 3 3 100.00
ate_bootstrap_disjoint 10800.179s 0.000us 0 3 0.00

Error Messages

   Test seed line log context
UVM_ERROR @ * us: (sw_logger_if.sv:526) [alert_handler_lpg_sleep_mode_alerts_test_sim_dv(sw/device/lib/testing/ret_sram_testutils.c:67)] CHECK-fail: testing_utilities != ((void*)0) 90 test runs
chip_sw_alert_handler_lpg_sleep_mode_alerts 33811504324288734311712883025139647170606426461431575239895309165410617897239 308
UVM_INFO @ 2405.939068 us: (uvm_report_catcher.svh:705) [UVM/REPORT/CATCHER]
--- UVM Report catcher Summary ---
chip_sw_alert_handler_lpg_sleep_mode_alerts 59839221010297261997702543227575173450124421100256267174189199237084569263710 308
UVM_INFO @ 2757.726514 us: (uvm_report_catcher.svh:705) [UVM/REPORT/CATCHER]
--- UVM Report catcher Summary ---
chip_sw_alert_handler_lpg_sleep_mode_alerts 14891530511011877517207701628774994072145598476652773265718723874385826305520 308
UVM_INFO @ 3780.825308 us: (uvm_report_catcher.svh:705) [UVM/REPORT/CATCHER]
--- UVM Report catcher Summary ---
chip_sw_alert_handler_lpg_sleep_mode_alerts 107345570066500525527483797765330462422903956393749780035102572757316188200949 308
UVM_INFO @ 2096.544936 us: (uvm_report_catcher.svh:705) [UVM/REPORT/CATCHER]
--- UVM Report catcher Summary ---
chip_sw_alert_handler_lpg_sleep_mode_alerts 23843208675060300843756527772740855581930546008356306809095305221358197110924 308
UVM_INFO @ 3748.147407 us: (uvm_report_catcher.svh:705) [UVM/REPORT/CATCHER]
--- UVM Report catcher Summary ---
chip_sw_alert_handler_lpg_sleep_mode_alerts 83015601292368993305323396030055264562575246789350265193171548835586099495379 308
UVM_INFO @ 2605.446335 us: (uvm_report_catcher.svh:705) [UVM/REPORT/CATCHER]
--- UVM Report catcher Summary ---
chip_sw_alert_handler_lpg_sleep_mode_alerts 25285725487261146663297715117555187412377230891125429192370916446400983557413 308
UVM_INFO @ 3437.618432 us: (uvm_report_catcher.svh:705) [UVM/REPORT/CATCHER]
--- UVM Report catcher Summary ---
chip_sw_alert_handler_lpg_sleep_mode_alerts 42629201373046186590785501092857960528896840861181843520853747581145623536282 308
UVM_INFO @ 3211.570174 us: (uvm_report_catcher.svh:705) [UVM/REPORT/CATCHER]
--- UVM Report catcher Summary ---
chip_sw_alert_handler_lpg_sleep_mode_alerts 4379784787672306188033987667511378300168721892465185913410147883421899998638 308
UVM_INFO @ 2637.919822 us: (uvm_report_catcher.svh:705) [UVM/REPORT/CATCHER]
--- UVM Report catcher Summary ---
chip_sw_alert_handler_lpg_sleep_mode_alerts 49339931775414457884588892464037877404195069568678888514028403032178011404901 308
UVM_INFO @ 3632.614978 us: (uvm_report_catcher.svh:705) [UVM/REPORT/CATCHER]
--- UVM Report catcher Summary ---
chip_sw_alert_handler_lpg_sleep_mode_alerts 3312888369976107871335058926945115692290878730849009456175280575988066554022 308
UVM_INFO @ 3190.813000 us: (uvm_report_catcher.svh:705) [UVM/REPORT/CATCHER]
--- UVM Report catcher Summary ---
chip_sw_alert_handler_lpg_sleep_mode_alerts 95530805184046623874831284859352840983910072585597855289551906911494751319525 308
UVM_INFO @ 3069.990993 us: (uvm_report_catcher.svh:705) [UVM/REPORT/CATCHER]
--- UVM Report catcher Summary ---
chip_sw_alert_handler_lpg_sleep_mode_alerts 49646688288206183191330679848097219572489854593146808725656363683748078509152 308
UVM_INFO @ 2647.245996 us: (uvm_report_catcher.svh:705) [UVM/REPORT/CATCHER]
--- UVM Report catcher Summary ---
chip_sw_alert_handler_lpg_sleep_mode_alerts 80843851181115445870273506477831873988337098070910180067332195485793275210550 308
UVM_INFO @ 3734.149160 us: (uvm_report_catcher.svh:705) [UVM/REPORT/CATCHER]
--- UVM Report catcher Summary ---
chip_sw_alert_handler_lpg_sleep_mode_alerts 97173824750771088191910823120492024546879887587622300107254126169042820719004 308
UVM_INFO @ 2843.892570 us: (uvm_report_catcher.svh:705) [UVM/REPORT/CATCHER]
--- UVM Report catcher Summary ---
chip_sw_alert_handler_lpg_sleep_mode_alerts 106148408611942416173282167646813840238760580129635278028086795518564674964191 308
UVM_INFO @ 3158.286984 us: (uvm_report_catcher.svh:705) [UVM/REPORT/CATCHER]
--- UVM Report catcher Summary ---
chip_sw_alert_handler_lpg_sleep_mode_alerts 44408433374284690664455012053294432527450273425246066265609610402299307626017 308
UVM_INFO @ 2859.542064 us: (uvm_report_catcher.svh:705) [UVM/REPORT/CATCHER]
--- UVM Report catcher Summary ---
chip_sw_alert_handler_lpg_sleep_mode_alerts 52090198440741772056171296277677520536888802719818911641240149485776004173439 308
UVM_INFO @ 3273.612373 us: (uvm_report_catcher.svh:705) [UVM/REPORT/CATCHER]
--- UVM Report catcher Summary ---
chip_sw_alert_handler_lpg_sleep_mode_alerts 3664686225019195002991027929632836363488175008483176622810018415761168361437 308
UVM_INFO @ 2747.189144 us: (uvm_report_catcher.svh:705) [UVM/REPORT/CATCHER]
--- UVM Report catcher Summary ---
chip_sw_alert_handler_lpg_sleep_mode_alerts 98066249984076598013868165050228710097018296926742712321861161686171817777849 308
UVM_INFO @ 2415.158880 us: (uvm_report_catcher.svh:705) [UVM/REPORT/CATCHER]
--- UVM Report catcher Summary ---
chip_sw_alert_handler_lpg_sleep_mode_alerts 57411966306830707167405779154083868942788659903636405198230418946724755238246 308
UVM_INFO @ 3227.605064 us: (uvm_report_catcher.svh:705) [UVM/REPORT/CATCHER]
--- UVM Report catcher Summary ---
chip_sw_alert_handler_lpg_sleep_mode_alerts 48691426519295881661650169792761991120651311539514078859769290769949134762434 308
UVM_INFO @ 3495.290510 us: (uvm_report_catcher.svh:705) [UVM/REPORT/CATCHER]
--- UVM Report catcher Summary ---
chip_sw_alert_handler_lpg_sleep_mode_alerts 90030960562925060661885358424728245671122106631340210478341744354728045919955 308
UVM_INFO @ 2716.965784 us: (uvm_report_catcher.svh:705) [UVM/REPORT/CATCHER]
--- UVM Report catcher Summary ---
chip_sw_alert_handler_lpg_sleep_mode_alerts 69743533818986622503705697588089125807325661550020910021747414435872231893746 308
UVM_INFO @ 2620.486670 us: (uvm_report_catcher.svh:705) [UVM/REPORT/CATCHER]
--- UVM Report catcher Summary ---
chip_sw_alert_handler_lpg_sleep_mode_alerts 73499793180560325544621911443317650660570188292985219662121141876777339061068 308
UVM_INFO @ 3194.052256 us: (uvm_report_catcher.svh:705) [UVM/REPORT/CATCHER]
--- UVM Report catcher Summary ---
chip_sw_alert_handler_lpg_sleep_mode_alerts 62836884425875997113807387870290442549024966480804347473916458535081637911505 308
UVM_INFO @ 2975.830055 us: (uvm_report_catcher.svh:705) [UVM/REPORT/CATCHER]
--- UVM Report catcher Summary ---
chip_sw_alert_handler_lpg_sleep_mode_alerts 111108058431260023354971733284746381729908740651035132510138607145634838704322 308
UVM_INFO @ 2357.277440 us: (uvm_report_catcher.svh:705) [UVM/REPORT/CATCHER]
--- UVM Report catcher Summary ---
chip_sw_alert_handler_lpg_sleep_mode_alerts 15219726755568878176250300997657781628925324392122857377855222346292174921961 308
UVM_INFO @ 2446.337440 us: (uvm_report_catcher.svh:705) [UVM/REPORT/CATCHER]
--- UVM Report catcher Summary ---
chip_sw_alert_handler_lpg_sleep_mode_alerts 18877749428147796577680081285722009800997515101987945841449535528775065804227 308
UVM_INFO @ 3004.985080 us: (uvm_report_catcher.svh:705) [UVM/REPORT/CATCHER]
--- UVM Report catcher Summary ---
chip_sw_alert_handler_lpg_sleep_mode_alerts 87867483602551419243451347289940108268333598742103379779949848019071426442330 308
UVM_INFO @ 3483.479958 us: (uvm_report_catcher.svh:705) [UVM/REPORT/CATCHER]
--- UVM Report catcher Summary ---
chip_sw_alert_handler_lpg_sleep_mode_alerts 2717238280920248963694327252026859825418694287942689394031847995561708364095 308
UVM_INFO @ 2693.412587 us: (uvm_report_catcher.svh:705) [UVM/REPORT/CATCHER]
--- UVM Report catcher Summary ---
chip_sw_alert_handler_lpg_sleep_mode_alerts 115170177210481694864306932506645942275205757262910539343275465781615152526240 308
UVM_INFO @ 2857.575096 us: (uvm_report_catcher.svh:705) [UVM/REPORT/CATCHER]
--- UVM Report catcher Summary ---
chip_sw_alert_handler_lpg_sleep_mode_alerts 86021841031082644562693702884975462192907211038117136803722163414772631528129 308
UVM_INFO @ 3293.344060 us: (uvm_report_catcher.svh:705) [UVM/REPORT/CATCHER]
--- UVM Report catcher Summary ---
chip_sw_alert_handler_lpg_sleep_mode_alerts 65792443260636743903489501983611348873930609185845852732756872738089057765877 308
UVM_INFO @ 2773.128933 us: (uvm_report_catcher.svh:705) [UVM/REPORT/CATCHER]
--- UVM Report catcher Summary ---
chip_sw_alert_handler_lpg_sleep_mode_alerts 51016861546259894405546614740231854657019142130317700191090418910043805557844 308
UVM_INFO @ 3386.380225 us: (uvm_report_catcher.svh:705) [UVM/REPORT/CATCHER]
--- UVM Report catcher Summary ---
chip_sw_alert_handler_lpg_sleep_mode_alerts 42440770631556468315700642904361139491941928449335826733672574954940009873286 308
UVM_INFO @ 2610.980392 us: (uvm_report_catcher.svh:705) [UVM/REPORT/CATCHER]
--- UVM Report catcher Summary ---
chip_sw_alert_handler_lpg_sleep_mode_alerts 89002945838219284285789603497710873279010241346799216435013003344546912241261 308
UVM_INFO @ 3198.721052 us: (uvm_report_catcher.svh:705) [UVM/REPORT/CATCHER]
--- UVM Report catcher Summary ---
chip_sw_alert_handler_lpg_sleep_mode_alerts 81144002172148389999703067028363820230836340033230144841634976319361840049182 308
UVM_INFO @ 2855.460168 us: (uvm_report_catcher.svh:705) [UVM/REPORT/CATCHER]
--- UVM Report catcher Summary ---
chip_sw_alert_handler_lpg_sleep_mode_alerts 20936221390447531799432769755009357584565426267473921632924069341244202829818 308
UVM_INFO @ 3213.257530 us: (uvm_report_catcher.svh:705) [UVM/REPORT/CATCHER]
--- UVM Report catcher Summary ---
chip_sw_alert_handler_lpg_sleep_mode_alerts 84677959291523359402929215026067517285005807294598300463875822343683549057791 308
UVM_INFO @ 2712.678875 us: (uvm_report_catcher.svh:705) [UVM/REPORT/CATCHER]
--- UVM Report catcher Summary ---
chip_sw_alert_handler_lpg_sleep_mode_alerts 41927534976279397750798350880260679305979921973666367061824113728633814118650 308
UVM_INFO @ 2886.356695 us: (uvm_report_catcher.svh:705) [UVM/REPORT/CATCHER]
--- UVM Report catcher Summary ---
chip_sw_alert_handler_lpg_sleep_mode_alerts 73331674455092454889401038101990664520526251804962156576893770323807087051460 308
UVM_INFO @ 3449.065388 us: (uvm_report_catcher.svh:705) [UVM/REPORT/CATCHER]
--- UVM Report catcher Summary ---
chip_sw_alert_handler_lpg_sleep_mode_alerts 37102311409885861603262018074217818827767799267088004837915198431371998016553 308
UVM_INFO @ 3275.410940 us: (uvm_report_catcher.svh:705) [UVM/REPORT/CATCHER]
--- UVM Report catcher Summary ---
chip_sw_alert_handler_lpg_sleep_mode_alerts 22835200354045184542691498983305940922322119561059823055579375379105719118046 308
UVM_INFO @ 2900.191948 us: (uvm_report_catcher.svh:705) [UVM/REPORT/CATCHER]
--- UVM Report catcher Summary ---
chip_sw_alert_handler_lpg_sleep_mode_alerts 80480144188233460259358300456034709596997995751251012023037738481085092191810 308
UVM_INFO @ 3565.289536 us: (uvm_report_catcher.svh:705) [UVM/REPORT/CATCHER]
--- UVM Report catcher Summary ---
chip_sw_alert_handler_lpg_sleep_mode_alerts 99997238220754252262253071925375509626774560034845612764444207040928929159206 308
UVM_INFO @ 3081.064732 us: (uvm_report_catcher.svh:705) [UVM/REPORT/CATCHER]
--- UVM Report catcher Summary ---
chip_sw_alert_handler_lpg_sleep_mode_alerts 42098244154981893089033134178787973923173387111291448850244602598677442268936 308
UVM_INFO @ 2601.178324 us: (uvm_report_catcher.svh:705) [UVM/REPORT/CATCHER]
--- UVM Report catcher Summary ---
chip_sw_alert_handler_lpg_sleep_mode_alerts 108137354628199056639493731418121181209848358916505634448423613174354178262599 308
UVM_INFO @ 3005.344698 us: (uvm_report_catcher.svh:705) [UVM/REPORT/CATCHER]
--- UVM Report catcher Summary ---
chip_sw_alert_handler_lpg_sleep_mode_alerts 103247565210882997772449621780940261023688428900134344840255032560890035582859 308
UVM_INFO @ 2780.787232 us: (uvm_report_catcher.svh:705) [UVM/REPORT/CATCHER]
--- UVM Report catcher Summary ---
chip_sw_alert_handler_lpg_sleep_mode_alerts 65573700053836439190815717226778556567288842896901234061653095928765852700477 308
UVM_INFO @ 2740.842090 us: (uvm_report_catcher.svh:705) [UVM/REPORT/CATCHER]
--- UVM Report catcher Summary ---
chip_sw_alert_handler_lpg_sleep_mode_alerts 99078351890946171849131046492317711205038642595428209719714567333738663962937 308
UVM_INFO @ 3880.522564 us: (uvm_report_catcher.svh:705) [UVM/REPORT/CATCHER]
--- UVM Report catcher Summary ---
chip_sw_alert_handler_lpg_sleep_mode_alerts 47627116062582706450277137295967514732330273703569804395447433654244009196875 308
UVM_INFO @ 3175.915688 us: (uvm_report_catcher.svh:705) [UVM/REPORT/CATCHER]
--- UVM Report catcher Summary ---
chip_sw_alert_handler_lpg_sleep_mode_alerts 47757919728648460835331390659631327888380451686703246295975553205103939487649 308
UVM_INFO @ 2793.127591 us: (uvm_report_catcher.svh:705) [UVM/REPORT/CATCHER]
--- UVM Report catcher Summary ---
chip_sw_alert_handler_lpg_sleep_mode_alerts 21327775567055976323579962400484483623555141253903399298571630602221716462072 308
UVM_INFO @ 2565.865787 us: (uvm_report_catcher.svh:705) [UVM/REPORT/CATCHER]
--- UVM Report catcher Summary ---
chip_sw_alert_handler_lpg_sleep_mode_alerts 98777754716209330536983661076954585318429863069855932472191420818117572695052 308
UVM_INFO @ 2870.603468 us: (uvm_report_catcher.svh:705) [UVM/REPORT/CATCHER]
--- UVM Report catcher Summary ---
chip_sw_alert_handler_lpg_sleep_mode_alerts 91379214574658583360570925939332440605678322392046638648730898763667390980722 308
UVM_INFO @ 2905.855360 us: (uvm_report_catcher.svh:705) [UVM/REPORT/CATCHER]
--- UVM Report catcher Summary ---
chip_sw_alert_handler_lpg_sleep_mode_alerts 5887987676637492799318247018985330220003300997101936052958936532141192256065 308
UVM_INFO @ 2623.340700 us: (uvm_report_catcher.svh:705) [UVM/REPORT/CATCHER]
--- UVM Report catcher Summary ---
chip_sw_alert_handler_lpg_sleep_mode_alerts 101443161525716277731879291425218114174901154087356586335431981369540789405516 308
UVM_INFO @ 2609.913272 us: (uvm_report_catcher.svh:705) [UVM/REPORT/CATCHER]
--- UVM Report catcher Summary ---
chip_sw_alert_handler_lpg_sleep_mode_alerts 99866565842902973129004963138864985300241483035726452308382050406883400878610 308
UVM_INFO @ 2758.958078 us: (uvm_report_catcher.svh:705) [UVM/REPORT/CATCHER]
--- UVM Report catcher Summary ---
chip_sw_alert_handler_lpg_sleep_mode_alerts 68911273956888951715004378614687110091095786780875173628668579561871321127836 308
UVM_INFO @ 3833.301576 us: (uvm_report_catcher.svh:705) [UVM/REPORT/CATCHER]
--- UVM Report catcher Summary ---
chip_sw_alert_handler_lpg_sleep_mode_alerts 43339660250471266985265338900398120569602538230947107856120347901854789431096 308
UVM_INFO @ 2711.900000 us: (uvm_report_catcher.svh:705) [UVM/REPORT/CATCHER]
--- UVM Report catcher Summary ---
chip_sw_alert_handler_lpg_sleep_mode_alerts 99688435860049516090157763602864385755588911431277468310640275359014131215208 308
UVM_INFO @ 2570.575517 us: (uvm_report_catcher.svh:705) [UVM/REPORT/CATCHER]
--- UVM Report catcher Summary ---
chip_sw_alert_handler_lpg_sleep_mode_alerts 72319069083012030809061318349874946997430910920208646514420882097265451503084 308
UVM_INFO @ 2918.062953 us: (uvm_report_catcher.svh:705) [UVM/REPORT/CATCHER]
--- UVM Report catcher Summary ---
chip_sw_alert_handler_lpg_sleep_mode_alerts 24170214097222194703567501960069519191640672489094030395898410809370227252087 308
UVM_INFO @ 3277.433662 us: (uvm_report_catcher.svh:705) [UVM/REPORT/CATCHER]
--- UVM Report catcher Summary ---
chip_sw_alert_handler_lpg_sleep_mode_alerts 56451672518884442990372449336377314855859423965465674058539087346171752270362 308
UVM_INFO @ 3228.903647 us: (uvm_report_catcher.svh:705) [UVM/REPORT/CATCHER]
--- UVM Report catcher Summary ---
chip_sw_alert_handler_lpg_sleep_mode_alerts 55002337674064952832513540515232180845875936413725210436501321804468405879843 308
UVM_INFO @ 2283.555105 us: (uvm_report_catcher.svh:705) [UVM/REPORT/CATCHER]
--- UVM Report catcher Summary ---
chip_sw_alert_handler_lpg_sleep_mode_alerts 111236821294026519078485445587253160564233527640728808808377656374246222000401 308
UVM_INFO @ 2939.804200 us: (uvm_report_catcher.svh:705) [UVM/REPORT/CATCHER]
--- UVM Report catcher Summary ---
chip_sw_alert_handler_lpg_sleep_mode_alerts 79866708473194156269445698682512343111860784078682034049079576760818636828365 308
UVM_INFO @ 3009.818044 us: (uvm_report_catcher.svh:705) [UVM/REPORT/CATCHER]
--- UVM Report catcher Summary ---
chip_sw_alert_handler_lpg_sleep_mode_alerts 89488733644450313207394020502507122409782616993743084744511487599825473725512 308
UVM_INFO @ 2903.574897 us: (uvm_report_catcher.svh:705) [UVM/REPORT/CATCHER]
--- UVM Report catcher Summary ---
chip_sw_alert_handler_lpg_sleep_mode_alerts 93756673223472851598552495129486736961459639794680118202628009422527647479085 308
UVM_INFO @ 2543.533238 us: (uvm_report_catcher.svh:705) [UVM/REPORT/CATCHER]
--- UVM Report catcher Summary ---
chip_sw_alert_handler_lpg_sleep_mode_alerts 61849289983192478761506225666082271417708856704296229575075006478036886107121 308
UVM_INFO @ 3026.946276 us: (uvm_report_catcher.svh:705) [UVM/REPORT/CATCHER]
--- UVM Report catcher Summary ---
chip_sw_alert_handler_lpg_sleep_mode_alerts 105012274361672559800225601899087842693734049323710249966909457878545631117882 308
UVM_INFO @ 3493.341540 us: (uvm_report_catcher.svh:705) [UVM/REPORT/CATCHER]
--- UVM Report catcher Summary ---
chip_sw_alert_handler_lpg_sleep_mode_alerts 94523996906588002453046863221529424908613342418479588000365329376584131764285 308
UVM_INFO @ 2245.775947 us: (uvm_report_catcher.svh:705) [UVM/REPORT/CATCHER]
--- UVM Report catcher Summary ---
chip_sw_alert_handler_lpg_sleep_mode_alerts 96781283480766530918339261196529976119928914529598407461001246776162223550131 308
UVM_INFO @ 2748.970436 us: (uvm_report_catcher.svh:705) [UVM/REPORT/CATCHER]
--- UVM Report catcher Summary ---
chip_sw_alert_handler_lpg_sleep_mode_alerts 84655715384668381246797297958187941986086287842989184952460035143014564947112 308
UVM_INFO @ 2846.800000 us: (uvm_report_catcher.svh:705) [UVM/REPORT/CATCHER]
--- UVM Report catcher Summary ---
chip_sw_alert_handler_lpg_sleep_mode_alerts 94204290246275462228886777166749539016361811297961521060994159837480913726327 308
UVM_INFO @ 2951.555080 us: (uvm_report_catcher.svh:705) [UVM/REPORT/CATCHER]
--- UVM Report catcher Summary ---
chip_sw_alert_handler_lpg_sleep_mode_alerts 88308289304417351834804564531499528012407233542171178699445969307376013965041 308
UVM_INFO @ 2512.869348 us: (uvm_report_catcher.svh:705) [UVM/REPORT/CATCHER]
--- UVM Report catcher Summary ---
chip_sw_alert_handler_lpg_sleep_mode_alerts 4567993569838673556129904923195848949465918853827313829379218879328145455846 308
UVM_INFO @ 3048.473480 us: (uvm_report_catcher.svh:705) [UVM/REPORT/CATCHER]
--- UVM Report catcher Summary ---
chip_sw_alert_handler_lpg_sleep_mode_alerts 43680505850361203347146326833185771663474740786308483540093442096906791844043 308
UVM_INFO @ 2957.287092 us: (uvm_report_catcher.svh:705) [UVM/REPORT/CATCHER]
--- UVM Report catcher Summary ---
chip_sw_alert_handler_lpg_sleep_mode_alerts 26179994620948536966404491643448581511422726242153581757136182614279658093540 308
UVM_INFO @ 2904.170430 us: (uvm_report_catcher.svh:705) [UVM/REPORT/CATCHER]
--- UVM Report catcher Summary ---
chip_sw_alert_handler_lpg_sleep_mode_alerts 3678809678481858843661201094460459207889695578080360697550756772478664940827 308
UVM_INFO @ 2694.785882 us: (uvm_report_catcher.svh:705) [UVM/REPORT/CATCHER]
--- UVM Report catcher Summary ---
chip_sw_alert_handler_lpg_sleep_mode_alerts 27872586143939192538092816688153947186302820843004214935431869916421475875299 308
UVM_INFO @ 3118.667073 us: (uvm_report_catcher.svh:705) [UVM/REPORT/CATCHER]
--- UVM Report catcher Summary ---
chip_sw_alert_handler_lpg_sleep_mode_alerts 46398281017089960072254921330476827527646136278586408670486704436290167796083 308
UVM_INFO @ 3204.207000 us: (uvm_report_catcher.svh:705) [UVM/REPORT/CATCHER]
--- UVM Report catcher Summary ---
chip_sw_alert_handler_lpg_sleep_mode_alerts 98336606304900570995978977512707352947441095060370899734075029565526390334474 308
UVM_INFO @ 3051.800222 us: (uvm_report_catcher.svh:705) [UVM/REPORT/CATCHER]
--- UVM Report catcher Summary ---
chip_sw_alert_handler_lpg_sleep_mode_alerts 79071067804336301731933499753754111294137197410445109414401313468574004992101 308
UVM_INFO @ 2211.005243 us: (uvm_report_catcher.svh:705) [UVM/REPORT/CATCHER]
--- UVM Report catcher Summary ---
chip_sw_alert_handler_lpg_sleep_mode_alerts 42011568330124161010947017828716781709681048607406411269553661570795512220079 308
UVM_INFO @ 2794.593625 us: (uvm_report_catcher.svh:705) [UVM/REPORT/CATCHER]
--- UVM Report catcher Summary ---
chip_sw_alert_handler_lpg_sleep_mode_alerts 99507078481984737475908585353583048371459152883986536785247240172562480192653 308
UVM_INFO @ 3212.441428 us: (uvm_report_catcher.svh:705) [UVM/REPORT/CATCHER]
--- UVM Report catcher Summary ---
chip_sw_alert_handler_lpg_sleep_mode_alerts 21562634742071980254448515276160257184581825913656052054520027055086788753094 308
UVM_INFO @ 3573.612890 us: (uvm_report_catcher.svh:705) [UVM/REPORT/CATCHER]
--- UVM Report catcher Summary ---
chip_sw_alert_handler_lpg_sleep_mode_alerts 104361654413786506627106911389048317677579377657568056993606508008390360211077 308
UVM_INFO @ 3563.148016 us: (uvm_report_catcher.svh:705) [UVM/REPORT/CATCHER]
--- UVM Report catcher Summary ---
chip_sw_alert_handler_lpg_sleep_mode_alerts 15911207908934028525529342521126897426034337177489551377308411207041556108654 308
UVM_INFO @ 3253.276465 us: (uvm_report_catcher.svh:705) [UVM/REPORT/CATCHER]
--- UVM Report catcher Summary ---
Some pass patterns missing: ['^TEST PASSED (UVM_)?CHECKS$'] 46 test runs
chip_sw_pwrmgr_sleep_wake_5_bug 16346666292585407569283709917050766390663382370269609627595120603522851106843 None
---- STDOUT ----
---- STDERR ----
WARNING: Target pattern parsing failed.
ERROR: Skipping '//sw/device/tests:pwrmgr_sleep_wake_5_bug_test_sim_dv': no such target '//sw/device/tests:pwrmgr_sleep_wake_5_bug_test_sim_dv': target 'pwrmgr_sleep_wake_5_bug_test_sim_dv' not declared in package 'sw/device/tests' defined by /nightly/current_run/opentitan/sw/device/tests/BUILD
ERROR: no such target '//sw/device/tests:pwrmgr_sleep_wake_5_bug_test_sim_dv': target 'pwrmgr_sleep_wake_5_bug_test_sim_dv' not declared in package 'sw/device/tests' defined by /nightly/current_run/opentitan/sw/device/tests/BUILD
ERROR: Build did NOT complete successfully
_run_cmd -> had a non-zero return code of 1.
make: *** [/nightly/current_run/opentitan/hw/dv/tools/dvsim/sim.mk:58: sw_build] Error 1
chip_sw_otbn_ecdsa_op_irq_jitter_en_reduced_freq 104051482692881192003763634111898450278346792543494442509527345931466520603386 None
File "/nightly/runs/.cache/bazel/_bazel_root/5fbabd58f74ed10ce4d4abef6fdbdfee/external/bazel_tools/tools/build_defs/repo/http.bzl", line 137, column 45, in _http_archive_impl
download_info = ctx.download_and_extract(
Error in download_and_extract: java.io.IOException: Error downloading [https://github.com/sphincs/sphincsplus/archive/129b72c80e122a22a61f71b5d2b042770890ccee.tar.gz] to /nightly/runs/.cache/bazel/_bazel_root/5fbabd58f74ed10ce4d4abef6fdbdfee/external/+sphincsplus+sphincsplus_fips205_ipd/temp9619132823814216743/129b72c80e122a22a61f71b5d2b042770890ccee.tar.gz: GET returned 502 Bad Gateway or Proxy Error
ERROR: no such package '@@+sphincsplus+sphincsplus_fips205_ipd//': java.io.IOException: Error downloading [https://github.com/sphincs/sphincsplus/archive/129b72c80e122a22a61f71b5d2b042770890ccee.tar.gz] to /nightly/runs/.cache/bazel/_bazel_root/5fbabd58f74ed10ce4d4abef6fdbdfee/external/+sphincsplus+sphincsplus_fips205_ipd/temp9619132823814216743/129b72c80e122a22a61f71b5d2b042770890ccee.tar.gz: GET returned 502 Bad Gateway or Proxy Error
ERROR: /nightly/current_run/opentitan/sw/host/sphincsplus/BUILD:34:21: //sw/host/sphincsplus:bindgen_sha2_128s_simple__bindgen depends on @@+sphincsplus+sphincsplus_fips205_ipd//:sphincs_random_sha2_128s_simple in repository @@+sphincsplus+sphincsplus_fips205_ipd which failed to fetch. no such package '@@+sphincsplus+sphincsplus_fips205_ipd//': java.io.IOException: Error downloading [https://github.com/sphincs/sphincsplus/archive/129b72c80e122a22a61f71b5d2b042770890ccee.tar.gz] to /nightly/runs/.cache/bazel/_bazel_root/5fbabd58f74ed10ce4d4abef6fdbdfee/external/+sphincsplus+sphincsplus_fips205_ipd/temp9619132823814216743/129b72c80e122a22a61f71b5d2b042770890ccee.tar.gz: GET returned 502 Bad Gateway or Proxy Error
ERROR: Analysis of target '//sw/device/tests:otbn_ecdsa_op_irq_test_sim_dv' failed; build aborted: Analysis failed
ERROR: Build did NOT complete successfully
_run_cmd -> had a non-zero return code of 1.
make: *** [/nightly/current_run/opentitan/hw/dv/tools/dvsim/sim.mk:58: sw_build] Error 1
chip_sw_csrng_edn_concurrency_reduced_freq 64555998082027236480176296335219261289545394025443325672661072286331133606219 None
File "/nightly/runs/.cache/bazel/_bazel_root/5fbabd58f74ed10ce4d4abef6fdbdfee/external/bazel_tools/tools/build_defs/repo/http.bzl", line 137, column 45, in _http_archive_impl
download_info = ctx.download_and_extract(
Error in download_and_extract: java.io.IOException: Error downloading [https://github.com/sphincs/sphincsplus/archive/129b72c80e122a22a61f71b5d2b042770890ccee.tar.gz] to /nightly/runs/.cache/bazel/_bazel_root/5fbabd58f74ed10ce4d4abef6fdbdfee/external/+sphincsplus+sphincsplus_fips205_ipd/temp9525104782587223274/129b72c80e122a22a61f71b5d2b042770890ccee.tar.gz: GET returned 502 Bad Gateway or Proxy Error
ERROR: no such package '@@+sphincsplus+sphincsplus_fips205_ipd//': java.io.IOException: Error downloading [https://github.com/sphincs/sphincsplus/archive/129b72c80e122a22a61f71b5d2b042770890ccee.tar.gz] to /nightly/runs/.cache/bazel/_bazel_root/5fbabd58f74ed10ce4d4abef6fdbdfee/external/+sphincsplus+sphincsplus_fips205_ipd/temp9525104782587223274/129b72c80e122a22a61f71b5d2b042770890ccee.tar.gz: GET returned 502 Bad Gateway or Proxy Error
ERROR: /nightly/current_run/opentitan/sw/host/sphincsplus/BUILD:34:21: //sw/host/sphincsplus:bindgen_sha2_128s_simple__bindgen depends on @@+sphincsplus+sphincsplus_fips205_ipd//:api.h in repository @@+sphincsplus+sphincsplus_fips205_ipd which failed to fetch. no such package '@@+sphincsplus+sphincsplus_fips205_ipd//': java.io.IOException: Error downloading [https://github.com/sphincs/sphincsplus/archive/129b72c80e122a22a61f71b5d2b042770890ccee.tar.gz] to /nightly/runs/.cache/bazel/_bazel_root/5fbabd58f74ed10ce4d4abef6fdbdfee/external/+sphincsplus+sphincsplus_fips205_ipd/temp9525104782587223274/129b72c80e122a22a61f71b5d2b042770890ccee.tar.gz: GET returned 502 Bad Gateway or Proxy Error
ERROR: Analysis of target '//sw/device/tests:csrng_edn_concurrency_test_sim_dv' failed; build aborted: Analysis failed
ERROR: Build did NOT complete successfully
_run_cmd -> had a non-zero return code of 1.
make: *** [/nightly/current_run/opentitan/hw/dv/tools/dvsim/sim.mk:58: sw_build] Error 1
rom_e2e_boot_policy_valid_a_good_b_good_test_unlocked0 40708829757750361712289856606094282271224442413378826733395352696068241603070 None
---- STDERR ----
Another command (pid=267575) is running. Waiting for it to complete on the server (server_pid=264331)...
Another command (pid=270123) is running. Waiting for it to complete on the server (server_pid=264331)...
WARNING: Target pattern parsing failed.
ERROR: Skipping '//sw/device/silicon_creator/rom/e2e:empty_test_slot_a_fake_ecdsa_prod_key_0_sim_dv': no such target '//sw/device/silicon_creator/rom/e2e:empty_test_slot_a_fake_ecdsa_prod_key_0_sim_dv': target 'empty_test_slot_a_fake_ecdsa_prod_key_0_sim_dv' not declared in package 'sw/device/silicon_creator/rom/e2e' defined by /nightly/current_run/opentitan/sw/device/silicon_creator/rom/e2e/BUILD
ERROR: no such target '//sw/device/silicon_creator/rom/e2e:empty_test_slot_a_fake_ecdsa_prod_key_0_sim_dv': target 'empty_test_slot_a_fake_ecdsa_prod_key_0_sim_dv' not declared in package 'sw/device/silicon_creator/rom/e2e' defined by /nightly/current_run/opentitan/sw/device/silicon_creator/rom/e2e/BUILD
ERROR: Build did NOT complete successfully
_run_cmd -> had a non-zero return code of 1.
make: *** [/nightly/current_run/opentitan/hw/dv/tools/dvsim/sim.mk:58: sw_build] Error 1
rom_e2e_boot_policy_valid_a_good_b_good_dev 91540685902376625363908006323905303134208921939085771763531791418697795470612 None
---- STDERR ----
Another command (pid=419662) is running. Waiting for it to complete on the server (server_pid=264331)...
WARNING: Target pattern parsing failed.
ERROR: Skipping '//sw/device/silicon_creator/rom/e2e:empty_test_slot_a_fake_ecdsa_prod_key_0_sim_dv': no such target '//sw/device/silicon_creator/rom/e2e:empty_test_slot_a_fake_ecdsa_prod_key_0_sim_dv': target 'empty_test_slot_a_fake_ecdsa_prod_key_0_sim_dv' not declared in package 'sw/device/silicon_creator/rom/e2e' defined by /nightly/current_run/opentitan/sw/device/silicon_creator/rom/e2e/BUILD
ERROR: no such target '//sw/device/silicon_creator/rom/e2e:empty_test_slot_a_fake_ecdsa_prod_key_0_sim_dv': target 'empty_test_slot_a_fake_ecdsa_prod_key_0_sim_dv' not declared in package 'sw/device/silicon_creator/rom/e2e' defined by /nightly/current_run/opentitan/sw/device/silicon_creator/rom/e2e/BUILD
ERROR: Build did NOT complete successfully
_run_cmd -> had a non-zero return code of 1.
make: *** [/nightly/current_run/opentitan/hw/dv/tools/dvsim/sim.mk:58: sw_build] Error 1
rom_e2e_boot_policy_valid_a_good_b_good_prod 98605982010707059256142787356535442515871313859772554840815442971471907683102 None
---- STDOUT ----
---- STDERR ----
WARNING: Target pattern parsing failed.
ERROR: Skipping '//sw/device/silicon_creator/rom/e2e:empty_test_slot_a_fake_ecdsa_prod_key_0_sim_dv': no such target '//sw/device/silicon_creator/rom/e2e:empty_test_slot_a_fake_ecdsa_prod_key_0_sim_dv': target 'empty_test_slot_a_fake_ecdsa_prod_key_0_sim_dv' not declared in package 'sw/device/silicon_creator/rom/e2e' defined by /nightly/current_run/opentitan/sw/device/silicon_creator/rom/e2e/BUILD
ERROR: no such target '//sw/device/silicon_creator/rom/e2e:empty_test_slot_a_fake_ecdsa_prod_key_0_sim_dv': target 'empty_test_slot_a_fake_ecdsa_prod_key_0_sim_dv' not declared in package 'sw/device/silicon_creator/rom/e2e' defined by /nightly/current_run/opentitan/sw/device/silicon_creator/rom/e2e/BUILD
ERROR: Build did NOT complete successfully
_run_cmd -> had a non-zero return code of 1.
make: *** [/nightly/current_run/opentitan/hw/dv/tools/dvsim/sim.mk:58: sw_build] Error 1
rom_e2e_boot_policy_valid_a_good_b_good_prod_end 110533318191662149593380805560957239759288526220210806706735366292065862317695 None
---- STDOUT ----
---- STDERR ----
WARNING: Target pattern parsing failed.
ERROR: Skipping '//sw/device/silicon_creator/rom/e2e:empty_test_slot_a_fake_ecdsa_prod_key_0_sim_dv': no such target '//sw/device/silicon_creator/rom/e2e:empty_test_slot_a_fake_ecdsa_prod_key_0_sim_dv': target 'empty_test_slot_a_fake_ecdsa_prod_key_0_sim_dv' not declared in package 'sw/device/silicon_creator/rom/e2e' defined by /nightly/current_run/opentitan/sw/device/silicon_creator/rom/e2e/BUILD
ERROR: no such target '//sw/device/silicon_creator/rom/e2e:empty_test_slot_a_fake_ecdsa_prod_key_0_sim_dv': target 'empty_test_slot_a_fake_ecdsa_prod_key_0_sim_dv' not declared in package 'sw/device/silicon_creator/rom/e2e' defined by /nightly/current_run/opentitan/sw/device/silicon_creator/rom/e2e/BUILD
ERROR: Build did NOT complete successfully
_run_cmd -> had a non-zero return code of 1.
make: *** [/nightly/current_run/opentitan/hw/dv/tools/dvsim/sim.mk:58: sw_build] Error 1
rom_e2e_boot_policy_valid_a_good_b_good_rma 54201425380527285384388413818882412633920098232982607778138019631500201814055 None
---- STDOUT ----
---- STDERR ----
WARNING: Target pattern parsing failed.
ERROR: Skipping '//sw/device/silicon_creator/rom/e2e:empty_test_slot_a_fake_ecdsa_prod_key_0_sim_dv': no such target '//sw/device/silicon_creator/rom/e2e:empty_test_slot_a_fake_ecdsa_prod_key_0_sim_dv': target 'empty_test_slot_a_fake_ecdsa_prod_key_0_sim_dv' not declared in package 'sw/device/silicon_creator/rom/e2e' defined by /nightly/current_run/opentitan/sw/device/silicon_creator/rom/e2e/BUILD
ERROR: no such target '//sw/device/silicon_creator/rom/e2e:empty_test_slot_a_fake_ecdsa_prod_key_0_sim_dv': target 'empty_test_slot_a_fake_ecdsa_prod_key_0_sim_dv' not declared in package 'sw/device/silicon_creator/rom/e2e' defined by /nightly/current_run/opentitan/sw/device/silicon_creator/rom/e2e/BUILD
ERROR: Build did NOT complete successfully
_run_cmd -> had a non-zero return code of 1.
make: *** [/nightly/current_run/opentitan/hw/dv/tools/dvsim/sim.mk:58: sw_build] Error 1
rom_e2e_boot_policy_valid_a_good_b_bad_test_unlocked0 98399418732328164063355236911494889413344746037915230033746112558739575421085 None
---- STDERR ----
Another command (pid=267575) is running. Waiting for it to complete on the server (server_pid=264331)...
WARNING: Target pattern parsing failed.
ERROR: Skipping '//sw/device/silicon_creator/rom/e2e:empty_test_slot_a_fake_ecdsa_prod_key_0_sim_dv': no such target '//sw/device/silicon_creator/rom/e2e:empty_test_slot_a_fake_ecdsa_prod_key_0_sim_dv': target 'empty_test_slot_a_fake_ecdsa_prod_key_0_sim_dv' not declared in package 'sw/device/silicon_creator/rom/e2e' defined by /nightly/current_run/opentitan/sw/device/silicon_creator/rom/e2e/BUILD
ERROR: no such target '//sw/device/silicon_creator/rom/e2e:empty_test_slot_a_fake_ecdsa_prod_key_0_sim_dv': target 'empty_test_slot_a_fake_ecdsa_prod_key_0_sim_dv' not declared in package 'sw/device/silicon_creator/rom/e2e' defined by /nightly/current_run/opentitan/sw/device/silicon_creator/rom/e2e/BUILD
ERROR: Build did NOT complete successfully
_run_cmd -> had a non-zero return code of 1.
make: *** [/nightly/current_run/opentitan/hw/dv/tools/dvsim/sim.mk:58: sw_build] Error 1
rom_e2e_boot_policy_valid_a_good_b_bad_dev 94388590327861497178354088895494166277887093299116705516019202112819804851384 None
---- STDOUT ----
---- STDERR ----
WARNING: Target pattern parsing failed.
ERROR: Skipping '//sw/device/silicon_creator/rom/e2e:empty_test_slot_a_fake_ecdsa_prod_key_0_sim_dv': no such target '//sw/device/silicon_creator/rom/e2e:empty_test_slot_a_fake_ecdsa_prod_key_0_sim_dv': target 'empty_test_slot_a_fake_ecdsa_prod_key_0_sim_dv' not declared in package 'sw/device/silicon_creator/rom/e2e' defined by /nightly/current_run/opentitan/sw/device/silicon_creator/rom/e2e/BUILD
ERROR: no such target '//sw/device/silicon_creator/rom/e2e:empty_test_slot_a_fake_ecdsa_prod_key_0_sim_dv': target 'empty_test_slot_a_fake_ecdsa_prod_key_0_sim_dv' not declared in package 'sw/device/silicon_creator/rom/e2e' defined by /nightly/current_run/opentitan/sw/device/silicon_creator/rom/e2e/BUILD
ERROR: Build did NOT complete successfully
_run_cmd -> had a non-zero return code of 1.
make: *** [/nightly/current_run/opentitan/hw/dv/tools/dvsim/sim.mk:58: sw_build] Error 1
rom_e2e_boot_policy_valid_a_good_b_bad_prod 86539581527241964430486678124392468968510950176535056921118435777132260090423 None
---- STDOUT ----
---- STDERR ----
WARNING: Target pattern parsing failed.
ERROR: Skipping '//sw/device/silicon_creator/rom/e2e:empty_test_slot_a_fake_ecdsa_prod_key_0_sim_dv': no such target '//sw/device/silicon_creator/rom/e2e:empty_test_slot_a_fake_ecdsa_prod_key_0_sim_dv': target 'empty_test_slot_a_fake_ecdsa_prod_key_0_sim_dv' not declared in package 'sw/device/silicon_creator/rom/e2e' defined by /nightly/current_run/opentitan/sw/device/silicon_creator/rom/e2e/BUILD
ERROR: no such target '//sw/device/silicon_creator/rom/e2e:empty_test_slot_a_fake_ecdsa_prod_key_0_sim_dv': target 'empty_test_slot_a_fake_ecdsa_prod_key_0_sim_dv' not declared in package 'sw/device/silicon_creator/rom/e2e' defined by /nightly/current_run/opentitan/sw/device/silicon_creator/rom/e2e/BUILD
ERROR: Build did NOT complete successfully
_run_cmd -> had a non-zero return code of 1.
make: *** [/nightly/current_run/opentitan/hw/dv/tools/dvsim/sim.mk:58: sw_build] Error 1
rom_e2e_boot_policy_valid_a_good_b_bad_prod_end 105617839851096769930334609261048257593471590088025475562546560620181175708854 None
---- STDOUT ----
---- STDERR ----
WARNING: Target pattern parsing failed.
ERROR: Skipping '//sw/device/silicon_creator/rom/e2e:empty_test_slot_a_fake_ecdsa_prod_key_0_sim_dv': no such target '//sw/device/silicon_creator/rom/e2e:empty_test_slot_a_fake_ecdsa_prod_key_0_sim_dv': target 'empty_test_slot_a_fake_ecdsa_prod_key_0_sim_dv' not declared in package 'sw/device/silicon_creator/rom/e2e' defined by /nightly/current_run/opentitan/sw/device/silicon_creator/rom/e2e/BUILD
ERROR: no such target '//sw/device/silicon_creator/rom/e2e:empty_test_slot_a_fake_ecdsa_prod_key_0_sim_dv': target 'empty_test_slot_a_fake_ecdsa_prod_key_0_sim_dv' not declared in package 'sw/device/silicon_creator/rom/e2e' defined by /nightly/current_run/opentitan/sw/device/silicon_creator/rom/e2e/BUILD
ERROR: Build did NOT complete successfully
_run_cmd -> had a non-zero return code of 1.
make: *** [/nightly/current_run/opentitan/hw/dv/tools/dvsim/sim.mk:58: sw_build] Error 1
rom_e2e_boot_policy_valid_a_good_b_bad_rma 95365537520142858610730352311010016726593497140044103468899250320759534857367 None
---- STDOUT ----
---- STDERR ----
WARNING: Target pattern parsing failed.
ERROR: Skipping '//sw/device/silicon_creator/rom/e2e:empty_test_slot_a_fake_ecdsa_prod_key_0_sim_dv': no such target '//sw/device/silicon_creator/rom/e2e:empty_test_slot_a_fake_ecdsa_prod_key_0_sim_dv': target 'empty_test_slot_a_fake_ecdsa_prod_key_0_sim_dv' not declared in package 'sw/device/silicon_creator/rom/e2e' defined by /nightly/current_run/opentitan/sw/device/silicon_creator/rom/e2e/BUILD
ERROR: no such target '//sw/device/silicon_creator/rom/e2e:empty_test_slot_a_fake_ecdsa_prod_key_0_sim_dv': target 'empty_test_slot_a_fake_ecdsa_prod_key_0_sim_dv' not declared in package 'sw/device/silicon_creator/rom/e2e' defined by /nightly/current_run/opentitan/sw/device/silicon_creator/rom/e2e/BUILD
ERROR: Build did NOT complete successfully
_run_cmd -> had a non-zero return code of 1.
make: *** [/nightly/current_run/opentitan/hw/dv/tools/dvsim/sim.mk:58: sw_build] Error 1
rom_e2e_boot_policy_valid_a_bad_b_good_test_unlocked0 63335672271059607578917646823595197994850527524160571312029824492817253025398 None
---- STDERR ----
Another command (pid=271808) is running. Waiting for it to complete on the server (server_pid=264331)...
WARNING: Target pattern parsing failed.
ERROR: Skipping '//sw/device/silicon_creator/rom/e2e:empty_test_slot_b_fake_ecdsa_prod_key_0_sim_dv': no such target '//sw/device/silicon_creator/rom/e2e:empty_test_slot_b_fake_ecdsa_prod_key_0_sim_dv': target 'empty_test_slot_b_fake_ecdsa_prod_key_0_sim_dv' not declared in package 'sw/device/silicon_creator/rom/e2e' defined by /nightly/current_run/opentitan/sw/device/silicon_creator/rom/e2e/BUILD
ERROR: no such target '//sw/device/silicon_creator/rom/e2e:empty_test_slot_b_fake_ecdsa_prod_key_0_sim_dv': target 'empty_test_slot_b_fake_ecdsa_prod_key_0_sim_dv' not declared in package 'sw/device/silicon_creator/rom/e2e' defined by /nightly/current_run/opentitan/sw/device/silicon_creator/rom/e2e/BUILD
ERROR: Build did NOT complete successfully
_run_cmd -> had a non-zero return code of 1.
make: *** [/nightly/current_run/opentitan/hw/dv/tools/dvsim/sim.mk:58: sw_build] Error 1
rom_e2e_boot_policy_valid_a_bad_b_good_dev 86572786519740998055673656267939956720181901482527963522755079692426334773268 None
---- STDOUT ----
---- STDERR ----
WARNING: Target pattern parsing failed.
ERROR: Skipping '//sw/device/silicon_creator/rom/e2e:empty_test_slot_b_fake_ecdsa_prod_key_0_sim_dv': no such target '//sw/device/silicon_creator/rom/e2e:empty_test_slot_b_fake_ecdsa_prod_key_0_sim_dv': target 'empty_test_slot_b_fake_ecdsa_prod_key_0_sim_dv' not declared in package 'sw/device/silicon_creator/rom/e2e' defined by /nightly/current_run/opentitan/sw/device/silicon_creator/rom/e2e/BUILD
ERROR: no such target '//sw/device/silicon_creator/rom/e2e:empty_test_slot_b_fake_ecdsa_prod_key_0_sim_dv': target 'empty_test_slot_b_fake_ecdsa_prod_key_0_sim_dv' not declared in package 'sw/device/silicon_creator/rom/e2e' defined by /nightly/current_run/opentitan/sw/device/silicon_creator/rom/e2e/BUILD
ERROR: Build did NOT complete successfully
_run_cmd -> had a non-zero return code of 1.
make: *** [/nightly/current_run/opentitan/hw/dv/tools/dvsim/sim.mk:58: sw_build] Error 1
rom_e2e_boot_policy_valid_a_bad_b_good_prod 90649536885272724809609748709947320202175505197321259586737005474680914843162 None
---- STDOUT ----
---- STDERR ----
WARNING: Target pattern parsing failed.
ERROR: Skipping '//sw/device/silicon_creator/rom/e2e:empty_test_slot_b_fake_ecdsa_prod_key_0_sim_dv': no such target '//sw/device/silicon_creator/rom/e2e:empty_test_slot_b_fake_ecdsa_prod_key_0_sim_dv': target 'empty_test_slot_b_fake_ecdsa_prod_key_0_sim_dv' not declared in package 'sw/device/silicon_creator/rom/e2e' defined by /nightly/current_run/opentitan/sw/device/silicon_creator/rom/e2e/BUILD
ERROR: no such target '//sw/device/silicon_creator/rom/e2e:empty_test_slot_b_fake_ecdsa_prod_key_0_sim_dv': target 'empty_test_slot_b_fake_ecdsa_prod_key_0_sim_dv' not declared in package 'sw/device/silicon_creator/rom/e2e' defined by /nightly/current_run/opentitan/sw/device/silicon_creator/rom/e2e/BUILD
ERROR: Build did NOT complete successfully
_run_cmd -> had a non-zero return code of 1.
make: *** [/nightly/current_run/opentitan/hw/dv/tools/dvsim/sim.mk:58: sw_build] Error 1
rom_e2e_boot_policy_valid_a_bad_b_good_prod_end 16874397611884751885930731964671222059205819181959742215110598667627651683658 None
---- STDOUT ----
---- STDERR ----
WARNING: Target pattern parsing failed.
ERROR: Skipping '//sw/device/silicon_creator/rom/e2e:empty_test_slot_b_fake_ecdsa_prod_key_0_sim_dv': no such target '//sw/device/silicon_creator/rom/e2e:empty_test_slot_b_fake_ecdsa_prod_key_0_sim_dv': target 'empty_test_slot_b_fake_ecdsa_prod_key_0_sim_dv' not declared in package 'sw/device/silicon_creator/rom/e2e' defined by /nightly/current_run/opentitan/sw/device/silicon_creator/rom/e2e/BUILD
ERROR: no such target '//sw/device/silicon_creator/rom/e2e:empty_test_slot_b_fake_ecdsa_prod_key_0_sim_dv': target 'empty_test_slot_b_fake_ecdsa_prod_key_0_sim_dv' not declared in package 'sw/device/silicon_creator/rom/e2e' defined by /nightly/current_run/opentitan/sw/device/silicon_creator/rom/e2e/BUILD
ERROR: Build did NOT complete successfully
_run_cmd -> had a non-zero return code of 1.
make: *** [/nightly/current_run/opentitan/hw/dv/tools/dvsim/sim.mk:58: sw_build] Error 1
rom_e2e_boot_policy_valid_a_bad_b_good_rma 90470031622664347413134044699021168818809009342974548522494873508657443961262 None
---- STDOUT ----
---- STDERR ----
WARNING: Target pattern parsing failed.
ERROR: Skipping '//sw/device/silicon_creator/rom/e2e:empty_test_slot_b_fake_ecdsa_prod_key_0_sim_dv': no such target '//sw/device/silicon_creator/rom/e2e:empty_test_slot_b_fake_ecdsa_prod_key_0_sim_dv': target 'empty_test_slot_b_fake_ecdsa_prod_key_0_sim_dv' not declared in package 'sw/device/silicon_creator/rom/e2e' defined by /nightly/current_run/opentitan/sw/device/silicon_creator/rom/e2e/BUILD
ERROR: no such target '//sw/device/silicon_creator/rom/e2e:empty_test_slot_b_fake_ecdsa_prod_key_0_sim_dv': target 'empty_test_slot_b_fake_ecdsa_prod_key_0_sim_dv' not declared in package 'sw/device/silicon_creator/rom/e2e' defined by /nightly/current_run/opentitan/sw/device/silicon_creator/rom/e2e/BUILD
ERROR: Build did NOT complete successfully
_run_cmd -> had a non-zero return code of 1.
make: *** [/nightly/current_run/opentitan/hw/dv/tools/dvsim/sim.mk:58: sw_build] Error 1
rom_e2e_sigverify_always_a_bad_b_bad_test_unlocked0 4838302893570428071268063733457446329091351871379217078718018178522178975915 None
File "/nightly/runs/.cache/bazel/_bazel_root/5fbabd58f74ed10ce4d4abef6fdbdfee/external/bazel_tools/tools/build_defs/repo/http.bzl", line 137, column 45, in _http_archive_impl
download_info = ctx.download_and_extract(
Error in download_and_extract: java.io.IOException: Error downloading [https://github.com/sphincs/sphincsplus/archive/129b72c80e122a22a61f71b5d2b042770890ccee.tar.gz] to /nightly/runs/.cache/bazel/_bazel_root/5fbabd58f74ed10ce4d4abef6fdbdfee/external/+sphincsplus+sphincsplus_fips205_ipd/temp9413978351616401314/129b72c80e122a22a61f71b5d2b042770890ccee.tar.gz: GET returned 502 Bad Gateway or Proxy Error
ERROR: no such package '@@+sphincsplus+sphincsplus_fips205_ipd//': java.io.IOException: Error downloading [https://github.com/sphincs/sphincsplus/archive/129b72c80e122a22a61f71b5d2b042770890ccee.tar.gz] to /nightly/runs/.cache/bazel/_bazel_root/5fbabd58f74ed10ce4d4abef6fdbdfee/external/+sphincsplus+sphincsplus_fips205_ipd/temp9413978351616401314/129b72c80e122a22a61f71b5d2b042770890ccee.tar.gz: GET returned 502 Bad Gateway or Proxy Error
ERROR: /nightly/current_run/opentitan/sw/host/sphincsplus/BUILD:19:21: //sw/host/sphincsplus:bindgen_shake_128s_simple__bindgen depends on @@+sphincsplus+sphincsplus_fips205_ipd//:api.h in repository @@+sphincsplus+sphincsplus_fips205_ipd which failed to fetch. no such package '@@+sphincsplus+sphincsplus_fips205_ipd//': java.io.IOException: Error downloading [https://github.com/sphincs/sphincsplus/archive/129b72c80e122a22a61f71b5d2b042770890ccee.tar.gz] to /nightly/runs/.cache/bazel/_bazel_root/5fbabd58f74ed10ce4d4abef6fdbdfee/external/+sphincsplus+sphincsplus_fips205_ipd/temp9413978351616401314/129b72c80e122a22a61f71b5d2b042770890ccee.tar.gz: GET returned 502 Bad Gateway or Proxy Error
ERROR: Analysis of target '//sw/device/silicon_creator/rom/e2e:empty_test_slot_a_corrupted_sim_dv' failed; build aborted: Analysis failed
ERROR: Build did NOT complete successfully
_run_cmd -> had a non-zero return code of 1.
make: *** [/nightly/current_run/opentitan/hw/dv/tools/dvsim/sim.mk:58: sw_build] Error 1
rom_e2e_asm_init_test_unlocked0 74206191708291092536808430554400914523106278319318619861907490594041894719671 None
Another command (pid=266488) is running. Waiting for it to complete on the server (server_pid=264331)...
Another command (pid=267624) is running. Waiting for it to complete on the server (server_pid=264331)...
Another command (pid=267575) is running. Waiting for it to complete on the server (server_pid=264331)...
WARNING: Target pattern parsing failed.
ERROR: Skipping '//sw/device/silicon_creator/rom/e2e:empty_test_slot_a_fake_ecdsa_prod_key_0_sim_dv': no such target '//sw/device/silicon_creator/rom/e2e:empty_test_slot_a_fake_ecdsa_prod_key_0_sim_dv': target 'empty_test_slot_a_fake_ecdsa_prod_key_0_sim_dv' not declared in package 'sw/device/silicon_creator/rom/e2e' defined by /nightly/current_run/opentitan/sw/device/silicon_creator/rom/e2e/BUILD
ERROR: no such target '//sw/device/silicon_creator/rom/e2e:empty_test_slot_a_fake_ecdsa_prod_key_0_sim_dv': target 'empty_test_slot_a_fake_ecdsa_prod_key_0_sim_dv' not declared in package 'sw/device/silicon_creator/rom/e2e' defined by /nightly/current_run/opentitan/sw/device/silicon_creator/rom/e2e/BUILD
ERROR: Build did NOT complete successfully
_run_cmd -> had a non-zero return code of 1.
make: *** [/nightly/current_run/opentitan/hw/dv/tools/dvsim/sim.mk:58: sw_build] Error 1
rom_e2e_asm_init_dev 2044909102449448381408866392258284351692404187859808959643893749506386401663 None
---- STDERR ----
Another command (pid=404428) is running. Waiting for it to complete on the server (server_pid=264331)...
WARNING: Target pattern parsing failed.
ERROR: Skipping '//sw/device/silicon_creator/rom/e2e:empty_test_slot_a_fake_ecdsa_prod_key_0_sim_dv': no such target '//sw/device/silicon_creator/rom/e2e:empty_test_slot_a_fake_ecdsa_prod_key_0_sim_dv': target 'empty_test_slot_a_fake_ecdsa_prod_key_0_sim_dv' not declared in package 'sw/device/silicon_creator/rom/e2e' defined by /nightly/current_run/opentitan/sw/device/silicon_creator/rom/e2e/BUILD
ERROR: no such target '//sw/device/silicon_creator/rom/e2e:empty_test_slot_a_fake_ecdsa_prod_key_0_sim_dv': target 'empty_test_slot_a_fake_ecdsa_prod_key_0_sim_dv' not declared in package 'sw/device/silicon_creator/rom/e2e' defined by /nightly/current_run/opentitan/sw/device/silicon_creator/rom/e2e/BUILD
ERROR: Build did NOT complete successfully
_run_cmd -> had a non-zero return code of 1.
make: *** [/nightly/current_run/opentitan/hw/dv/tools/dvsim/sim.mk:58: sw_build] Error 1
rom_e2e_asm_init_prod 71765398874255068863282520480008164339037295364872865783411181060080304096985 None
Another command (pid=405315) is running. Waiting for it to complete on the server (server_pid=264331)...
Another command (pid=404382) is running. Waiting for it to complete on the server (server_pid=264331)...
Another command (pid=405921) is running. Waiting for it to complete on the server (server_pid=264331)...
WARNING: Target pattern parsing failed.
ERROR: Skipping '//sw/device/silicon_creator/rom/e2e:empty_test_slot_a_fake_ecdsa_prod_key_0_sim_dv': no such target '//sw/device/silicon_creator/rom/e2e:empty_test_slot_a_fake_ecdsa_prod_key_0_sim_dv': target 'empty_test_slot_a_fake_ecdsa_prod_key_0_sim_dv' not declared in package 'sw/device/silicon_creator/rom/e2e' defined by /nightly/current_run/opentitan/sw/device/silicon_creator/rom/e2e/BUILD
ERROR: no such target '//sw/device/silicon_creator/rom/e2e:empty_test_slot_a_fake_ecdsa_prod_key_0_sim_dv': target 'empty_test_slot_a_fake_ecdsa_prod_key_0_sim_dv' not declared in package 'sw/device/silicon_creator/rom/e2e' defined by /nightly/current_run/opentitan/sw/device/silicon_creator/rom/e2e/BUILD
ERROR: Build did NOT complete successfully
_run_cmd -> had a non-zero return code of 1.
make: *** [/nightly/current_run/opentitan/hw/dv/tools/dvsim/sim.mk:58: sw_build] Error 1
rom_e2e_asm_init_prod_end 34343974586503253202369985917990209519679905808446628516809868927225552353832 None
---- STDOUT ----
---- STDERR ----
WARNING: Target pattern parsing failed.
ERROR: Skipping '//sw/device/silicon_creator/rom/e2e:empty_test_slot_a_fake_ecdsa_prod_key_0_sim_dv': no such target '//sw/device/silicon_creator/rom/e2e:empty_test_slot_a_fake_ecdsa_prod_key_0_sim_dv': target 'empty_test_slot_a_fake_ecdsa_prod_key_0_sim_dv' not declared in package 'sw/device/silicon_creator/rom/e2e' defined by /nightly/current_run/opentitan/sw/device/silicon_creator/rom/e2e/BUILD
ERROR: no such target '//sw/device/silicon_creator/rom/e2e:empty_test_slot_a_fake_ecdsa_prod_key_0_sim_dv': target 'empty_test_slot_a_fake_ecdsa_prod_key_0_sim_dv' not declared in package 'sw/device/silicon_creator/rom/e2e' defined by /nightly/current_run/opentitan/sw/device/silicon_creator/rom/e2e/BUILD
ERROR: Build did NOT complete successfully
_run_cmd -> had a non-zero return code of 1.
make: *** [/nightly/current_run/opentitan/hw/dv/tools/dvsim/sim.mk:58: sw_build] Error 1
rom_e2e_asm_init_rma 36809600593952744942356997659689183014100474535308900528353809449258689622524 None
---- STDOUT ----
---- STDERR ----
WARNING: Target pattern parsing failed.
ERROR: Skipping '//sw/device/silicon_creator/rom/e2e:empty_test_slot_a_fake_ecdsa_prod_key_0_sim_dv': no such target '//sw/device/silicon_creator/rom/e2e:empty_test_slot_a_fake_ecdsa_prod_key_0_sim_dv': target 'empty_test_slot_a_fake_ecdsa_prod_key_0_sim_dv' not declared in package 'sw/device/silicon_creator/rom/e2e' defined by /nightly/current_run/opentitan/sw/device/silicon_creator/rom/e2e/BUILD
ERROR: no such target '//sw/device/silicon_creator/rom/e2e:empty_test_slot_a_fake_ecdsa_prod_key_0_sim_dv': target 'empty_test_slot_a_fake_ecdsa_prod_key_0_sim_dv' not declared in package 'sw/device/silicon_creator/rom/e2e' defined by /nightly/current_run/opentitan/sw/device/silicon_creator/rom/e2e/BUILD
ERROR: Build did NOT complete successfully
_run_cmd -> had a non-zero return code of 1.
make: *** [/nightly/current_run/opentitan/hw/dv/tools/dvsim/sim.mk:58: sw_build] Error 1
rom_volatile_raw_unlock 42667889896548247757077485940778785045376046103287101310120973673863849552945 None
---- STDERR ----
Another command (pid=267745) is running. Waiting for it to complete on the server (server_pid=264331)...
WARNING: Target pattern parsing failed.
ERROR: Skipping '//sw/device/silicon_creator/rom/e2e:empty_test_slot_a_fake_ecdsa_test_key_0_sim_dv': no such target '//sw/device/silicon_creator/rom/e2e:empty_test_slot_a_fake_ecdsa_test_key_0_sim_dv': target 'empty_test_slot_a_fake_ecdsa_test_key_0_sim_dv' not declared in package 'sw/device/silicon_creator/rom/e2e' defined by /nightly/current_run/opentitan/sw/device/silicon_creator/rom/e2e/BUILD
ERROR: no such target '//sw/device/silicon_creator/rom/e2e:empty_test_slot_a_fake_ecdsa_test_key_0_sim_dv': target 'empty_test_slot_a_fake_ecdsa_test_key_0_sim_dv' not declared in package 'sw/device/silicon_creator/rom/e2e' defined by /nightly/current_run/opentitan/sw/device/silicon_creator/rom/e2e/BUILD
ERROR: Build did NOT complete successfully
_run_cmd -> had a non-zero return code of 1.
make: *** [/nightly/current_run/opentitan/hw/dv/tools/dvsim/sim.mk:58: sw_build] Error 1
rom_raw_unlock 8325691062186909498400729536976033691530438718235996120285150629176228628860 None
Another command (pid=267745) is running. Waiting for it to complete on the server (server_pid=264331)...
Another command (pid=272062) is running. Waiting for it to complete on the server (server_pid=264331)...
Another command (pid=272280) is running. Waiting for it to complete on the server (server_pid=264331)...
WARNING: Target pattern parsing failed.
ERROR: Skipping '//sw/device/silicon_creator/rom/e2e:empty_test_slot_a_fake_ecdsa_test_key_0_sim_dv': no such target '//sw/device/silicon_creator/rom/e2e:empty_test_slot_a_fake_ecdsa_test_key_0_sim_dv': target 'empty_test_slot_a_fake_ecdsa_test_key_0_sim_dv' not declared in package 'sw/device/silicon_creator/rom/e2e' defined by /nightly/current_run/opentitan/sw/device/silicon_creator/rom/e2e/BUILD
ERROR: no such target '//sw/device/silicon_creator/rom/e2e:empty_test_slot_a_fake_ecdsa_test_key_0_sim_dv': target 'empty_test_slot_a_fake_ecdsa_test_key_0_sim_dv' not declared in package 'sw/device/silicon_creator/rom/e2e' defined by /nightly/current_run/opentitan/sw/device/silicon_creator/rom/e2e/BUILD
ERROR: Build did NOT complete successfully
_run_cmd -> had a non-zero return code of 1.
make: *** [/nightly/current_run/opentitan/hw/dv/tools/dvsim/sim.mk:58: sw_build] Error 1
rom_e2e_self_hash 70980217699946249079050202105987573406756930747481469895139382301365250332211 None
Another command (pid=283374) is running. Waiting for it to complete on the server (server_pid=264331)...
Another command (pid=274276) is running. Waiting for it to complete on the server (server_pid=264331)...
Another command (pid=292835) is running. Waiting for it to complete on the server (server_pid=264331)...
WARNING: Target pattern parsing failed.
ERROR: Skipping '//sw/device/silicon_creator/rom/e2e/release:rom_e2e_self_hash_test_sim_dv': no such target '//sw/device/silicon_creator/rom/e2e/release:rom_e2e_self_hash_test_sim_dv': target 'rom_e2e_self_hash_test_sim_dv' not declared in package 'sw/device/silicon_creator/rom/e2e/release' defined by /nightly/current_run/opentitan/sw/device/silicon_creator/rom/e2e/release/BUILD
ERROR: no such target '//sw/device/silicon_creator/rom/e2e/release:rom_e2e_self_hash_test_sim_dv': target 'rom_e2e_self_hash_test_sim_dv' not declared in package 'sw/device/silicon_creator/rom/e2e/release' defined by /nightly/current_run/opentitan/sw/device/silicon_creator/rom/e2e/release/BUILD
ERROR: Build did NOT complete successfully
_run_cmd -> had a non-zero return code of 1.
make: *** [/nightly/current_run/opentitan/hw/dv/tools/dvsim/sim.mk:58: sw_build] Error 1
chip_sw_pwrmgr_sleep_wake_5_bug 16475033465887327289082293989326992616645754409269542762631188940226491599764 None
---- STDERR ----
Another command (pid=4139883) is running. Waiting for it to complete on the server (server_pid=264331)...
WARNING: Target pattern parsing failed.
ERROR: Skipping '//sw/device/tests:pwrmgr_sleep_wake_5_bug_test_sim_dv': no such target '//sw/device/tests:pwrmgr_sleep_wake_5_bug_test_sim_dv': target 'pwrmgr_sleep_wake_5_bug_test_sim_dv' not declared in package 'sw/device/tests' defined by /nightly/current_run/opentitan/sw/device/tests/BUILD
ERROR: no such target '//sw/device/tests:pwrmgr_sleep_wake_5_bug_test_sim_dv': target 'pwrmgr_sleep_wake_5_bug_test_sim_dv' not declared in package 'sw/device/tests' defined by /nightly/current_run/opentitan/sw/device/tests/BUILD
ERROR: Build did NOT complete successfully
_run_cmd -> had a non-zero return code of 1.
make: *** [/nightly/current_run/opentitan/hw/dv/tools/dvsim/sim.mk:58: sw_build] Error 1
chip_sw_otbn_ecdsa_op_irq_jitter_en_reduced_freq 105534774137723043892062053978114031212197481606486182625080161745717437732214 None
File "/nightly/runs/.cache/bazel/_bazel_root/5fbabd58f74ed10ce4d4abef6fdbdfee/external/bazel_tools/tools/build_defs/repo/http.bzl", line 137, column 45, in _http_archive_impl
download_info = ctx.download_and_extract(
Error in download_and_extract: java.io.IOException: Error downloading [https://github.com/sphincs/sphincsplus/archive/129b72c80e122a22a61f71b5d2b042770890ccee.tar.gz] to /nightly/runs/.cache/bazel/_bazel_root/5fbabd58f74ed10ce4d4abef6fdbdfee/external/+sphincsplus+sphincsplus_fips205_ipd/temp4194218562317732257/129b72c80e122a22a61f71b5d2b042770890ccee.tar.gz: GET returned 502 Bad Gateway or Proxy Error
ERROR: no such package '@@+sphincsplus+sphincsplus_fips205_ipd//': java.io.IOException: Error downloading [https://github.com/sphincs/sphincsplus/archive/129b72c80e122a22a61f71b5d2b042770890ccee.tar.gz] to /nightly/runs/.cache/bazel/_bazel_root/5fbabd58f74ed10ce4d4abef6fdbdfee/external/+sphincsplus+sphincsplus_fips205_ipd/temp4194218562317732257/129b72c80e122a22a61f71b5d2b042770890ccee.tar.gz: GET returned 502 Bad Gateway or Proxy Error
ERROR: /nightly/current_run/opentitan/sw/host/sphincsplus/BUILD:34:21: //sw/host/sphincsplus:bindgen_sha2_128s_simple__bindgen depends on @@+sphincsplus+sphincsplus_fips205_ipd//:api.h in repository @@+sphincsplus+sphincsplus_fips205_ipd which failed to fetch. no such package '@@+sphincsplus+sphincsplus_fips205_ipd//': java.io.IOException: Error downloading [https://github.com/sphincs/sphincsplus/archive/129b72c80e122a22a61f71b5d2b042770890ccee.tar.gz] to /nightly/runs/.cache/bazel/_bazel_root/5fbabd58f74ed10ce4d4abef6fdbdfee/external/+sphincsplus+sphincsplus_fips205_ipd/temp4194218562317732257/129b72c80e122a22a61f71b5d2b042770890ccee.tar.gz: GET returned 502 Bad Gateway or Proxy Error
ERROR: Analysis of target '//sw/device/tests:otbn_ecdsa_op_irq_test_sim_dv' failed; build aborted: Analysis failed
ERROR: Build did NOT complete successfully
_run_cmd -> had a non-zero return code of 1.
make: *** [/nightly/current_run/opentitan/hw/dv/tools/dvsim/sim.mk:58: sw_build] Error 1
rom_e2e_asm_init_test_unlocked0 22378271933942222121155616402489650377807125196939959386217902138533391604407 None
Another command (pid=274548) is running. Waiting for it to complete on the server (server_pid=264331)...
Another command (pid=285117) is running. Waiting for it to complete on the server (server_pid=264331)...
Another command (pid=285169) is running. Waiting for it to complete on the server (server_pid=264331)...
WARNING: Target pattern parsing failed.
ERROR: Skipping '//sw/device/silicon_creator/rom/e2e:empty_test_slot_a_fake_ecdsa_prod_key_0_sim_dv': no such target '//sw/device/silicon_creator/rom/e2e:empty_test_slot_a_fake_ecdsa_prod_key_0_sim_dv': target 'empty_test_slot_a_fake_ecdsa_prod_key_0_sim_dv' not declared in package 'sw/device/silicon_creator/rom/e2e' defined by /nightly/current_run/opentitan/sw/device/silicon_creator/rom/e2e/BUILD
ERROR: no such target '//sw/device/silicon_creator/rom/e2e:empty_test_slot_a_fake_ecdsa_prod_key_0_sim_dv': target 'empty_test_slot_a_fake_ecdsa_prod_key_0_sim_dv' not declared in package 'sw/device/silicon_creator/rom/e2e' defined by /nightly/current_run/opentitan/sw/device/silicon_creator/rom/e2e/BUILD
ERROR: Build did NOT complete successfully
_run_cmd -> had a non-zero return code of 1.
make: *** [/nightly/current_run/opentitan/hw/dv/tools/dvsim/sim.mk:58: sw_build] Error 1
rom_e2e_asm_init_dev 43335304765749507467761653756206122698052734342919327247042402469056510324025 None
---- STDOUT ----
---- STDERR ----
WARNING: Target pattern parsing failed.
ERROR: Skipping '//sw/device/silicon_creator/rom/e2e:empty_test_slot_a_fake_ecdsa_prod_key_0_sim_dv': no such target '//sw/device/silicon_creator/rom/e2e:empty_test_slot_a_fake_ecdsa_prod_key_0_sim_dv': target 'empty_test_slot_a_fake_ecdsa_prod_key_0_sim_dv' not declared in package 'sw/device/silicon_creator/rom/e2e' defined by /nightly/current_run/opentitan/sw/device/silicon_creator/rom/e2e/BUILD
ERROR: no such target '//sw/device/silicon_creator/rom/e2e:empty_test_slot_a_fake_ecdsa_prod_key_0_sim_dv': target 'empty_test_slot_a_fake_ecdsa_prod_key_0_sim_dv' not declared in package 'sw/device/silicon_creator/rom/e2e' defined by /nightly/current_run/opentitan/sw/device/silicon_creator/rom/e2e/BUILD
ERROR: Build did NOT complete successfully
_run_cmd -> had a non-zero return code of 1.
make: *** [/nightly/current_run/opentitan/hw/dv/tools/dvsim/sim.mk:58: sw_build] Error 1
rom_e2e_asm_init_prod 38777983621765335570803322889636760311610577868316862386644515681514602454844 None
---- STDOUT ----
---- STDERR ----
WARNING: Target pattern parsing failed.
ERROR: Skipping '//sw/device/silicon_creator/rom/e2e:empty_test_slot_a_fake_ecdsa_prod_key_0_sim_dv': no such target '//sw/device/silicon_creator/rom/e2e:empty_test_slot_a_fake_ecdsa_prod_key_0_sim_dv': target 'empty_test_slot_a_fake_ecdsa_prod_key_0_sim_dv' not declared in package 'sw/device/silicon_creator/rom/e2e' defined by /nightly/current_run/opentitan/sw/device/silicon_creator/rom/e2e/BUILD
ERROR: no such target '//sw/device/silicon_creator/rom/e2e:empty_test_slot_a_fake_ecdsa_prod_key_0_sim_dv': target 'empty_test_slot_a_fake_ecdsa_prod_key_0_sim_dv' not declared in package 'sw/device/silicon_creator/rom/e2e' defined by /nightly/current_run/opentitan/sw/device/silicon_creator/rom/e2e/BUILD
ERROR: Build did NOT complete successfully
_run_cmd -> had a non-zero return code of 1.
make: *** [/nightly/current_run/opentitan/hw/dv/tools/dvsim/sim.mk:58: sw_build] Error 1
rom_e2e_asm_init_prod_end 12403948974971141824128816785096392777276644076794664270982212654438621462523 None
---- STDOUT ----
---- STDERR ----
WARNING: Target pattern parsing failed.
ERROR: Skipping '//sw/device/silicon_creator/rom/e2e:empty_test_slot_a_fake_ecdsa_prod_key_0_sim_dv': no such target '//sw/device/silicon_creator/rom/e2e:empty_test_slot_a_fake_ecdsa_prod_key_0_sim_dv': target 'empty_test_slot_a_fake_ecdsa_prod_key_0_sim_dv' not declared in package 'sw/device/silicon_creator/rom/e2e' defined by /nightly/current_run/opentitan/sw/device/silicon_creator/rom/e2e/BUILD
ERROR: no such target '//sw/device/silicon_creator/rom/e2e:empty_test_slot_a_fake_ecdsa_prod_key_0_sim_dv': target 'empty_test_slot_a_fake_ecdsa_prod_key_0_sim_dv' not declared in package 'sw/device/silicon_creator/rom/e2e' defined by /nightly/current_run/opentitan/sw/device/silicon_creator/rom/e2e/BUILD
ERROR: Build did NOT complete successfully
_run_cmd -> had a non-zero return code of 1.
make: *** [/nightly/current_run/opentitan/hw/dv/tools/dvsim/sim.mk:58: sw_build] Error 1
rom_e2e_asm_init_rma 58375831965632362103224385040632999290145429939434145167144562719002206317519 None
---- STDOUT ----
---- STDERR ----
WARNING: Target pattern parsing failed.
ERROR: Skipping '//sw/device/silicon_creator/rom/e2e:empty_test_slot_a_fake_ecdsa_prod_key_0_sim_dv': no such target '//sw/device/silicon_creator/rom/e2e:empty_test_slot_a_fake_ecdsa_prod_key_0_sim_dv': target 'empty_test_slot_a_fake_ecdsa_prod_key_0_sim_dv' not declared in package 'sw/device/silicon_creator/rom/e2e' defined by /nightly/current_run/opentitan/sw/device/silicon_creator/rom/e2e/BUILD
ERROR: no such target '//sw/device/silicon_creator/rom/e2e:empty_test_slot_a_fake_ecdsa_prod_key_0_sim_dv': target 'empty_test_slot_a_fake_ecdsa_prod_key_0_sim_dv' not declared in package 'sw/device/silicon_creator/rom/e2e' defined by /nightly/current_run/opentitan/sw/device/silicon_creator/rom/e2e/BUILD
ERROR: Build did NOT complete successfully
_run_cmd -> had a non-zero return code of 1.
make: *** [/nightly/current_run/opentitan/hw/dv/tools/dvsim/sim.mk:58: sw_build] Error 1
rom_volatile_raw_unlock 88187321452262505037189979597937775618082107792658321354892519770417045925219 None
---- STDERR ----
Another command (pid=274548) is running. Waiting for it to complete on the server (server_pid=264331)...
WARNING: Target pattern parsing failed.
ERROR: Skipping '//sw/device/silicon_creator/rom/e2e:empty_test_slot_a_fake_ecdsa_test_key_0_sim_dv': no such target '//sw/device/silicon_creator/rom/e2e:empty_test_slot_a_fake_ecdsa_test_key_0_sim_dv': target 'empty_test_slot_a_fake_ecdsa_test_key_0_sim_dv' not declared in package 'sw/device/silicon_creator/rom/e2e' defined by /nightly/current_run/opentitan/sw/device/silicon_creator/rom/e2e/BUILD
ERROR: no such target '//sw/device/silicon_creator/rom/e2e:empty_test_slot_a_fake_ecdsa_test_key_0_sim_dv': target 'empty_test_slot_a_fake_ecdsa_test_key_0_sim_dv' not declared in package 'sw/device/silicon_creator/rom/e2e' defined by /nightly/current_run/opentitan/sw/device/silicon_creator/rom/e2e/BUILD
ERROR: Build did NOT complete successfully
_run_cmd -> had a non-zero return code of 1.
make: *** [/nightly/current_run/opentitan/hw/dv/tools/dvsim/sim.mk:58: sw_build] Error 1
rom_raw_unlock 13821302951432590989456448077398260840201969059530179820439257578599388880899 None
Another command (pid=274548) is running. Waiting for it to complete on the server (server_pid=264331)...
Another command (pid=285117) is running. Waiting for it to complete on the server (server_pid=264331)...
Another command (pid=285169) is running. Waiting for it to complete on the server (server_pid=264331)...
WARNING: Target pattern parsing failed.
ERROR: Skipping '//sw/device/silicon_creator/rom/e2e:empty_test_slot_a_fake_ecdsa_test_key_0_sim_dv': no such target '//sw/device/silicon_creator/rom/e2e:empty_test_slot_a_fake_ecdsa_test_key_0_sim_dv': target 'empty_test_slot_a_fake_ecdsa_test_key_0_sim_dv' not declared in package 'sw/device/silicon_creator/rom/e2e' defined by /nightly/current_run/opentitan/sw/device/silicon_creator/rom/e2e/BUILD
ERROR: no such target '//sw/device/silicon_creator/rom/e2e:empty_test_slot_a_fake_ecdsa_test_key_0_sim_dv': target 'empty_test_slot_a_fake_ecdsa_test_key_0_sim_dv' not declared in package 'sw/device/silicon_creator/rom/e2e' defined by /nightly/current_run/opentitan/sw/device/silicon_creator/rom/e2e/BUILD
ERROR: Build did NOT complete successfully
_run_cmd -> had a non-zero return code of 1.
make: *** [/nightly/current_run/opentitan/hw/dv/tools/dvsim/sim.mk:58: sw_build] Error 1
rom_e2e_self_hash 12168479450706730883649591033853556407225357327622046465471904530451238294765 None
Another command (pid=274276) is running. Waiting for it to complete on the server (server_pid=264331)...
Another command (pid=294310) is running. Waiting for it to complete on the server (server_pid=264331)...
Another command (pid=295383) is running. Waiting for it to complete on the server (server_pid=264331)...
WARNING: Target pattern parsing failed.
ERROR: Skipping '//sw/device/silicon_creator/rom/e2e/release:rom_e2e_self_hash_test_sim_dv': no such target '//sw/device/silicon_creator/rom/e2e/release:rom_e2e_self_hash_test_sim_dv': target 'rom_e2e_self_hash_test_sim_dv' not declared in package 'sw/device/silicon_creator/rom/e2e/release' defined by /nightly/current_run/opentitan/sw/device/silicon_creator/rom/e2e/release/BUILD
ERROR: no such target '//sw/device/silicon_creator/rom/e2e/release:rom_e2e_self_hash_test_sim_dv': target 'rom_e2e_self_hash_test_sim_dv' not declared in package 'sw/device/silicon_creator/rom/e2e/release' defined by /nightly/current_run/opentitan/sw/device/silicon_creator/rom/e2e/release/BUILD
ERROR: Build did NOT complete successfully
_run_cmd -> had a non-zero return code of 1.
make: *** [/nightly/current_run/opentitan/hw/dv/tools/dvsim/sim.mk:58: sw_build] Error 1
chip_sw_pwrmgr_sleep_wake_5_bug 26015392274423843402736248963169251025458061221222101699661216958665689145313 None
---- STDERR ----
Another command (pid=905661) is running. Waiting for it to complete on the server (server_pid=264331)...
WARNING: Target pattern parsing failed.
ERROR: Skipping '//sw/device/tests:pwrmgr_sleep_wake_5_bug_test_sim_dv': no such target '//sw/device/tests:pwrmgr_sleep_wake_5_bug_test_sim_dv': target 'pwrmgr_sleep_wake_5_bug_test_sim_dv' not declared in package 'sw/device/tests' defined by /nightly/current_run/opentitan/sw/device/tests/BUILD
ERROR: no such target '//sw/device/tests:pwrmgr_sleep_wake_5_bug_test_sim_dv': target 'pwrmgr_sleep_wake_5_bug_test_sim_dv' not declared in package 'sw/device/tests' defined by /nightly/current_run/opentitan/sw/device/tests/BUILD
ERROR: Build did NOT complete successfully
_run_cmd -> had a non-zero return code of 1.
make: *** [/nightly/current_run/opentitan/hw/dv/tools/dvsim/sim.mk:58: sw_build] Error 1
rom_e2e_asm_init_test_unlocked0 47302825002938192746901467574603618768490481854755150711632599895258356395762 None
Another command (pid=285169) is running. Waiting for it to complete on the server (server_pid=264331)...
Another command (pid=293040) is running. Waiting for it to complete on the server (server_pid=264331)...
Another command (pid=274276) is running. Waiting for it to complete on the server (server_pid=264331)...
WARNING: Target pattern parsing failed.
ERROR: Skipping '//sw/device/silicon_creator/rom/e2e:empty_test_slot_a_fake_ecdsa_prod_key_0_sim_dv': no such target '//sw/device/silicon_creator/rom/e2e:empty_test_slot_a_fake_ecdsa_prod_key_0_sim_dv': target 'empty_test_slot_a_fake_ecdsa_prod_key_0_sim_dv' not declared in package 'sw/device/silicon_creator/rom/e2e' defined by /nightly/current_run/opentitan/sw/device/silicon_creator/rom/e2e/BUILD
ERROR: no such target '//sw/device/silicon_creator/rom/e2e:empty_test_slot_a_fake_ecdsa_prod_key_0_sim_dv': target 'empty_test_slot_a_fake_ecdsa_prod_key_0_sim_dv' not declared in package 'sw/device/silicon_creator/rom/e2e' defined by /nightly/current_run/opentitan/sw/device/silicon_creator/rom/e2e/BUILD
ERROR: Build did NOT complete successfully
_run_cmd -> had a non-zero return code of 1.
make: *** [/nightly/current_run/opentitan/hw/dv/tools/dvsim/sim.mk:58: sw_build] Error 1
rom_e2e_asm_init_dev 32420084237511522319636373945946255208650243808239417396614611764667055169152 None
---- STDOUT ----
---- STDERR ----
WARNING: Target pattern parsing failed.
ERROR: Skipping '//sw/device/silicon_creator/rom/e2e:empty_test_slot_a_fake_ecdsa_prod_key_0_sim_dv': no such target '//sw/device/silicon_creator/rom/e2e:empty_test_slot_a_fake_ecdsa_prod_key_0_sim_dv': target 'empty_test_slot_a_fake_ecdsa_prod_key_0_sim_dv' not declared in package 'sw/device/silicon_creator/rom/e2e' defined by /nightly/current_run/opentitan/sw/device/silicon_creator/rom/e2e/BUILD
ERROR: no such target '//sw/device/silicon_creator/rom/e2e:empty_test_slot_a_fake_ecdsa_prod_key_0_sim_dv': target 'empty_test_slot_a_fake_ecdsa_prod_key_0_sim_dv' not declared in package 'sw/device/silicon_creator/rom/e2e' defined by /nightly/current_run/opentitan/sw/device/silicon_creator/rom/e2e/BUILD
ERROR: Build did NOT complete successfully
_run_cmd -> had a non-zero return code of 1.
make: *** [/nightly/current_run/opentitan/hw/dv/tools/dvsim/sim.mk:58: sw_build] Error 1
rom_e2e_asm_init_prod 37934504600485385995108330722596768648868899331821728121194311984141164141262 None
---- STDOUT ----
---- STDERR ----
WARNING: Target pattern parsing failed.
ERROR: Skipping '//sw/device/silicon_creator/rom/e2e:empty_test_slot_a_fake_ecdsa_prod_key_0_sim_dv': no such target '//sw/device/silicon_creator/rom/e2e:empty_test_slot_a_fake_ecdsa_prod_key_0_sim_dv': target 'empty_test_slot_a_fake_ecdsa_prod_key_0_sim_dv' not declared in package 'sw/device/silicon_creator/rom/e2e' defined by /nightly/current_run/opentitan/sw/device/silicon_creator/rom/e2e/BUILD
ERROR: no such target '//sw/device/silicon_creator/rom/e2e:empty_test_slot_a_fake_ecdsa_prod_key_0_sim_dv': target 'empty_test_slot_a_fake_ecdsa_prod_key_0_sim_dv' not declared in package 'sw/device/silicon_creator/rom/e2e' defined by /nightly/current_run/opentitan/sw/device/silicon_creator/rom/e2e/BUILD
ERROR: Build did NOT complete successfully
_run_cmd -> had a non-zero return code of 1.
make: *** [/nightly/current_run/opentitan/hw/dv/tools/dvsim/sim.mk:58: sw_build] Error 1
rom_e2e_asm_init_prod_end 2365892047789663326401926771483953453511404314869828964397471901595169733343 None
---- STDOUT ----
---- STDERR ----
WARNING: Target pattern parsing failed.
ERROR: Skipping '//sw/device/silicon_creator/rom/e2e:empty_test_slot_a_fake_ecdsa_prod_key_0_sim_dv': no such target '//sw/device/silicon_creator/rom/e2e:empty_test_slot_a_fake_ecdsa_prod_key_0_sim_dv': target 'empty_test_slot_a_fake_ecdsa_prod_key_0_sim_dv' not declared in package 'sw/device/silicon_creator/rom/e2e' defined by /nightly/current_run/opentitan/sw/device/silicon_creator/rom/e2e/BUILD
ERROR: no such target '//sw/device/silicon_creator/rom/e2e:empty_test_slot_a_fake_ecdsa_prod_key_0_sim_dv': target 'empty_test_slot_a_fake_ecdsa_prod_key_0_sim_dv' not declared in package 'sw/device/silicon_creator/rom/e2e' defined by /nightly/current_run/opentitan/sw/device/silicon_creator/rom/e2e/BUILD
ERROR: Build did NOT complete successfully
_run_cmd -> had a non-zero return code of 1.
make: *** [/nightly/current_run/opentitan/hw/dv/tools/dvsim/sim.mk:58: sw_build] Error 1
rom_e2e_asm_init_rma 1756106798345903307577400139635793756656461169759101432273636587146705576699 None
---- STDOUT ----
---- STDERR ----
WARNING: Target pattern parsing failed.
ERROR: Skipping '//sw/device/silicon_creator/rom/e2e:empty_test_slot_a_fake_ecdsa_prod_key_0_sim_dv': no such target '//sw/device/silicon_creator/rom/e2e:empty_test_slot_a_fake_ecdsa_prod_key_0_sim_dv': target 'empty_test_slot_a_fake_ecdsa_prod_key_0_sim_dv' not declared in package 'sw/device/silicon_creator/rom/e2e' defined by /nightly/current_run/opentitan/sw/device/silicon_creator/rom/e2e/BUILD
ERROR: no such target '//sw/device/silicon_creator/rom/e2e:empty_test_slot_a_fake_ecdsa_prod_key_0_sim_dv': target 'empty_test_slot_a_fake_ecdsa_prod_key_0_sim_dv' not declared in package 'sw/device/silicon_creator/rom/e2e' defined by /nightly/current_run/opentitan/sw/device/silicon_creator/rom/e2e/BUILD
ERROR: Build did NOT complete successfully
_run_cmd -> had a non-zero return code of 1.
make: *** [/nightly/current_run/opentitan/hw/dv/tools/dvsim/sim.mk:58: sw_build] Error 1
rom_volatile_raw_unlock 67898695735805771298959169609650815000868896691345508088309171335119764767690 None
---- STDERR ----
Another command (pid=296256) is running. Waiting for it to complete on the server (server_pid=264331)...
Another command (pid=302005) is running. Waiting for it to complete on the server (server_pid=264331)...
WARNING: Target pattern parsing failed.
ERROR: Skipping '//sw/device/silicon_creator/rom/e2e:empty_test_slot_a_fake_ecdsa_test_key_0_sim_dv': no such target '//sw/device/silicon_creator/rom/e2e:empty_test_slot_a_fake_ecdsa_test_key_0_sim_dv': target 'empty_test_slot_a_fake_ecdsa_test_key_0_sim_dv' not declared in package 'sw/device/silicon_creator/rom/e2e' defined by /nightly/current_run/opentitan/sw/device/silicon_creator/rom/e2e/BUILD
ERROR: no such target '//sw/device/silicon_creator/rom/e2e:empty_test_slot_a_fake_ecdsa_test_key_0_sim_dv': target 'empty_test_slot_a_fake_ecdsa_test_key_0_sim_dv' not declared in package 'sw/device/silicon_creator/rom/e2e' defined by /nightly/current_run/opentitan/sw/device/silicon_creator/rom/e2e/BUILD
ERROR: Build did NOT complete successfully
_run_cmd -> had a non-zero return code of 1.
make: *** [/nightly/current_run/opentitan/hw/dv/tools/dvsim/sim.mk:58: sw_build] Error 1
rom_raw_unlock 53766862367790284872637642752408888930426653928439142613551817493762221059898 None
Another command (pid=297954) is running. Waiting for it to complete on the server (server_pid=264331)...
Another command (pid=302056) is running. Waiting for it to complete on the server (server_pid=264331)...
Another command (pid=297170) is running. Waiting for it to complete on the server (server_pid=264331)...
WARNING: Target pattern parsing failed.
ERROR: Skipping '//sw/device/silicon_creator/rom/e2e:empty_test_slot_a_fake_ecdsa_test_key_0_sim_dv': no such target '//sw/device/silicon_creator/rom/e2e:empty_test_slot_a_fake_ecdsa_test_key_0_sim_dv': target 'empty_test_slot_a_fake_ecdsa_test_key_0_sim_dv' not declared in package 'sw/device/silicon_creator/rom/e2e' defined by /nightly/current_run/opentitan/sw/device/silicon_creator/rom/e2e/BUILD
ERROR: no such target '//sw/device/silicon_creator/rom/e2e:empty_test_slot_a_fake_ecdsa_test_key_0_sim_dv': target 'empty_test_slot_a_fake_ecdsa_test_key_0_sim_dv' not declared in package 'sw/device/silicon_creator/rom/e2e' defined by /nightly/current_run/opentitan/sw/device/silicon_creator/rom/e2e/BUILD
ERROR: Build did NOT complete successfully
_run_cmd -> had a non-zero return code of 1.
make: *** [/nightly/current_run/opentitan/hw/dv/tools/dvsim/sim.mk:58: sw_build] Error 1
rom_e2e_self_hash 102617981822643377231538124338052853972199690813373870776971612822085348206190 None
---- STDERR ----
Another command (pid=274548) is running. Waiting for it to complete on the server (server_pid=264331)...
Another command (pid=285169) is running. Waiting for it to complete on the server (server_pid=264331)...
WARNING: Target pattern parsing failed.
ERROR: Skipping '//sw/device/silicon_creator/rom/e2e/release:rom_e2e_self_hash_test_sim_dv': no such target '//sw/device/silicon_creator/rom/e2e/release:rom_e2e_self_hash_test_sim_dv': target 'rom_e2e_self_hash_test_sim_dv' not declared in package 'sw/device/silicon_creator/rom/e2e/release' defined by /nightly/current_run/opentitan/sw/device/silicon_creator/rom/e2e/release/BUILD
ERROR: no such target '//sw/device/silicon_creator/rom/e2e/release:rom_e2e_self_hash_test_sim_dv': target 'rom_e2e_self_hash_test_sim_dv' not declared in package 'sw/device/silicon_creator/rom/e2e/release' defined by /nightly/current_run/opentitan/sw/device/silicon_creator/rom/e2e/release/BUILD
ERROR: Build did NOT complete successfully
_run_cmd -> had a non-zero return code of 1.
make: *** [/nightly/current_run/opentitan/hw/dv/tools/dvsim/sim.mk:58: sw_build] Error 1
UVM_ERROR @ * us: (cip_base_scoreboard.sv:575) scoreboard [scoreboard] On interface chip_reg_block, item had unexpected d_error value(predicted *, but saw *). 28 test runs
chip_tl_errors 100453286656311964600718661605587013885534168672864017585137922061420455817346 217
TL item was: req: (cip_tl_seq_item@35858) { a_addr: 'h10674 a_data: 'h66ac2900 a_mask: 'hf a_size: 'h2 a_param: 'h0 a_source: 'h9 a_opcode: 'h4 a_user: 'h186e3 d_param: 'h0 d_source: 'h9 d_data: 'h0 d_size: 'h2 d_opcode: 'h1 d_error: 'h0 d_sink: 'h0 d_user: 'hd2a a_valid_delay: 'h0 d_valid_delay: 'h0 a_valid_len: 'h0 d_valid_len: 'h0 req_abort_after_a_valid_len: 'h0 rsp_abort_after_d_valid_len: 'h0 req_completed: 'h0 rsp_completed: 'h0 tl_intg_err_type: TlIntgErrNone max_ecc_errors: 'h3 }
Reasons for predicted error: '{"Fetch from CSR"} .
UVM_INFO @ 1938.361677 us: (uvm_report_catcher.svh:705) [UVM/REPORT/CATCHER]
--- UVM Report catcher Summary ---
chip_tl_errors 85253468501550706174011631165139654592791845367921426602012741719917176379079 217
TL item was: req: (cip_tl_seq_item@34736) { a_addr: 'h10548 a_data: 'h821bc2a4 a_mask: 'hf a_size: 'h2 a_param: 'h0 a_source: 'hc a_opcode: 'h4 a_user: 'h1aef3 d_param: 'h0 d_source: 'hc d_data: 'h0 d_size: 'h2 d_opcode: 'h1 d_error: 'h0 d_sink: 'h0 d_user: 'hd2a a_valid_delay: 'h0 d_valid_delay: 'h0 a_valid_len: 'h0 d_valid_len: 'h0 req_abort_after_a_valid_len: 'h0 rsp_abort_after_d_valid_len: 'h0 req_completed: 'h0 rsp_completed: 'h0 tl_intg_err_type: TlIntgErrNone max_ecc_errors: 'h3 }
Reasons for predicted error: '{"Fetch from CSR"} .
UVM_INFO @ 2270.192424 us: (uvm_report_catcher.svh:705) [UVM/REPORT/CATCHER]
--- UVM Report catcher Summary ---
chip_csr_mem_rw_with_rand_reset 88784096487879873754228545031628322034057802937934015190976111753441290210106 224
TL item was: req: (cip_tl_seq_item@32430) { a_addr: 'h10574 a_data: 'haf2100ed a_mask: 'hf a_size: 'h2 a_param: 'h0 a_source: 'h3b a_opcode: 'h4 a_user: 'h18a82 d_param: 'h0 d_source: 'h3b d_data: 'h0 d_size: 'h2 d_opcode: 'h1 d_error: 'h0 d_sink: 'h0 d_user: 'hd2a a_valid_delay: 'h0 d_valid_delay: 'h0 a_valid_len: 'h0 d_valid_len: 'h0 req_abort_after_a_valid_len: 'h0 rsp_abort_after_d_valid_len: 'h0 req_completed: 'h0 rsp_completed: 'h0 tl_intg_err_type: TlIntgErrNone max_ecc_errors: 'h3 }
Reasons for predicted error: '{"Fetch from CSR"} .
UVM_INFO @ 2776.813500 us: (uvm_report_catcher.svh:705) [UVM/REPORT/CATCHER]
--- UVM Report catcher Summary ---
chip_tl_errors 88455987430116545034926961143012029403846350579935576211696263523303526737560 228
TL item was: req: (cip_tl_seq_item@42134) { a_addr: 'h10448 a_data: 'h7c12fe6a a_mask: 'hf a_size: 'h2 a_param: 'h0 a_source: 'h37 a_opcode: 'h4 a_user: 'h1a9ff d_param: 'h0 d_source: 'h37 d_data: 'h0 d_size: 'h2 d_opcode: 'h1 d_error: 'h0 d_sink: 'h0 d_user: 'hd2a a_valid_delay: 'h0 d_valid_delay: 'h0 a_valid_len: 'h0 d_valid_len: 'h0 req_abort_after_a_valid_len: 'h0 rsp_abort_after_d_valid_len: 'h0 req_completed: 'h0 rsp_completed: 'h0 tl_intg_err_type: TlIntgErrNone max_ecc_errors: 'h3 }
Reasons for predicted error: '{"Fetch from CSR"} .
UVM_INFO @ 2222.903713 us: (uvm_report_catcher.svh:705) [UVM/REPORT/CATCHER]
--- UVM Report catcher Summary ---
chip_tl_errors 25852749087089858516605387362235976931623866859151103883252597008269192866598 218
TL item was: req: (cip_tl_seq_item@104138) { a_addr: 'h107fc a_data: 'hac28ecf1 a_mask: 'hf a_size: 'h2 a_param: 'h0 a_source: 'h19 a_opcode: 'h4 a_user: 'h1a5d2 d_param: 'h0 d_source: 'h19 d_data: 'h0 d_size: 'h2 d_opcode: 'h1 d_error: 'h0 d_sink: 'h0 d_user: 'hd2a a_valid_delay: 'h0 d_valid_delay: 'h0 a_valid_len: 'h0 d_valid_len: 'h0 req_abort_after_a_valid_len: 'h0 rsp_abort_after_d_valid_len: 'h0 req_completed: 'h0 rsp_completed: 'h0 tl_intg_err_type: TlIntgErrNone max_ecc_errors: 'h3 }
Reasons for predicted error: '{"Fetch from CSR"} .
UVM_INFO @ 2718.543910 us: (uvm_report_catcher.svh:705) [UVM/REPORT/CATCHER]
--- UVM Report catcher Summary ---
chip_csr_mem_rw_with_rand_reset 31060375847785833534889922800963709878235224122625794827980328423453926995257 224
TL item was: req: (cip_tl_seq_item@32008) { a_addr: 'h1044c a_data: 'hec477b9b a_mask: 'hf a_size: 'h2 a_param: 'h0 a_source: 'h20 a_opcode: 'h4 a_user: 'h1a513 d_param: 'h0 d_source: 'h20 d_data: 'h0 d_size: 'h2 d_opcode: 'h1 d_error: 'h0 d_sink: 'h0 d_user: 'hd2a a_valid_delay: 'h0 d_valid_delay: 'h0 a_valid_len: 'h0 d_valid_len: 'h0 req_abort_after_a_valid_len: 'h0 rsp_abort_after_d_valid_len: 'h0 req_completed: 'h0 rsp_completed: 'h0 tl_intg_err_type: TlIntgErrNone max_ecc_errors: 'h3 }
Reasons for predicted error: '{"Fetch from CSR"} .
UVM_INFO @ 2336.568230 us: (uvm_report_catcher.svh:705) [UVM/REPORT/CATCHER]
--- UVM Report catcher Summary ---
chip_tl_errors 111044674690365623522581407847593853395469221606929246445292062935455269341341 217
TL item was: req: (cip_tl_seq_item@34412) { a_addr: 'h1062c a_data: 'h9131ae61 a_mask: 'hf a_size: 'h2 a_param: 'h0 a_source: 'h27 a_opcode: 'h4 a_user: 'h19e26 d_param: 'h0 d_source: 'h27 d_data: 'h0 d_size: 'h2 d_opcode: 'h1 d_error: 'h0 d_sink: 'h0 d_user: 'hd2a a_valid_delay: 'h0 d_valid_delay: 'h0 a_valid_len: 'h0 d_valid_len: 'h0 req_abort_after_a_valid_len: 'h0 rsp_abort_after_d_valid_len: 'h0 req_completed: 'h0 rsp_completed: 'h0 tl_intg_err_type: TlIntgErrNone max_ecc_errors: 'h3 }
Reasons for predicted error: '{"Fetch from CSR"} .
UVM_INFO @ 2629.287320 us: (uvm_report_catcher.svh:705) [UVM/REPORT/CATCHER]
--- UVM Report catcher Summary ---
chip_tl_errors 44437168157253531196968782550322664364181505246729275830299157416782297629293 218
TL item was: req: (cip_tl_seq_item@140662) { a_addr: 'h1067c a_data: 'heb817303 a_mask: 'hf a_size: 'h2 a_param: 'h0 a_source: 'h30 a_opcode: 'h4 a_user: 'h1920c d_param: 'h0 d_source: 'h30 d_data: 'h0 d_size: 'h2 d_opcode: 'h1 d_error: 'h0 d_sink: 'h0 d_user: 'hd2a a_valid_delay: 'h0 d_valid_delay: 'h0 a_valid_len: 'h0 d_valid_len: 'h0 req_abort_after_a_valid_len: 'h0 rsp_abort_after_d_valid_len: 'h0 req_completed: 'h0 rsp_completed: 'h0 tl_intg_err_type: TlIntgErrNone max_ecc_errors: 'h3 }
Reasons for predicted error: '{"Fetch from CSR"} .
UVM_INFO @ 3240.709871 us: (uvm_report_catcher.svh:705) [UVM/REPORT/CATCHER]
--- UVM Report catcher Summary ---
chip_tl_errors 34897306698866357781208177943394554118395104098981167466713798483447047819684 217
TL item was: req: (cip_tl_seq_item@36500) { a_addr: 'h10510 a_data: 'h2dbd6c8b a_mask: 'hf a_size: 'h2 a_param: 'h0 a_source: 'h16 a_opcode: 'h4 a_user: 'h1b623 d_param: 'h0 d_source: 'h16 d_data: 'h0 d_size: 'h2 d_opcode: 'h1 d_error: 'h0 d_sink: 'h0 d_user: 'hd2a a_valid_delay: 'h0 d_valid_delay: 'h0 a_valid_len: 'h0 d_valid_len: 'h0 req_abort_after_a_valid_len: 'h0 rsp_abort_after_d_valid_len: 'h0 req_completed: 'h0 rsp_completed: 'h0 tl_intg_err_type: TlIntgErrNone max_ecc_errors: 'h3 }
Reasons for predicted error: '{"Fetch from CSR"} .
UVM_INFO @ 2748.456476 us: (uvm_report_catcher.svh:705) [UVM/REPORT/CATCHER]
--- UVM Report catcher Summary ---
chip_tl_errors 81225381844387489026695834503433311846848089590269961366562316046636237914589 217
TL item was: req: (cip_tl_seq_item@32650) { a_addr: 'h105a8 a_data: 'h81a0f233 a_mask: 'hf a_size: 'h2 a_param: 'h0 a_source: 'ha a_opcode: 'h4 a_user: 'h1ae1d d_param: 'h0 d_source: 'ha d_data: 'h0 d_size: 'h2 d_opcode: 'h1 d_error: 'h0 d_sink: 'h0 d_user: 'hd2a a_valid_delay: 'h0 d_valid_delay: 'h0 a_valid_len: 'h0 d_valid_len: 'h0 req_abort_after_a_valid_len: 'h0 rsp_abort_after_d_valid_len: 'h0 req_completed: 'h0 rsp_completed: 'h0 tl_intg_err_type: TlIntgErrNone max_ecc_errors: 'h3 }
Reasons for predicted error: '{"Fetch from CSR"} .
UVM_INFO @ 2383.954500 us: (uvm_report_catcher.svh:705) [UVM/REPORT/CATCHER]
--- UVM Report catcher Summary ---
chip_tl_errors 101085001746692984918272992873515164106718945968658117645328674366513017508069 217
TL item was: req: (cip_tl_seq_item@32030) { a_addr: 'h10760 a_data: 'h801835dd a_mask: 'hf a_size: 'h2 a_param: 'h0 a_source: 'h10 a_opcode: 'h4 a_user: 'h1a9c4 d_param: 'h0 d_source: 'h10 d_data: 'h0 d_size: 'h2 d_opcode: 'h1 d_error: 'h0 d_sink: 'h0 d_user: 'hd2a a_valid_delay: 'h0 d_valid_delay: 'h0 a_valid_len: 'h0 d_valid_len: 'h0 req_abort_after_a_valid_len: 'h0 rsp_abort_after_d_valid_len: 'h0 req_completed: 'h0 rsp_completed: 'h0 tl_intg_err_type: TlIntgErrNone max_ecc_errors: 'h3 }
Reasons for predicted error: '{"Fetch from CSR"} .
UVM_INFO @ 2609.244530 us: (uvm_report_catcher.svh:705) [UVM/REPORT/CATCHER]
--- UVM Report catcher Summary ---
chip_tl_errors 108495838618281664429863752644521823752203324530486500157153686826455334279250 217
TL item was: req: (cip_tl_seq_item@31538) { a_addr: 'h10714 a_data: 'h24c0914d a_mask: 'hf a_size: 'h2 a_param: 'h0 a_source: 'h22 a_opcode: 'h4 a_user: 'h1b197 d_param: 'h0 d_source: 'h22 d_data: 'h0 d_size: 'h2 d_opcode: 'h1 d_error: 'h0 d_sink: 'h0 d_user: 'hd2a a_valid_delay: 'h0 d_valid_delay: 'h0 a_valid_len: 'h0 d_valid_len: 'h0 req_abort_after_a_valid_len: 'h0 rsp_abort_after_d_valid_len: 'h0 req_completed: 'h0 rsp_completed: 'h0 tl_intg_err_type: TlIntgErrNone max_ecc_errors: 'h3 }
Reasons for predicted error: '{"Fetch from CSR"} .
UVM_INFO @ 2138.571976 us: (uvm_report_catcher.svh:705) [UVM/REPORT/CATCHER]
--- UVM Report catcher Summary ---
chip_tl_errors 40043395920028502235899188680594365382037586815472016956834646215107537602807 217
TL item was: req: (cip_tl_seq_item@34644) { a_addr: 'h104d8 a_data: 'ha5f0c139 a_mask: 'hf a_size: 'h2 a_param: 'h0 a_source: 'h3a a_opcode: 'h4 a_user: 'h1bddc d_param: 'h0 d_source: 'h3a d_data: 'h0 d_size: 'h2 d_opcode: 'h1 d_error: 'h0 d_sink: 'h0 d_user: 'hd2a a_valid_delay: 'h0 d_valid_delay: 'h0 a_valid_len: 'h0 d_valid_len: 'h0 req_abort_after_a_valid_len: 'h0 rsp_abort_after_d_valid_len: 'h0 req_completed: 'h0 rsp_completed: 'h0 tl_intg_err_type: TlIntgErrNone max_ecc_errors: 'h3 }
Reasons for predicted error: '{"Fetch from CSR"} .
UVM_INFO @ 2696.753400 us: (uvm_report_catcher.svh:705) [UVM/REPORT/CATCHER]
--- UVM Report catcher Summary ---
chip_tl_errors 24810200881595994936504204913600097194090330447951363389814047033170672900238 217
TL item was: req: (cip_tl_seq_item@34400) { a_addr: 'h105c4 a_data: 'h66c8df63 a_mask: 'hf a_size: 'h2 a_param: 'h0 a_source: 'h6 a_opcode: 'h4 a_user: 'h18634 d_param: 'h0 d_source: 'h6 d_data: 'h0 d_size: 'h2 d_opcode: 'h1 d_error: 'h0 d_sink: 'h0 d_user: 'hd2a a_valid_delay: 'h0 d_valid_delay: 'h0 a_valid_len: 'h0 d_valid_len: 'h0 req_abort_after_a_valid_len: 'h0 rsp_abort_after_d_valid_len: 'h0 req_completed: 'h0 rsp_completed: 'h0 tl_intg_err_type: TlIntgErrNone max_ecc_errors: 'h3 }
Reasons for predicted error: '{"Fetch from CSR"} .
UVM_INFO @ 2469.402280 us: (uvm_report_catcher.svh:705) [UVM/REPORT/CATCHER]
--- UVM Report catcher Summary ---
chip_tl_errors 79523447074721854173863633599520660152946083876912944900204619053132198141670 218
TL item was: req: (cip_tl_seq_item@50116) { a_addr: 'h10674 a_data: 'h5f76fbe8 a_mask: 'hf a_size: 'h2 a_param: 'h0 a_source: 'h8 a_opcode: 'h4 a_user: 'h186a6 d_param: 'h0 d_source: 'h8 d_data: 'h0 d_size: 'h2 d_opcode: 'h1 d_error: 'h0 d_sink: 'h0 d_user: 'hd2a a_valid_delay: 'h0 d_valid_delay: 'h0 a_valid_len: 'h0 d_valid_len: 'h0 req_abort_after_a_valid_len: 'h0 rsp_abort_after_d_valid_len: 'h0 req_completed: 'h0 rsp_completed: 'h0 tl_intg_err_type: TlIntgErrNone max_ecc_errors: 'h3 }
Reasons for predicted error: '{"Fetch from CSR"} .
UVM_INFO @ 1888.635274 us: (uvm_report_catcher.svh:705) [UVM/REPORT/CATCHER]
--- UVM Report catcher Summary ---
chip_tl_errors 62485153713401049762389699385331378690254363195109164280025457691556424716166 217
TL item was: req: (cip_tl_seq_item@34160) { a_addr: 'h105b0 a_data: 'h3f52a0b7 a_mask: 'hf a_size: 'h2 a_param: 'h0 a_source: 'h22 a_opcode: 'h4 a_user: 'h19e53 d_param: 'h0 d_source: 'h22 d_data: 'h0 d_size: 'h2 d_opcode: 'h1 d_error: 'h0 d_sink: 'h0 d_user: 'hd2a a_valid_delay: 'h0 d_valid_delay: 'h0 a_valid_len: 'h0 d_valid_len: 'h0 req_abort_after_a_valid_len: 'h0 rsp_abort_after_d_valid_len: 'h0 req_completed: 'h0 rsp_completed: 'h0 tl_intg_err_type: TlIntgErrNone max_ecc_errors: 'h3 }
Reasons for predicted error: '{"Fetch from CSR"} .
UVM_INFO @ 2296.476600 us: (uvm_report_catcher.svh:705) [UVM/REPORT/CATCHER]
--- UVM Report catcher Summary ---
chip_tl_errors 64110962612794347720382851872269462563568447326745849773957460697386733942178 217
TL item was: req: (cip_tl_seq_item@34122) { a_addr: 'h107e4 a_data: 'h983b8010 a_mask: 'hf a_size: 'h2 a_param: 'h0 a_source: 'h36 a_opcode: 'h4 a_user: 'h195b4 d_param: 'h0 d_source: 'h36 d_data: 'h0 d_size: 'h2 d_opcode: 'h1 d_error: 'h0 d_sink: 'h0 d_user: 'hd2a a_valid_delay: 'h0 d_valid_delay: 'h0 a_valid_len: 'h0 d_valid_len: 'h0 req_abort_after_a_valid_len: 'h0 rsp_abort_after_d_valid_len: 'h0 req_completed: 'h0 rsp_completed: 'h0 tl_intg_err_type: TlIntgErrNone max_ecc_errors: 'h3 }
Reasons for predicted error: '{"Fetch from CSR"} .
UVM_INFO @ 2137.819883 us: (uvm_report_catcher.svh:705) [UVM/REPORT/CATCHER]
--- UVM Report catcher Summary ---
chip_tl_errors 38285150681591336494625729193909440712543199626502819543610519508487689074820 217
TL item was: req: (cip_tl_seq_item@32394) { a_addr: 'h10690 a_data: 'h974161a9 a_mask: 'hf a_size: 'h2 a_param: 'h0 a_source: 'he a_opcode: 'h4 a_user: 'h18aaa d_param: 'h0 d_source: 'he d_data: 'h0 d_size: 'h2 d_opcode: 'h1 d_error: 'h0 d_sink: 'h0 d_user: 'hd2a a_valid_delay: 'h0 d_valid_delay: 'h0 a_valid_len: 'h0 d_valid_len: 'h0 req_abort_after_a_valid_len: 'h0 rsp_abort_after_d_valid_len: 'h0 req_completed: 'h0 rsp_completed: 'h0 tl_intg_err_type: TlIntgErrNone max_ecc_errors: 'h3 }
Reasons for predicted error: '{"Fetch from CSR"} .
UVM_INFO @ 2422.832765 us: (uvm_report_catcher.svh:705) [UVM/REPORT/CATCHER]
--- UVM Report catcher Summary ---
chip_tl_errors 101418866540045408495583228425484313752564329733991266270445239017052936044592 217
TL item was: req: (cip_tl_seq_item@36938) { a_addr: 'h10464 a_data: 'h2b19bb06 a_mask: 'hf a_size: 'h2 a_param: 'h0 a_source: 'h1f a_opcode: 'h4 a_user: 'h1a900 d_param: 'h0 d_source: 'h1f d_data: 'h0 d_size: 'h2 d_opcode: 'h1 d_error: 'h0 d_sink: 'h0 d_user: 'hd2a a_valid_delay: 'h0 d_valid_delay: 'h0 a_valid_len: 'h0 d_valid_len: 'h0 req_abort_after_a_valid_len: 'h0 rsp_abort_after_d_valid_len: 'h0 req_completed: 'h0 rsp_completed: 'h0 tl_intg_err_type: TlIntgErrNone max_ecc_errors: 'h3 }
Reasons for predicted error: '{"Fetch from CSR"} .
UVM_INFO @ 2097.156312 us: (uvm_report_catcher.svh:705) [UVM/REPORT/CATCHER]
--- UVM Report catcher Summary ---
chip_tl_errors 52387737062362389262366234007425752382390757969478682630319284532571261537873 217
TL item was: req: (cip_tl_seq_item@35826) { a_addr: 'h10444 a_data: 'hbb050422 a_mask: 'hf a_size: 'h2 a_param: 'h0 a_source: 'h28 a_opcode: 'h4 a_user: 'h1b1f7 d_param: 'h0 d_source: 'h28 d_data: 'h0 d_size: 'h2 d_opcode: 'h1 d_error: 'h0 d_sink: 'h0 d_user: 'hd2a a_valid_delay: 'h0 d_valid_delay: 'h0 a_valid_len: 'h0 d_valid_len: 'h0 req_abort_after_a_valid_len: 'h0 rsp_abort_after_d_valid_len: 'h0 req_completed: 'h0 rsp_completed: 'h0 tl_intg_err_type: TlIntgErrNone max_ecc_errors: 'h3 }
Reasons for predicted error: '{"Fetch from CSR"} .
UVM_INFO @ 2790.985256 us: (uvm_report_catcher.svh:705) [UVM/REPORT/CATCHER]
--- UVM Report catcher Summary ---
chip_tl_errors 85562294495569600817411057397782022327667342683945450089305661284934850521174 217
TL item was: req: (cip_tl_seq_item@32472) { a_addr: 'h105e8 a_data: 'h1d2265f7 a_mask: 'hf a_size: 'h2 a_param: 'h0 a_source: 'h33 a_opcode: 'h4 a_user: 'h18698 d_param: 'h0 d_source: 'h33 d_data: 'h0 d_size: 'h2 d_opcode: 'h1 d_error: 'h0 d_sink: 'h0 d_user: 'hd2a a_valid_delay: 'h0 d_valid_delay: 'h0 a_valid_len: 'h0 d_valid_len: 'h0 req_abort_after_a_valid_len: 'h0 rsp_abort_after_d_valid_len: 'h0 req_completed: 'h0 rsp_completed: 'h0 tl_intg_err_type: TlIntgErrNone max_ecc_errors: 'h3 }
Reasons for predicted error: '{"Fetch from CSR"} .
UVM_INFO @ 2260.720571 us: (uvm_report_catcher.svh:705) [UVM/REPORT/CATCHER]
--- UVM Report catcher Summary ---
chip_tl_errors 1209896491395222178374688710577757189792484302334051792015909571693773058569 217
TL item was: req: (cip_tl_seq_item@41092) { a_addr: 'h104fc a_data: 'ha5309eec a_mask: 'hf a_size: 'h2 a_param: 'h0 a_source: 'h2 a_opcode: 'h4 a_user: 'h1a99a d_param: 'h0 d_source: 'h2 d_data: 'h0 d_size: 'h2 d_opcode: 'h1 d_error: 'h0 d_sink: 'h0 d_user: 'hd2a a_valid_delay: 'h0 d_valid_delay: 'h0 a_valid_len: 'h0 d_valid_len: 'h0 req_abort_after_a_valid_len: 'h0 rsp_abort_after_d_valid_len: 'h0 req_completed: 'h0 rsp_completed: 'h0 tl_intg_err_type: TlIntgErrNone max_ecc_errors: 'h3 }
Reasons for predicted error: '{"Fetch from CSR"} .
UVM_INFO @ 1902.256392 us: (uvm_report_catcher.svh:705) [UVM/REPORT/CATCHER]
--- UVM Report catcher Summary ---
chip_tl_errors 63656521929327462974660006350764605537769967917765256148526044690908320857815 217
TL item was: req: (cip_tl_seq_item@34888) { a_addr: 'h106e4 a_data: 'hce0b61a a_mask: 'hf a_size: 'h2 a_param: 'h0 a_source: 'h14 a_opcode: 'h4 a_user: 'h192cb d_param: 'h0 d_source: 'h14 d_data: 'h0 d_size: 'h2 d_opcode: 'h1 d_error: 'h0 d_sink: 'h0 d_user: 'hd2a a_valid_delay: 'h0 d_valid_delay: 'h0 a_valid_len: 'h0 d_valid_len: 'h0 req_abort_after_a_valid_len: 'h0 rsp_abort_after_d_valid_len: 'h0 req_completed: 'h0 rsp_completed: 'h0 tl_intg_err_type: TlIntgErrNone max_ecc_errors: 'h3 }
Reasons for predicted error: '{"Fetch from CSR"} .
UVM_INFO @ 2080.091290 us: (uvm_report_catcher.svh:705) [UVM/REPORT/CATCHER]
--- UVM Report catcher Summary ---
chip_tl_errors 45314234023312091274537728799080376776302592991606274743152018988477174702622 218
TL item was: req: (cip_tl_seq_item@176456) { a_addr: 'h10778 a_data: 'h8d521c66 a_mask: 'hf a_size: 'h2 a_param: 'h0 a_source: 'h0 a_opcode: 'h4 a_user: 'h199b7 d_param: 'h0 d_source: 'h0 d_data: 'h0 d_size: 'h2 d_opcode: 'h1 d_error: 'h0 d_sink: 'h0 d_user: 'hd2a a_valid_delay: 'h0 d_valid_delay: 'h0 a_valid_len: 'h0 d_valid_len: 'h0 req_abort_after_a_valid_len: 'h0 rsp_abort_after_d_valid_len: 'h0 req_completed: 'h0 rsp_completed: 'h0 tl_intg_err_type: TlIntgErrNone max_ecc_errors: 'h3 }
Reasons for predicted error: '{"Fetch from CSR"} .
UVM_INFO @ 3024.035892 us: (uvm_report_catcher.svh:705) [UVM/REPORT/CATCHER]
--- UVM Report catcher Summary ---
chip_tl_errors 43752118358078077767151248181696198452363356202656736053793378171953068052613 217
TL item was: req: (cip_tl_seq_item@43846) { a_addr: 'h10558 a_data: 'h272ba46e a_mask: 'hf a_size: 'h2 a_param: 'h0 a_source: 'h30 a_opcode: 'h4 a_user: 'h18a61 d_param: 'h0 d_source: 'h30 d_data: 'h0 d_size: 'h2 d_opcode: 'h1 d_error: 'h0 d_sink: 'h0 d_user: 'hd2a a_valid_delay: 'h0 d_valid_delay: 'h0 a_valid_len: 'h0 d_valid_len: 'h0 req_abort_after_a_valid_len: 'h0 rsp_abort_after_d_valid_len: 'h0 req_completed: 'h0 rsp_completed: 'h0 tl_intg_err_type: TlIntgErrNone max_ecc_errors: 'h3 }
Reasons for predicted error: '{"Fetch from CSR"} .
UVM_INFO @ 2673.788836 us: (uvm_report_catcher.svh:705) [UVM/REPORT/CATCHER]
--- UVM Report catcher Summary ---
chip_tl_errors 91656742881156779632468275568011888011192548989028668596086011878864170546741 217
TL item was: req: (cip_tl_seq_item@45278) { a_addr: 'h106c4 a_data: 'hffdbf48c a_mask: 'hf a_size: 'h2 a_param: 'h0 a_source: 'h3f a_opcode: 'h4 a_user: 'h18a19 d_param: 'h0 d_source: 'h3f d_data: 'h0 d_size: 'h2 d_opcode: 'h1 d_error: 'h0 d_sink: 'h0 d_user: 'hd2a a_valid_delay: 'h0 d_valid_delay: 'h0 a_valid_len: 'h0 d_valid_len: 'h0 req_abort_after_a_valid_len: 'h0 rsp_abort_after_d_valid_len: 'h0 req_completed: 'h0 rsp_completed: 'h0 tl_intg_err_type: TlIntgErrNone max_ecc_errors: 'h3 }
Reasons for predicted error: '{"Fetch from CSR"} .
UVM_INFO @ 2236.438028 us: (uvm_report_catcher.svh:705) [UVM/REPORT/CATCHER]
--- UVM Report catcher Summary ---
chip_tl_errors 88200862699277358645703465160274759123530679292169659588737669719337417555151 217
TL item was: req: (cip_tl_seq_item@38966) { a_addr: 'h106e0 a_data: 'h25ea4d5d a_mask: 'hf a_size: 'h2 a_param: 'h0 a_source: 'hf a_opcode: 'h4 a_user: 'h19e78 d_param: 'h0 d_source: 'hf d_data: 'h0 d_size: 'h2 d_opcode: 'h1 d_error: 'h0 d_sink: 'h0 d_user: 'hd2a a_valid_delay: 'h0 d_valid_delay: 'h0 a_valid_len: 'h0 d_valid_len: 'h0 req_abort_after_a_valid_len: 'h0 rsp_abort_after_d_valid_len: 'h0 req_completed: 'h0 rsp_completed: 'h0 tl_intg_err_type: TlIntgErrNone max_ecc_errors: 'h3 }
Reasons for predicted error: '{"Fetch from CSR"} .
UVM_INFO @ 2625.958000 us: (uvm_report_catcher.svh:705) [UVM/REPORT/CATCHER]
--- UVM Report catcher Summary ---
chip_tl_errors 104691146844852536221206839872963120335711140449502497030731805312630031930022 217
TL item was: req: (cip_tl_seq_item@32032) { a_addr: 'h107cc a_data: 'h138014d1 a_mask: 'hf a_size: 'h2 a_param: 'h0 a_source: 'h0 a_opcode: 'h4 a_user: 'h19990 d_param: 'h0 d_source: 'h0 d_data: 'h0 d_size: 'h2 d_opcode: 'h1 d_error: 'h0 d_sink: 'h0 d_user: 'hd2a a_valid_delay: 'h0 d_valid_delay: 'h0 a_valid_len: 'h0 d_valid_len: 'h0 req_abort_after_a_valid_len: 'h0 rsp_abort_after_d_valid_len: 'h0 req_completed: 'h0 rsp_completed: 'h0 tl_intg_err_type: TlIntgErrNone max_ecc_errors: 'h3 }
Reasons for predicted error: '{"Fetch from CSR"} .
UVM_INFO @ 2472.736180 us: (uvm_report_catcher.svh:705) [UVM/REPORT/CATCHER]
--- UVM Report catcher Summary ---
Job timed out after * minutes 13 test runs
chip_sw_rv_timer_systick_test 98336984776212757113976225660953929934831328497951139766682593820396481341782 None
chip_sw_adc_ctrl_sleep_debug_cable_wakeup 106474187409013482508011148659187308622246048971830744482595701316208300278481 None
chip_sw_alert_handler_lpg_sleep_mode_pings 110233756429614304303072214815268032867073261664609243898993866905049977091746 None
ate_bootstrap_disjoint 105540383399422732548001277054270553640023352052254864751960803279958779700625 None
chip_sw_rv_timer_systick_test 101996908258806796606984977475316351236369511994215442698281447753690170997578 None
chip_sw_adc_ctrl_sleep_debug_cable_wakeup 10499292969978394385246260787109530260661853572369482952597275314914457988978 None
chip_sw_alert_handler_lpg_sleep_mode_pings 3614338153958573109768440335328562025469128620076355471528206185129107900843 None
ate_bootstrap_disjoint 87106299550774067857027244602586090962847283487101526359112832049535955590813 None
chip_sw_flash_rma_unlocked 58080114918336370209468310275583047781350117650839071646390316054452832712295 None
chip_sw_rv_timer_systick_test 3905645282638091789553096591656046942609390496872384811723344026923306147340 None
chip_sw_adc_ctrl_sleep_debug_cable_wakeup 42924039652863105480397845219600568665499290847081958641553104107492164629767 None
chip_sw_alert_handler_lpg_sleep_mode_pings 23921397245153099062079915033036232083083274105550096647544857086775657637891 None
ate_bootstrap_disjoint 108074693914411261356603495284299887339894521481846430551106664643277652037423 None
Offending '(rstreqs[*] && (reset_cause == HwReq))' 10 test runs
chip_sw_pwrmgr_random_sleep_all_reset_reqs 3979924953271249444679651180991249171983275703835898953115380268619877458498 344
UVM_ERROR @ 13059.887000 us: (pwrmgr_rstreqs_sva_if.sv:49) [ASSERT FAILED] HwResetOn_A
UVM_INFO @ 13059.887000 us: (uvm_report_catcher.svh:705) [UVM/REPORT/CATCHER]
--- UVM Report catcher Summary ---
chip_sw_pwrmgr_deep_sleep_all_reset_reqs 21278538742246818424705642147386604702853228748861375803273240428874640936405 314
UVM_ERROR @ 6120.580000 us: (pwrmgr_rstreqs_sva_if.sv:49) [ASSERT FAILED] HwResetOn_A
UVM_INFO @ 6120.580000 us: (uvm_report_catcher.svh:705) [UVM/REPORT/CATCHER]
--- UVM Report catcher Summary ---
chip_sw_pwrmgr_deep_sleep_por_reset 84570770387164755595186378621118049083309520629746691617320998535518078514354 325
UVM_ERROR @ 8635.527500 us: (pwrmgr_rstreqs_sva_if.sv:49) [ASSERT FAILED] HwResetOn_A
UVM_INFO @ 8635.527500 us: (uvm_report_catcher.svh:705) [UVM/REPORT/CATCHER]
--- UVM Report catcher Summary ---
chip_sw_pwrmgr_deep_sleep_por_reset 26370266368007033531251150696092203413845228416625524620689471752040980586157 325
UVM_ERROR @ 7257.710000 us: (pwrmgr_rstreqs_sva_if.sv:49) [ASSERT FAILED] HwResetOn_A
UVM_INFO @ 7257.710000 us: (uvm_report_catcher.svh:705) [UVM/REPORT/CATCHER]
--- UVM Report catcher Summary ---
chip_sw_pwrmgr_random_sleep_power_glitch_reset 9240549260273079625296273259454239461424580377018744418230025991837915742537 404
UVM_ERROR @ 23561.179000 us: (pwrmgr_rstreqs_sva_if.sv:49) [ASSERT FAILED] HwResetOn_A
UVM_INFO @ 23561.179000 us: (uvm_report_catcher.svh:705) [UVM/REPORT/CATCHER]
--- UVM Report catcher Summary ---
chip_sw_sysrst_ctrl_reset 621641001362078619216776512119163537038964199492399884620783984578217750433 334
UVM_ERROR @ 23949.992000 us: (pwrmgr_rstreqs_sva_if.sv:49) [ASSERT FAILED] HwResetOn_A
UVM_INFO @ 23949.992000 us: (uvm_report_catcher.svh:705) [UVM/REPORT/CATCHER]
--- UVM Report catcher Summary ---
chip_sw_pwrmgr_random_sleep_all_reset_reqs 43985730978013993925760293937303254034869996639976431362419555576915971646367 344
UVM_ERROR @ 13503.264000 us: (pwrmgr_rstreqs_sva_if.sv:49) [ASSERT FAILED] HwResetOn_A
UVM_INFO @ 13503.264000 us: (uvm_report_catcher.svh:705) [UVM/REPORT/CATCHER]
--- UVM Report catcher Summary ---
chip_sw_pwrmgr_deep_sleep_all_reset_reqs 64830947257144751925420739884529688253877216529886251126714672038411868108665 314
UVM_ERROR @ 5139.997000 us: (pwrmgr_rstreqs_sva_if.sv:49) [ASSERT FAILED] HwResetOn_A
UVM_INFO @ 5139.997000 us: (uvm_report_catcher.svh:705) [UVM/REPORT/CATCHER]
--- UVM Report catcher Summary ---
chip_sw_pwrmgr_deep_sleep_por_reset 9716441505121513483451454041610892011397676632063925635914599687557303090025 325
UVM_ERROR @ 7856.144000 us: (pwrmgr_rstreqs_sva_if.sv:49) [ASSERT FAILED] HwResetOn_A
UVM_INFO @ 7856.144000 us: (uvm_report_catcher.svh:705) [UVM/REPORT/CATCHER]
--- UVM Report catcher Summary ---
chip_sw_aon_timer_wdog_bite_reset 7950446818196515444491471451590197664614510556354596257430558591280819372360 319
UVM_ERROR @ 7841.528500 us: (pwrmgr_rstreqs_sva_if.sv:49) [ASSERT FAILED] HwResetOn_A
UVM_INFO @ 7841.528500 us: (uvm_report_catcher.svh:705) [UVM/REPORT/CATCHER]
--- UVM Report catcher Summary ---
UVM_ERROR @ * us: (sw_logger_if.sv:526) [lc_walkthrough_test_sim_dv(sw/device/lib/testing/test_framework/ottf_alerts.c:172)] ERROR: Alert * is asserted but not expected 8 test runs
chip_sw_lc_walkthrough_dev 106685683782507720803027266061212597722185804382830981383921694454534211939951 369
UVM_INFO @ 7935.712204 us: (uvm_report_catcher.svh:705) [UVM/REPORT/CATCHER]
--- UVM Report catcher Summary ---
chip_sw_lc_walkthrough_prod 8187072640824072198361306762096070357125249753283732123812639552989496749552 369
UVM_INFO @ 11443.494249 us: (uvm_report_catcher.svh:705) [UVM/REPORT/CATCHER]
--- UVM Report catcher Summary ---
chip_sw_lc_walkthrough_rma 101954549394068352517924885717499194281431568671383715733752203755249194781591 341
UVM_INFO @ 5538.395455 us: (uvm_report_catcher.svh:705) [UVM/REPORT/CATCHER]
--- UVM Report catcher Summary ---
chip_sw_lc_walkthrough_dev 66430973495522856623429766386932954809193492741152377055754012445332222059119 369
UVM_INFO @ 9936.824435 us: (uvm_report_catcher.svh:705) [UVM/REPORT/CATCHER]
--- UVM Report catcher Summary ---
chip_sw_lc_walkthrough_rma 104598769653533564819770193096629678719925198576911230045924474471499581454692 341
UVM_INFO @ 6206.912996 us: (uvm_report_catcher.svh:705) [UVM/REPORT/CATCHER]
--- UVM Report catcher Summary ---
chip_sw_lc_walkthrough_dev 108335002903250937987429897441912732451000761649875500457035572325962236882879 369
UVM_INFO @ 9208.894780 us: (uvm_report_catcher.svh:705) [UVM/REPORT/CATCHER]
--- UVM Report catcher Summary ---
chip_sw_lc_walkthrough_prod 91161393332129279306603603126226897814130088311156154157585146683071876965097 369
UVM_INFO @ 10940.810148 us: (uvm_report_catcher.svh:705) [UVM/REPORT/CATCHER]
--- UVM Report catcher Summary ---
chip_sw_lc_walkthrough_rma 56557906036922520126288555903097584178407291289204892442539748516542838204237 341
UVM_INFO @ 6206.378576 us: (uvm_report_catcher.svh:705) [UVM/REPORT/CATCHER]
--- UVM Report catcher Summary ---
UVM_ERROR @ * us: (chip_sw_base_vseq.sv:322) virtual_sequencer [chip_sw_base_vseq] SW TEST TIMED OUT. STATE: SwTestStatusInTest, TIMEOUT = * ns 7 test runs
chip_sw_hmac_oneshot 16522611023587324878048806890851412773365408988889158488213603387945797913947 310
UVM_INFO @ 12026.808195 us: (uvm_report_catcher.svh:705) [UVM/REPORT/CATCHER]
--- UVM Report catcher Summary ---
chip_sw_hmac_multistream 81942934695624387989249813252156713646429506365113203834508636119988793799473 310
UVM_INFO @ 12026.895978 us: (uvm_report_catcher.svh:705) [UVM/REPORT/CATCHER]
--- UVM Report catcher Summary ---
chip_sw_hmac_oneshot 80322217225295026470578782456964086546987774207021183272855372203251497079807 310
UVM_INFO @ 12018.474031 us: (uvm_report_catcher.svh:705) [UVM/REPORT/CATCHER]
--- UVM Report catcher Summary ---
chip_sw_hmac_multistream 100473227585043765094906680023677827564670507492843123404874851625163331644755 310
UVM_INFO @ 12018.579057 us: (uvm_report_catcher.svh:705) [UVM/REPORT/CATCHER]
--- UVM Report catcher Summary ---
chip_sw_hmac_oneshot 47506364478092716626197363260908400914665999290592693704862531794730101057070 310
UVM_INFO @ 12026.991783 us: (uvm_report_catcher.svh:705) [UVM/REPORT/CATCHER]
--- UVM Report catcher Summary ---
chip_sw_hmac_multistream 81045861766094435513928479473119274272471178412830435370518808296663798359580 310
UVM_INFO @ 12026.769186 us: (uvm_report_catcher.svh:705) [UVM/REPORT/CATCHER]
--- UVM Report catcher Summary ---
chip_sw_keymgr_sideload_otbn 60202760072491567404177870758492091394796843185957154009086192583858502138235 338
UVM_INFO @ 20026.742985 us: (uvm_report_catcher.svh:705) [UVM/REPORT/CATCHER]
--- UVM Report catcher Summary ---
Error-[NOA] Null object access 7 test runs
chip_sw_rv_dm_ndm_reset_req_when_cpu_halted 96403591306453307754769199723870639892936928745146013065839914833948347379354 327
src/lowrisc_dv_jtag_dmi_agent_0/jtag_rv_debugger.sv, 1108
The object at dereference depth 1 is being used before it was
constructed/allocated.
Please make sure that the object is allocated before using it.
rom_e2e_jtag_debug_test_unlocked0 36275025052813618577058567295111579639202538939627551971733798860579507670163 319
src/lowrisc_dv_jtag_dmi_agent_0/jtag_rv_debugger.sv, 1078
The object at dereference depth 1 is being used before it was
constructed/allocated.
Please make sure that the object is allocated before using it.
rom_e2e_jtag_debug_rma 96007466444064810697118296910528797840415416990329379189619253629766047367922 352
src/lowrisc_dv_jtag_dmi_agent_0/jtag_rv_debugger.sv, 903
The object at dereference depth 1 is being used before it was
constructed/allocated.
Please make sure that the object is allocated before using it.
rom_e2e_jtag_inject_test_unlocked0 79221670455714891681514652876302933924418648895095203862117519664045143971541 305
src/lowrisc_dv_jtag_dmi_agent_0/jtag_rv_debugger.sv, 1078
The object at dereference depth 1 is being used before it was
constructed/allocated.
Please make sure that the object is allocated before using it.
rom_e2e_jtag_inject_rma 110187108261850026820450453985846190250218037215653799035013609899122512706739 303
src/lowrisc_dv_jtag_dmi_agent_0/jtag_rv_debugger.sv, 1108
The object at dereference depth 1 is being used before it was
constructed/allocated.
Please make sure that the object is allocated before using it.
chip_sw_rv_dm_ndm_reset_req_when_cpu_halted 79079563958998582442955028727527463120567856353958684538876144516657241249765 327
src/lowrisc_dv_jtag_dmi_agent_0/jtag_rv_debugger.sv, 1108
The object at dereference depth 1 is being used before it was
constructed/allocated.
Please make sure that the object is allocated before using it.
chip_sw_rv_dm_ndm_reset_req_when_cpu_halted 73239332236176272460748763199354187116942301689941508239065237534696565540485 327
src/lowrisc_dv_jtag_dmi_agent_0/jtag_rv_debugger.sv, 1108
The object at dereference depth 1 is being used before it was
constructed/allocated.
Please make sure that the object is allocated before using it.
UVM_FATAL @ * us: (mem_bkdr_util.sv:658) [mem_bkdr_util[FlashBank0Data]] file empty_test_slot_a_corrupted_sim_dv.fake_ecdsa_prod_key_*.signed.*.scr.vmem could not be opened for r mode 6 test runs
rom_e2e_sigverify_always_a_bad_b_bad_prod 102007454718839899399367406087432476659540797959973318026805474490368478529881 368
UVM_INFO @ 10.160001 us: (uvm_report_catcher.svh:705) [UVM/REPORT/CATCHER]
--- UVM Report catcher Summary ---
rom_e2e_sigverify_always_a_bad_b_bad_prod_end 52552108093742850726126326080761840902381404666838013903597475841913647654134 368
UVM_INFO @ 10.120001 us: (uvm_report_catcher.svh:705) [UVM/REPORT/CATCHER]
--- UVM Report catcher Summary ---
rom_e2e_sigverify_always_a_bad_b_bad_rma 94514771452009078614858832924797683695768768794407178164462676342554865625734 368
UVM_INFO @ 10.160001 us: (uvm_report_catcher.svh:705) [UVM/REPORT/CATCHER]
--- UVM Report catcher Summary ---
rom_e2e_sigverify_always_a_bad_b_nothing_prod 111979935085746059991221553289907083983877971821470397810508815363420816458824 328
UVM_INFO @ 10.140001 us: (uvm_report_catcher.svh:705) [UVM/REPORT/CATCHER]
--- UVM Report catcher Summary ---
rom_e2e_sigverify_always_a_bad_b_nothing_prod_end 96061376853731844716972983570072058515759580386355697917749367609101894994415 328
UVM_INFO @ 10.300001 us: (uvm_report_catcher.svh:705) [UVM/REPORT/CATCHER]
--- UVM Report catcher Summary ---
rom_e2e_sigverify_always_a_bad_b_nothing_rma 62939535768479280262879783056195746860024691749110624016406816227483886428533 328
UVM_INFO @ 10.320001 us: (uvm_report_catcher.svh:705) [UVM/REPORT/CATCHER]
--- UVM Report catcher Summary ---
Offending '(!$fell((pwrmgr_data_o.done == MuBi4True)))' 5 test runs
chip_sw_pwrmgr_sleep_power_glitch_reset 14623838024417534944350341607597505874512456797725002568690426090472704488817 313
UVM_ERROR @ 3092.237869 us: (rom_ctrl.sv:577) [ASSERT FAILED] PwrmgrDataChk_A
UVM_INFO @ 3092.237869 us: (uvm_report_catcher.svh:705) [UVM/REPORT/CATCHER]
--- UVM Report catcher Summary ---
chip_sw_pwrmgr_random_sleep_power_glitch_reset 42987511643148371055931320086070121075430568483005263494273597209686240997516 381
UVM_ERROR @ 17120.628940 us: (rom_ctrl.sv:577) [ASSERT FAILED] PwrmgrDataChk_A
UVM_INFO @ 17120.628940 us: (uvm_report_catcher.svh:705) [UVM/REPORT/CATCHER]
--- UVM Report catcher Summary ---
chip_sw_pwrmgr_sleep_power_glitch_reset 2626053789514841422242601981207939998952721990875288576975894753693190892201 313
UVM_ERROR @ 3407.802380 us: (rom_ctrl.sv:577) [ASSERT FAILED] PwrmgrDataChk_A
UVM_INFO @ 3407.802380 us: (uvm_report_catcher.svh:705) [UVM/REPORT/CATCHER]
--- UVM Report catcher Summary ---
chip_sw_pwrmgr_sleep_power_glitch_reset 70301355918590716173919784035832184827731770991283260467016107717630669102177 313
UVM_ERROR @ 2700.856018 us: (rom_ctrl.sv:577) [ASSERT FAILED] PwrmgrDataChk_A
UVM_INFO @ 2700.856018 us: (uvm_report_catcher.svh:705) [UVM/REPORT/CATCHER]
--- UVM Report catcher Summary ---
chip_sw_pwrmgr_random_sleep_power_glitch_reset 76320578160889281463335957303420254267733937976069396910966349776973842215727 328
UVM_ERROR @ 7844.356200 us: (rom_ctrl.sv:577) [ASSERT FAILED] PwrmgrDataChk_A
UVM_INFO @ 7844.356200 us: (uvm_report_catcher.svh:705) [UVM/REPORT/CATCHER]
--- UVM Report catcher Summary ---
UVM_ERROR @ * us: (sw_logger_if.sv:526) [all_escalation_resets_test_sim_dv(w/device/tests/sim_dv/all_escalation_resets_test.c:635)] CHECK-fail: Unexpected mtval: expected *, got * 4 test runs
chip_sw_all_escalation_resets 110513445470193883885379775754716919372850685494108486881733216133475583583329 327
UVM_INFO @ 2859.396130 us: (uvm_report_catcher.svh:705) [UVM/REPORT/CATCHER]
--- UVM Report catcher Summary ---
chip_sw_all_escalation_resets 36955113207456287932940817022846801351886429388723154314926995031691773058908 317
UVM_INFO @ 3295.588936 us: (uvm_report_catcher.svh:705) [UVM/REPORT/CATCHER]
--- UVM Report catcher Summary ---
chip_sw_all_escalation_resets 45445035930687758556515296031998039511229291713357732065584943610275032204073 317
UVM_INFO @ 3107.573554 us: (uvm_report_catcher.svh:705) [UVM/REPORT/CATCHER]
--- UVM Report catcher Summary ---
chip_sw_all_escalation_resets 88421862588127559897987842199622363363158693213735555600614088978818756210038 317
UVM_INFO @ 3178.099352 us: (uvm_report_catcher.svh:705) [UVM/REPORT/CATCHER]
--- UVM Report catcher Summary ---
UVM_FATAL @ * us: (sec_cm_pkg.sv:48) [sec_cm_pkg::find_sec_cm_if_proxy] no proxy with path *rstmgr_aon.u_d0_spi_host*.leaf_rst_path 3 test runs
chip_sw_rstmgr_rst_cnsty_escalation 44229765434222820719461336125466470785913816680130795329539438956175999861660 301
UVM_INFO @ 10.300001 us: (uvm_report_catcher.svh:705) [UVM/REPORT/CATCHER]
--- UVM Report catcher Summary ---
chip_sw_rstmgr_rst_cnsty_escalation 32756749090960626759155611614761661042118875056338647550322099634099567375271 301
UVM_INFO @ 10.360001 us: (uvm_report_catcher.svh:705) [UVM/REPORT/CATCHER]
--- UVM Report catcher Summary ---
chip_sw_rstmgr_rst_cnsty_escalation 9612641749342502892693209711554672981364866387480617018276930554722268685503 301
UVM_INFO @ 10.160001 us: (uvm_report_catcher.svh:705) [UVM/REPORT/CATCHER]
--- UVM Report catcher Summary ---
UVM_ERROR @ * us: (sw_logger_if.sv:526) [flash_ctrl_lc_rw_en_test_sim_dv(sw/device/lib/testing/test_framework/ottf_alerts.c:172)] ERROR: Alert * is asserted but not expected 3 test runs
chip_sw_flash_ctrl_lc_rw_en 587358130852325393649676907105657625002628438374798679643280537213894377284 309
UVM_INFO @ 3164.237593 us: (uvm_report_catcher.svh:705) [UVM/REPORT/CATCHER]
--- UVM Report catcher Summary ---
chip_sw_flash_ctrl_lc_rw_en 24138073630163963179719775597911595008211687239858305246005350884955798541882 309
UVM_INFO @ 2937.995380 us: (uvm_report_catcher.svh:705) [UVM/REPORT/CATCHER]
--- UVM Report catcher Summary ---
chip_sw_flash_ctrl_lc_rw_en 93507405685494197376229836758694653478344792897027430229657955570751785220465 309
UVM_INFO @ 3421.869794 us: (uvm_report_catcher.svh:705) [UVM/REPORT/CATCHER]
--- UVM Report catcher Summary ---
UVM_ERROR @ * us: (sw_logger_if.sv:526) [otp_ctrl_lc_signals_test_sim_dv(sw/device/lib/testing/otp_ctrl_testutils.c:39)] Expected a DAI error for access to * 3 test runs
chip_sw_otp_ctrl_lc_signals_rma 16843190154815368671216629483257855992486852582695116302533522203687235354586 342
UVM_INFO @ 6834.889000 us: (uvm_report_catcher.svh:705) [UVM/REPORT/CATCHER]
--- UVM Report catcher Summary ---
chip_sw_otp_ctrl_lc_signals_rma 92649215992632573646650250549599123484625939097703899016858410049439840405696 342
UVM_INFO @ 5558.258616 us: (uvm_report_catcher.svh:705) [UVM/REPORT/CATCHER]
--- UVM Report catcher Summary ---
chip_sw_otp_ctrl_lc_signals_rma 105974156761654661377239112733067374664999107204356019469119912667864729937557 342
UVM_INFO @ 5668.187916 us: (uvm_report_catcher.svh:705) [UVM/REPORT/CATCHER]
--- UVM Report catcher Summary ---
Offending '(!$fell(lc_ctrl_pkg::lc_tx_test_true_strict(lc_init_done_o)))' 3 test runs
chip_sw_otp_ctrl_escalation 97107084075097015649901977984884793187393725300390159645513527221202091410432 316
UVM_ERROR @ 3435.073524 us: (lc_ctrl.sv:884) [ASSERT FAILED] LcInitDoneSticky_A
UVM_INFO @ 3435.073524 us: (uvm_report_catcher.svh:705) [UVM/REPORT/CATCHER]
--- UVM Report catcher Summary ---
chip_sw_csrng_fuse_en_sw_app_read_test 45606185947068180779571109533803070363594659188228983860845098444291499523286 312
UVM_ERROR @ 3016.508514 us: (lc_ctrl.sv:884) [ASSERT FAILED] LcInitDoneSticky_A
UVM_INFO @ 3016.508514 us: (uvm_report_catcher.svh:705) [UVM/REPORT/CATCHER]
--- UVM Report catcher Summary ---
chip_sw_csrng_fuse_en_sw_app_read_test 57355546025482525513334666819312230112260842946013475888344155140225713974753 312
UVM_ERROR @ 3100.520598 us: (lc_ctrl.sv:884) [ASSERT FAILED] LcInitDoneSticky_A
UVM_INFO @ 3100.520598 us: (uvm_report_catcher.svh:705) [UVM/REPORT/CATCHER]
--- UVM Report catcher Summary ---
Offending '((~rst_ni) === (~seed_en_q))' 3 test runs
chip_sw_pwrmgr_full_aon_reset 100248625185256505455807106124819902713647145675337908435515509083805974939860 324
UVM_ERROR @ 5689.982979 us: (otbn_rnd.sv:233) [ASSERT FAILED] UrndNoReseedOnReset_A
UVM_INFO @ 5689.982979 us: (uvm_report_catcher.svh:705) [UVM/REPORT/CATCHER]
--- UVM Report catcher Summary ---
chip_sw_pwrmgr_full_aon_reset 46295204809682481505127755527886556600567739641323263998002217454929235310277 303
UVM_ERROR @ 2128.785021 us: (otbn_rnd.sv:233) [ASSERT FAILED] UrndNoReseedOnReset_A
UVM_INFO @ 2128.785021 us: (uvm_report_catcher.svh:705) [UVM/REPORT/CATCHER]
--- UVM Report catcher Summary ---
chip_sw_pwrmgr_full_aon_reset 67048186247752295111572065117345606677171921131729997527445140719860677836021 322
UVM_ERROR @ 6172.324660 us: (otbn_rnd.sv:233) [ASSERT FAILED] UrndNoReseedOnReset_A
UVM_INFO @ 6172.324660 us: (uvm_report_catcher.svh:705) [UVM/REPORT/CATCHER]
--- UVM Report catcher Summary ---
UVM_ERROR @ * us: (sw_logger_if.sv:526) [clkmgr_jitter_frequency_test_sim_dv(sw/device/lib/testing/test_framework/ottf_alerts.c:172)] ERROR: Alert * is asserted but not expected 3 test runs
chip_sw_clkmgr_jitter_frequency 114536974775643794186099956988057261854052800729724174176902309279022853474954 343
UVM_INFO @ 4073.302268 us: (uvm_report_catcher.svh:705) [UVM/REPORT/CATCHER]
--- UVM Report catcher Summary ---
chip_sw_clkmgr_jitter_frequency 34739749798752284269534368928061152406906017003758556166496740810475703484012 343
UVM_INFO @ 3728.107358 us: (uvm_report_catcher.svh:705) [UVM/REPORT/CATCHER]
--- UVM Report catcher Summary ---
chip_sw_clkmgr_jitter_frequency 33864168694888014004084255069795963144850860901646052227833775898945284517363 343
UVM_INFO @ 3052.828089 us: (uvm_report_catcher.svh:705) [UVM/REPORT/CATCHER]
--- UVM Report catcher Summary ---
UVM_ERROR @ * us: (chip_sw_power_idle_load_vseq.sv:91) virtual_sequencer [chip_sw_power_idle_load_vseq] PWMCH* : pkt* Clock period is wrong. rcv : * exp : * 3 test runs
chip_sw_power_idle_load 5318047535828612674950637139549452477737509489159566838539816182628681855165 312
UVM_INFO @ 3726.743000 us: (uvm_report_catcher.svh:705) [UVM/REPORT/CATCHER]
--- UVM Report catcher Summary ---
chip_sw_power_idle_load 46427154661323756151956485207202185631711360265635820164729610903616924201151 312
UVM_INFO @ 2876.896000 us: (uvm_report_catcher.svh:705) [UVM/REPORT/CATCHER]
--- UVM Report catcher Summary ---
chip_sw_power_idle_load 82797302646404127696591505375807565161816022852124735099315404911986404072949 314
UVM_INFO @ 3095.696500 us: (uvm_report_catcher.svh:705) [UVM/REPORT/CATCHER]
--- UVM Report catcher Summary ---
UVM_ERROR @ * us: (chip_sw_power_sleep_load_vseq.sv:114) virtual_sequencer [chip_sw_power_sleep_load_vseq] PWMCH* : pkt* Clock period is wrong. rcv : * exp : * 3 test runs
chip_sw_power_sleep_load 24877263756561283783150551042806398115138323294733083444488368718002939695329 318
UVM_INFO @ 3572.488000 us: (uvm_report_catcher.svh:705) [UVM/REPORT/CATCHER]
--- UVM Report catcher Summary ---
chip_sw_power_sleep_load 73467912597543001050278382458855596980361439272946958150507363143479177123849 318
UVM_INFO @ 3991.700000 us: (uvm_report_catcher.svh:705) [UVM/REPORT/CATCHER]
--- UVM Report catcher Summary ---
chip_sw_power_sleep_load 66514035072043309665204898982193032414278309212541189132862350041665527655168 318
UVM_INFO @ 2671.064000 us: (uvm_report_catcher.svh:705) [UVM/REPORT/CATCHER]
--- UVM Report catcher Summary ---
UVM_ERROR @ * us: (sw_logger_if.sv:526) [ast_clk_rst_inputs_sim_dv(sw/device/lib/testing/autogen/isr_testutils.c:41)] CHECK-fail: Only adc_ctrl IRQ * expected to fire. Actual IRQ state = * 3 test runs
chip_sw_ast_clk_rst_inputs 113971028262222573767049445026679561942780476027709555911986824560128384877528 327
UVM_INFO @ 11512.299088 us: (uvm_report_catcher.svh:705) [UVM/REPORT/CATCHER]
--- UVM Report catcher Summary ---
chip_sw_ast_clk_rst_inputs 37854159799259347223617972121563542194690448642180394885751625201590659008302 327
UVM_INFO @ 14704.799915 us: (uvm_report_catcher.svh:705) [UVM/REPORT/CATCHER]
--- UVM Report catcher Summary ---
chip_sw_ast_clk_rst_inputs 13963483288813282062406476672614614437334180117815964539016577798696779630620 327
UVM_INFO @ 11124.163121 us: (uvm_report_catcher.svh:705) [UVM/REPORT/CATCHER]
--- UVM Report catcher Summary ---
UVM_FATAL @ * us: (csr_utils_pkg.sv:614) [csr_utils_pkg::csr_spinwait.isolation_fork] timeout chip_reg_block.spi_device.cmd_info_*.opcode (addr=*, Comparison=CompareOpEq, exp_data=*, call_count=1) 3 test runs
ate_bootstrap_flash_erase 65061333071251359063944126654908539685757926350061089542302374668307371972370 272
UVM_INFO @ 10010.120001 us: (uvm_report_catcher.svh:705) [UVM/REPORT/CATCHER]
--- UVM Report catcher Summary ---
ate_bootstrap_flash_erase 10567093895133780327873516212574569810874883949613202501277508533488409609955 272
UVM_INFO @ 10010.340001 us: (uvm_report_catcher.svh:705) [UVM/REPORT/CATCHER]
--- UVM Report catcher Summary ---
ate_bootstrap_flash_erase 53701240145115624319371070310303101699409184057078946337860255701155401670628 272
UVM_INFO @ 10010.160001 us: (uvm_report_catcher.svh:705) [UVM/REPORT/CATCHER]
--- UVM Report catcher Summary ---
UVM_FATAL @ * us: (mem_bkdr_util.sv:658) [mem_bkdr_util[FlashBank0Data]] file empty_test_slot_b_corrupted_sim_dv.fake_ecdsa_prod_key_*.signed.*.scr.vmem could not be opened for r mode 3 test runs
rom_e2e_sigverify_always_a_nothing_b_bad_prod 7503656171016980402026319537851711622782071289726841177609929357628105864178 327
UVM_INFO @ 10.160001 us: (uvm_report_catcher.svh:705) [UVM/REPORT/CATCHER]
--- UVM Report catcher Summary ---
rom_e2e_sigverify_always_a_nothing_b_bad_prod_end 90138303911656658610863084284415710424959342764416199821131756152508905041086 326
UVM_INFO @ 10.160001 us: (uvm_report_catcher.svh:705) [UVM/REPORT/CATCHER]
--- UVM Report catcher Summary ---
rom_e2e_sigverify_always_a_nothing_b_bad_rma 891348584905787140151337958120430622631722093478839167825210927308752997721 326
UVM_INFO @ 10.320001 us: (uvm_report_catcher.svh:705) [UVM/REPORT/CATCHER]
--- UVM Report catcher Summary ---
UVM_ERROR @ * us: (sw_logger_if.sv:526) [rom_e2e_keymgr_init_otp_invalid_meas_sim_dv(sw/device/silicon_creator/rom/e2e/keymgr/rom_e2e_keymgr_init_test.c:38)] DIF-fail: dif_otp_ctrl_get_digest( &otp_ctrl, kDifOtpCtrlPartitionCreatorSwCfg, &creator_digest) returns * 3 test runs
rom_e2e_keymgr_init_rom_ext_invalid_meas 72597206501948540862070054594494949521612072073354760695530769832840689983268 319
UVM_INFO @ 19311.321212 us: (uvm_report_catcher.svh:705) [UVM/REPORT/CATCHER]
--- UVM Report catcher Summary ---
rom_e2e_keymgr_init_rom_ext_invalid_meas 36702128220265638797248246907384427465316085894413035753023882585714394084431 319
UVM_INFO @ 17182.145450 us: (uvm_report_catcher.svh:705) [UVM/REPORT/CATCHER]
--- UVM Report catcher Summary ---
rom_e2e_keymgr_init_rom_ext_invalid_meas 16991301142952193861920828615260156109302522862240807808927912069850460821337 319
UVM_INFO @ 15676.583164 us: (uvm_report_catcher.svh:705) [UVM/REPORT/CATCHER]
--- UVM Report catcher Summary ---
Offending '$stable(key_data_i)' 3 test runs
rom_keymgr_functest 3203113725047437822551475973276055383590671573162696956076472789512494951710 327
UVM_ERROR @ 4858.297120 us: (kmac_core.sv:464) [ASSERT FAILED] KeyDataStableWhenValid_M
UVM_INFO @ 4858.297120 us: (uvm_report_catcher.svh:705) [UVM/REPORT/CATCHER]
--- UVM Report catcher Summary ---
rom_keymgr_functest 96665597294953527948502058689219944128496148693335634453730992719264089180339 327
UVM_ERROR @ 4397.757710 us: (kmac_core.sv:464) [ASSERT FAILED] KeyDataStableWhenValid_M
UVM_INFO @ 4397.757710 us: (uvm_report_catcher.svh:705) [UVM/REPORT/CATCHER]
--- UVM Report catcher Summary ---
rom_keymgr_functest 74672687443006061645737796262361237560220311684697278838261234222689480468997 327
UVM_ERROR @ 4777.513664 us: (kmac_core.sv:464) [ASSERT FAILED] KeyDataStableWhenValid_M
UVM_INFO @ 4777.513664 us: (uvm_report_catcher.svh:705) [UVM/REPORT/CATCHER]
--- UVM Report catcher Summary ---
UVM_ERROR @ * us: (sw_logger_if.sv:526) [alert_test_sim_dv(hw/top_earlgrey/sw/autogen/tests/alert_test.c:352)] CHECK-fail: Expect alert *! 2 test runs
chip_sw_alert_test 80065003808503242926857929478489491171797440689036935888371026835270332522740 307
UVM_INFO @ 2592.895026 us: (uvm_report_catcher.svh:705) [UVM/REPORT/CATCHER]
--- UVM Report catcher Summary ---
chip_sw_alert_test 33297072470836750673988930887034066249533823476453286588286188288639324487508 307
UVM_INFO @ 3071.075928 us: (uvm_report_catcher.svh:705) [UVM/REPORT/CATCHER]
--- UVM Report catcher Summary ---
Offending '(reset_cause == HwReq)' 2 test runs
chip_sw_sensor_ctrl_alert 17311181437721995053811203913020180563212088359267242507662645744039035152920 346
UVM_ERROR @ 7521.135288 us: (pwrmgr_rstreqs_sva_if.sv:98) [ASSERT FAILED] SwResetSetCause_A
UVM_INFO @ 7521.135288 us: (uvm_report_catcher.svh:705) [UVM/REPORT/CATCHER]
--- UVM Report catcher Summary ---
chip_sw_sensor_ctrl_alert 54436231560494439666804701660548526613159746108099371485894483554603046653604 316
UVM_ERROR @ 2873.126292 us: (pwrmgr_rstreqs_sva_if.sv:98) [ASSERT FAILED] SwResetSetCause_A
UVM_INFO @ 2873.126292 us: (uvm_report_catcher.svh:705) [UVM/REPORT/CATCHER]
--- UVM Report catcher Summary ---
UVM_FATAL @ * us: (mem_bkdr_util.sv:658) [mem_bkdr_util[FlashBank0Data]] file empty_test_slot_a_corrupted_sim_dv.fake_ecdsa_dev_key_*.signed.*.scr.vmem could not be opened for r mode 2 test runs
rom_e2e_sigverify_always_a_bad_b_bad_dev 103783202591900830188162451297990824422080783252968952862860378074892681024385 367
UVM_INFO @ 10.340001 us: (uvm_report_catcher.svh:705) [UVM/REPORT/CATCHER]
--- UVM Report catcher Summary ---
rom_e2e_sigverify_always_a_bad_b_nothing_dev 54590765608592305888105763899654267201037004269892351744396597885356634599068 326
UVM_INFO @ 10.360001 us: (uvm_report_catcher.svh:705) [UVM/REPORT/CATCHER]
--- UVM Report catcher Summary ---
UVM_ERROR @ * us: (chip_sw_spi_passthrough_collision_vseq.sv:183) virtual_sequencer [chip_sw_spi_passthrough_collision_vseq] Compare mismatch 2 test runs
chip_sw_spi_device_pass_through_collision 49650930780518822154045835371172411007867885730810591707310086576587089451746 329
host_rsp:
-------------------------------------------------------------------------
Name Type Size Value
-------------------------------------------------------------------------
chip_sw_spi_device_pass_through_collision 65977583216336166578618064181622637721556529715448415737612728818400355031472 329
host_rsp:
-------------------------------------------------------------------------
Name Type Size Value
-------------------------------------------------------------------------
UVM_ERROR @ * us: (sw_logger_if.sv:526) [spi_passthrough_test_sim_dv(sw/device/tests/sim_dv/spi_passthrough_test.c:382)] CHECK-fail: irq == kDtSpiDeviceIrqUploadCmdfifoNotEmpty 1 test run
chip_sw_spi_device_pass_through_collision 15082359211743331506646104067094178598251275222955858340864744347681057648781 327
UVM_INFO @ 3662.639517 us: (uvm_report_catcher.svh:705) [UVM/REPORT/CATCHER]
--- UVM Report catcher Summary ---
UVM_FATAL @ * us: (mem_bkdr_util.sv:658) [mem_bkdr_util[Otp]] file otp_img_test_unlocked0_manuf_empty.*.vmem could not be opened for r mode 1 test run
chip_sw_otp_ctrl_rot_auth_config 72591592686948064605800285876181181696503965335814741219502476780341872969880 282
UVM_INFO @ 0.000000 us: (uvm_report_catcher.svh:705) [UVM/REPORT/CATCHER]
--- UVM Report catcher Summary ---
UVM_ERROR @ * us: (cip_base_vseq.sv:660) [chip_rv_dm_lc_disabled_vseq] Check failed masked_data == exp_data (* [*] vs * [*]) addr * read out mismatch 1 test run
chip_rv_dm_lc_disabled 19674774215150756392410739983574619191026339094844887349102606084143067986091 225
UVM_INFO @ 3861.185945 us: (uvm_report_catcher.svh:705) [UVM/REPORT/CATCHER]
--- UVM Report catcher Summary ---
UVM_FATAL @ * us: (mem_bkdr_util.sv:658) [mem_bkdr_util[FlashBank0Data]] file empty_test_slot_a_corrupted_sim_dv.fake_ecdsa_test_key_*.signed.*.scr.vmem could not be opened for r mode 1 test run
rom_e2e_sigverify_always_a_bad_b_nothing_test_unlocked0 91096425394142661724622653442027218890667838414774497337542971212685866985155 325
UVM_INFO @ 10.340001 us: (uvm_report_catcher.svh:705) [UVM/REPORT/CATCHER]
--- UVM Report catcher Summary ---
UVM_FATAL @ * us: (mem_bkdr_util.sv:658) [mem_bkdr_util[FlashBank0Data]] file empty_test_slot_b_corrupted_sim_dv.fake_ecdsa_test_key_*.signed.*.scr.vmem could not be opened for r mode 1 test run
rom_e2e_sigverify_always_a_nothing_b_bad_test_unlocked0 30676219242761612531312221851521565006565015864364260537489734196349736179913 325
UVM_INFO @ 10.220001 us: (uvm_report_catcher.svh:705) [UVM/REPORT/CATCHER]
--- UVM Report catcher Summary ---
UVM_FATAL @ * us: (mem_bkdr_util.sv:658) [mem_bkdr_util[FlashBank0Data]] file empty_test_slot_b_corrupted_sim_dv.fake_ecdsa_dev_key_*.signed.*.scr.vmem could not be opened for r mode 1 test run
rom_e2e_sigverify_always_a_nothing_b_bad_dev 69118463595128119520924625558001278805711319657183472965177958292370377952166 327
UVM_INFO @ 10.360001 us: (uvm_report_catcher.svh:705) [UVM/REPORT/CATCHER]
--- UVM Report catcher Summary ---
UVM_FATAL @ * us: (jtag_rv_debugger.sv:113) [debugger] timeout occurred! 1 test run
rom_e2e_jtag_debug_dev 64323532488102569042069645676113036482299077144158611203465349739817076341218 330
UVM_INFO @ 14629.959685 us: (uvm_report_catcher.svh:705) [UVM/REPORT/CATCHER]
--- UVM Report catcher Summary ---
UVM_FATAL @ * us: (chip_sw_base_vseq.sv:864) virtual_sequencer [chip_sw_lc_ctrl_scrap_vseq] max attempt reached to get lc status LcExtClockSwitched! 1 test run
chip_sw_lc_ctrl_rand_to_scrap 70567191994153288723419672271744681819235034034813630604273610904056292628628 313
UVM_INFO @ 27186.838823 us: (uvm_report_catcher.svh:705) [UVM/REPORT/CATCHER]
--- UVM Report catcher Summary ---
UVM_FATAL @ * us: (chip_sw_base_vseq.sv:864) virtual_sequencer [chip_sw_lc_walkthrough_vseq] max attempt reached to get lc status LcExtClockSwitched! 1 test run
chip_sw_lc_walkthrough_prod 13207323321501483977639052919960809584349632103628307034707795364845129504767 308
UVM_INFO @ 25395.934337 us: (uvm_report_catcher.svh:705) [UVM/REPORT/CATCHER]
--- UVM Report catcher Summary ---
UVM_ERROR @ * us: (sw_logger_if.sv:526) [rom_e2e_keymgr_init_otp_meas_sim_dv(sw/device/silicon_creator/rom/e2e/keymgr/rom_e2e_keymgr_init_test.c:38)] DIF-fail: dif_otp_ctrl_get_digest( &otp_ctrl, kDifOtpCtrlPartitionCreatorSwCfg, &creator_digest) returns * 1 test run
rom_e2e_keymgr_init_rom_ext_meas 97071914442978020656234568057582691750384232454997414027461326050312051068869 319
UVM_INFO @ 17103.201406 us: (uvm_report_catcher.svh:705) [UVM/REPORT/CATCHER]
--- UVM Report catcher Summary ---
UVM_ERROR @ * us: (sw_logger_if.sv:526) [rom_e2e_keymgr_init_otp_no_meas_sim_dv(sw/device/silicon_creator/rom/e2e/keymgr/rom_e2e_keymgr_init_test.c:38)] DIF-fail: dif_otp_ctrl_get_digest( &otp_ctrl, kDifOtpCtrlPartitionCreatorSwCfg, &creator_digest) returns * 1 test run
rom_e2e_keymgr_init_rom_ext_no_meas 38245051878722818958441571620749237747363459676186021967115147855263465898816 319
UVM_INFO @ 16028.151960 us: (uvm_report_catcher.svh:705) [UVM/REPORT/CATCHER]
--- UVM Report catcher Summary ---
UVM_ERROR @ * us: (chip_sw_sleep_pin_mio_dio_val_vseq.sv:92) [chip_sw_sleep_pin_mio_dio_val_vseq] Check failed cfg.chip_vif.mios_if.pins[i] === exp (* [*] vs *xz [z]) for MIO[*] 1 test run
chip_sw_sleep_pin_mio_dio_val 13121134253268022853177477584714861182536756633825356526681258065177617015040 451
UVM_INFO @ 3526.997000 us: (uvm_report_catcher.svh:705) [UVM/REPORT/CATCHER]
--- UVM Report catcher Summary ---
UVM_ERROR @ * us: (sw_logger_if.sv:526) [alert_test_sim_dv(hw/top_earlgrey/sw/autogen/tests/alert_test.c:397)] CHECK-fail: Expect alert *! 1 test run
chip_sw_alert_test 40114384332589973037283270166506380912304381414332399506795128932264803881179 307
UVM_INFO @ 2776.785224 us: (uvm_report_catcher.svh:705) [UVM/REPORT/CATCHER]
--- UVM Report catcher Summary ---
UVM_FATAL @ * us: (chip_sw_base_vseq.sv:864) virtual_sequencer [chip_sw_lc_ctrl_transition_vseq] max attempt reached to get lc status LcExtClockSwitched! 1 test run
chip_sw_clkmgr_external_clk_src_for_lc 71084854673899071484930713575233308874034492102142858483620011139448678534124 306
UVM_INFO @ 26090.098572 us: (uvm_report_catcher.svh:705) [UVM/REPORT/CATCHER]
--- UVM Report catcher Summary ---
UVM_ERROR @ * us: (cip_base_vseq.sv:923) virtual_sequencer [chip_sw_all_escalation_resets_vseq] Alert usbdev_fatal_fault fired unexpectedly. 1 test run
chip_sw_all_escalation_resets 84582855070295347557392049702223563428670380059971450755854420125721707394202 316
UVM_INFO @ 3204.580266 us: (uvm_report_catcher.svh:705) [UVM/REPORT/CATCHER]
--- UVM Report catcher Summary ---