Simulation Results: aes/masked

 
13/06/2026 02:15:06 DVSim: v1.49.0 sha: 9424e63 json Branch: master Tool: xcelium [unknown]
Coverage statistics
  • Total
  • 97.55 %
  • code
  • 96.58 %
  • assert
  • 98.38 %
  • func
  • 97.71 %
  • block
  • 96.93 %
  • line
  • 97.78 %
  • branch
  • 92.75 %
  • toggle
  • 97.99 %
  • FSM
  • 97.78 %
Validation stages
V1
100.00%
V2
95.87%
V2S
90.31%
V3
0.00%
Testpoint Test Max Runtime Sim Time Pass Total %
wake_up 1 1 100.00
aes_wake_up 2.000s 85.814us 1 1 100.00
smoke 10 10 100.00
aes_smoke 108.000s 8848.031us 10 10 100.00
csr_hw_reset 1 1 100.00
aes_csr_hw_reset 6.000s 97.953us 1 1 100.00
csr_rw 5 5 100.00
aes_csr_rw 3.000s 451.363us 5 5 100.00
csr_bit_bash 1 1 100.00
aes_csr_bit_bash 17.000s 865.926us 1 1 100.00
csr_aliasing 1 1 100.00
aes_csr_aliasing 21.000s 73.198us 1 1 100.00
csr_mem_rw_with_rand_reset 5 5 100.00
aes_csr_mem_rw_with_rand_reset 5.000s 98.030us 5 5 100.00
regwen_csr_and_corresponding_lockable_csr 6 6 100.00
aes_csr_rw 3.000s 451.363us 5 5 100.00
aes_csr_aliasing 21.000s 73.198us 1 1 100.00
Testpoint Test Max Runtime Sim Time Pass Total %
algorithm 70 70 100.00
aes_smoke 108.000s 8848.031us 10 10 100.00
aes_config_error 35.000s 5302.547us 50 50 100.00
aes_stress 29.000s 1595.152us 10 10 100.00
key_length 70 70 100.00
aes_smoke 108.000s 8848.031us 10 10 100.00
aes_config_error 35.000s 5302.547us 50 50 100.00
aes_stress 29.000s 1595.152us 10 10 100.00
back2back 35 35 100.00
aes_stress 29.000s 1595.152us 10 10 100.00
aes_b2b 36.000s 823.126us 25 25 100.00
backpressure 10 10 100.00
aes_stress 29.000s 1595.152us 10 10 100.00
multi_message 94 95 98.95
aes_smoke 108.000s 8848.031us 10 10 100.00
aes_config_error 35.000s 5302.547us 50 50 100.00
aes_stress 29.000s 1595.152us 10 10 100.00
aes_alert_reset 31.000s 104.099us 24 25 96.00
failure_test 84 85 98.82
aes_man_cfg_err 3.000s 94.025us 10 10 100.00
aes_config_error 35.000s 5302.547us 50 50 100.00
aes_alert_reset 31.000s 104.099us 24 25 96.00
trigger_clear_test 10 10 100.00
aes_clear 26.000s 81.333us 10 10 100.00
nist_test_vectors 1 1 100.00
aes_nist_vectors 8.000s 211.760us 1 1 100.00
reset_recovery 24 25 96.00
aes_alert_reset 31.000s 104.099us 24 25 96.00
stress 10 10 100.00
aes_stress 29.000s 1595.152us 10 10 100.00
sideload 20 20 100.00
aes_stress 29.000s 1595.152us 10 10 100.00
aes_sideload 5.000s 202.007us 10 10 100.00
deinitialization 10 10 100.00
aes_deinit 19.000s 857.399us 10 10 100.00
stress_all 2 10 20.00
aes_stress_all 32.000s 6497.365us 2 10 20.00
alert_test 10 10 100.00
aes_alert_test 31.000s 74.394us 10 10 100.00
tl_d_oob_addr_access 25 25 100.00
aes_tl_errors 5.000s 330.291us 25 25 100.00
tl_d_illegal_access 25 25 100.00
aes_tl_errors 5.000s 330.291us 25 25 100.00
tl_d_outstanding_access 12 12 100.00
aes_csr_hw_reset 6.000s 97.953us 1 1 100.00
aes_csr_rw 3.000s 451.363us 5 5 100.00
aes_csr_aliasing 21.000s 73.198us 1 1 100.00
aes_same_csr_outstanding 3.000s 654.243us 5 5 100.00
tl_d_partial_access 12 12 100.00
aes_csr_hw_reset 6.000s 97.953us 1 1 100.00
aes_csr_rw 3.000s 451.363us 5 5 100.00
aes_csr_aliasing 21.000s 73.198us 1 1 100.00
aes_same_csr_outstanding 3.000s 654.243us 5 5 100.00
Testpoint Test Max Runtime Sim Time Pass Total %
reseeding 2 10 20.00
aes_reseed 70.000s 6853.895us 2 10 20.00
fault_inject 581 660 88.03
aes_fi 6.000s 903.477us 0 10 0.00
aes_control_fi 61.000s 0.000us 260 300 86.67
aes_cipher_fi 61.000s 0.000us 321 350 91.71
shadow_reg_update_error 19 20 95.00
aes_shadow_reg_errors 3.000s 490.850us 19 20 95.00
shadow_reg_read_clear_staged_value 19 20 95.00
aes_shadow_reg_errors 3.000s 490.850us 19 20 95.00
shadow_reg_storage_error 19 20 95.00
aes_shadow_reg_errors 3.000s 490.850us 19 20 95.00
shadowed_reset_glitch 19 20 95.00
aes_shadow_reg_errors 3.000s 490.850us 19 20 95.00
shadow_reg_update_error_with_csr_rw 20 20 100.00
aes_shadow_reg_errors_with_csr_rw 4.000s 498.829us 20 20 100.00
tl_intg_err 30 30 100.00
aes_sec_cm 11.000s 1261.418us 5 5 100.00
aes_tl_intg_err 4.000s 380.320us 25 25 100.00
sec_cm_bus_integrity 25 25 100.00
aes_tl_intg_err 4.000s 380.320us 25 25 100.00
sec_cm_lc_escalate_en_intersig_mubi 24 25 96.00
aes_alert_reset 31.000s 104.099us 24 25 96.00
sec_cm_main_config_shadow 19 20 95.00
aes_shadow_reg_errors 3.000s 490.850us 19 20 95.00
sec_cm_gcm_config_shadow 19 20 95.00
aes_shadow_reg_errors 3.000s 490.850us 19 20 95.00
sec_cm_main_config_sparse 138 145 95.17
aes_smoke 108.000s 8848.031us 10 10 100.00
aes_stress 29.000s 1595.152us 10 10 100.00
aes_alert_reset 31.000s 104.099us 24 25 96.00
aes_core_fi 224.000s 10008.050us 94 100 94.00
sec_cm_gcm_config_sparse 154 160 96.25
aes_config_error 35.000s 5302.547us 50 50 100.00
aes_stress 29.000s 1595.152us 10 10 100.00
aes_core_fi 224.000s 10008.050us 94 100 94.00
sec_cm_aux_config_shadow 19 20 95.00
aes_shadow_reg_errors 3.000s 490.850us 19 20 95.00
sec_cm_aux_config_regwen 20 20 100.00
aes_readability 3.000s 83.336us 10 10 100.00
aes_stress 29.000s 1595.152us 10 10 100.00
sec_cm_key_sideload 20 20 100.00
aes_stress 29.000s 1595.152us 10 10 100.00
aes_sideload 5.000s 202.007us 10 10 100.00
sec_cm_key_sw_unreadable 10 10 100.00
aes_readability 3.000s 83.336us 10 10 100.00
sec_cm_data_reg_sw_unreadable 10 10 100.00
aes_readability 3.000s 83.336us 10 10 100.00
sec_cm_key_sec_wipe 10 10 100.00
aes_readability 3.000s 83.336us 10 10 100.00
sec_cm_iv_config_sec_wipe 10 10 100.00
aes_readability 3.000s 83.336us 10 10 100.00
sec_cm_data_reg_sec_wipe 10 10 100.00
aes_readability 3.000s 83.336us 10 10 100.00
sec_cm_data_reg_key_sca 10 10 100.00
aes_stress 29.000s 1595.152us 10 10 100.00
sec_cm_key_masking 10 10 100.00
aes_stress 29.000s 1595.152us 10 10 100.00
sec_cm_main_fsm_sparse 0 10 0.00
aes_fi 6.000s 903.477us 0 10 0.00
sec_cm_main_fsm_redun 606 685 88.47
aes_fi 6.000s 903.477us 0 10 0.00
aes_control_fi 61.000s 0.000us 260 300 86.67
aes_cipher_fi 61.000s 0.000us 321 350 91.71
aes_ctr_fi 30.000s 64.618us 25 25 100.00
sec_cm_cipher_fsm_sparse 0 10 0.00
aes_fi 6.000s 903.477us 0 10 0.00
sec_cm_cipher_fsm_redun 581 660 88.03
aes_fi 6.000s 903.477us 0 10 0.00
aes_control_fi 61.000s 0.000us 260 300 86.67
aes_cipher_fi 61.000s 0.000us 321 350 91.71
sec_cm_cipher_ctr_redun 321 350 91.71
aes_cipher_fi 61.000s 0.000us 321 350 91.71
sec_cm_ctr_fsm_sparse 0 10 0.00
aes_fi 6.000s 903.477us 0 10 0.00
sec_cm_ctr_fsm_redun 285 335 85.07
aes_fi 6.000s 903.477us 0 10 0.00
aes_control_fi 61.000s 0.000us 260 300 86.67
aes_ctr_fi 30.000s 64.618us 25 25 100.00
sec_cm_ghash_fsm_sparse 0 10 0.00
aes_fi 6.000s 903.477us 0 10 0.00
sec_cm_ctrl_sparse 606 685 88.47
aes_fi 6.000s 903.477us 0 10 0.00
aes_control_fi 61.000s 0.000us 260 300 86.67
aes_cipher_fi 61.000s 0.000us 321 350 91.71
aes_ctr_fi 30.000s 64.618us 25 25 100.00
sec_cm_main_fsm_global_esc 24 25 96.00
aes_alert_reset 31.000s 104.099us 24 25 96.00
sec_cm_main_fsm_local_esc 606 685 88.47
aes_fi 6.000s 903.477us 0 10 0.00
aes_control_fi 61.000s 0.000us 260 300 86.67
aes_cipher_fi 61.000s 0.000us 321 350 91.71
aes_ctr_fi 30.000s 64.618us 25 25 100.00
sec_cm_cipher_fsm_local_esc 606 685 88.47
aes_fi 6.000s 903.477us 0 10 0.00
aes_control_fi 61.000s 0.000us 260 300 86.67
aes_cipher_fi 61.000s 0.000us 321 350 91.71
aes_ctr_fi 30.000s 64.618us 25 25 100.00
sec_cm_ctr_fsm_local_esc 285 335 85.07
aes_fi 6.000s 903.477us 0 10 0.00
aes_control_fi 61.000s 0.000us 260 300 86.67
aes_ctr_fi 30.000s 64.618us 25 25 100.00
sec_cm_ghash_fsm_local_esc 0 10 0.00
aes_fi 6.000s 903.477us 0 10 0.00
sec_cm_data_reg_local_esc 581 660 88.03
aes_fi 6.000s 903.477us 0 10 0.00
aes_control_fi 61.000s 0.000us 260 300 86.67
aes_cipher_fi 61.000s 0.000us 321 350 91.71
Testpoint Test Max Runtime Sim Time Pass Total %
stress_all_with_rand_reset 0 10 0.00
aes_stress_all_with_rand_reset 56.000s 2105.054us 0 10 0.00

Error Messages

   Test seed line log context
UVM_FATAL (aes_cipher_fi_vseq.sv:62) [aes_cipher_fi_vseq] wait timeout occurred! 25 test runs
aes_cipher_fi 24649027957276780413137417417380218136453686904560976502293736591388830700000 151
UVM_INFO @ 10010958125 ps: (uvm_report_catcher.svh:705) [UVM/REPORT/CATCHER]
--- UVM Report catcher Summary ---
aes_cipher_fi 78902063827345519859260202363060790750969750840757946399937363144427621744680 147
UVM_INFO @ 10007658603 ps: (uvm_report_catcher.svh:705) [UVM/REPORT/CATCHER]
--- UVM Report catcher Summary ---
aes_cipher_fi 48988112042870976145420982520039934468482477313064842532712171725338822237817 138
UVM_INFO @ 10081430345 ps: (uvm_report_catcher.svh:705) [UVM/REPORT/CATCHER]
--- UVM Report catcher Summary ---
aes_cipher_fi 36354334130123568564565369185136216836073732271299989124409082106991679589700 140
UVM_INFO @ 10078840008 ps: (uvm_report_catcher.svh:705) [UVM/REPORT/CATCHER]
--- UVM Report catcher Summary ---
aes_cipher_fi 106024392187796070186798746714136075447103688693036252561166070904827598269702 145
UVM_INFO @ 10025842664 ps: (uvm_report_catcher.svh:705) [UVM/REPORT/CATCHER]
--- UVM Report catcher Summary ---
aes_cipher_fi 22696961736879345825973129834752965141636801331253496930371588539713108664887 143
UVM_INFO @ 10023945598 ps: (uvm_report_catcher.svh:705) [UVM/REPORT/CATCHER]
--- UVM Report catcher Summary ---
aes_cipher_fi 111286009386246674573094067044259702446412443175847953143779120603005887925652 149
UVM_INFO @ 10014183758 ps: (uvm_report_catcher.svh:705) [UVM/REPORT/CATCHER]
--- UVM Report catcher Summary ---
aes_cipher_fi 4645405398189935763646570875107042297289437849087664030054763647645972342824 145
UVM_INFO @ 10017312081 ps: (uvm_report_catcher.svh:705) [UVM/REPORT/CATCHER]
--- UVM Report catcher Summary ---
aes_cipher_fi 14458423456504090922290446521289268797353808736726246510760863750026234230487 143
UVM_INFO @ 10005623806 ps: (uvm_report_catcher.svh:705) [UVM/REPORT/CATCHER]
--- UVM Report catcher Summary ---
aes_cipher_fi 27832292559514098211314518710634903069249243723804921247425849361399321488853 151
UVM_INFO @ 10027367163 ps: (uvm_report_catcher.svh:705) [UVM/REPORT/CATCHER]
--- UVM Report catcher Summary ---
aes_cipher_fi 51210759418095555198375534279401345490051322073502181109064287336137643767073 146
UVM_INFO @ 10012849517 ps: (uvm_report_catcher.svh:705) [UVM/REPORT/CATCHER]
--- UVM Report catcher Summary ---
aes_cipher_fi 52849275454670890703182352787446697657546077611085353785406544763018534996442 145
UVM_INFO @ 10162667980 ps: (uvm_report_catcher.svh:705) [UVM/REPORT/CATCHER]
--- UVM Report catcher Summary ---
aes_cipher_fi 64697882809724355297930270717910673511432420295233847207758762745391416930042 142
UVM_INFO @ 10026703033 ps: (uvm_report_catcher.svh:705) [UVM/REPORT/CATCHER]
--- UVM Report catcher Summary ---
aes_cipher_fi 29486430924159784660593353177758923224523221523322688185278071899856897877249 149
UVM_INFO @ 10004794399 ps: (uvm_report_catcher.svh:705) [UVM/REPORT/CATCHER]
--- UVM Report catcher Summary ---
aes_cipher_fi 7137169914673770962682853253508367168070523316558174876152506648593326198225 145
UVM_INFO @ 10005978678 ps: (uvm_report_catcher.svh:705) [UVM/REPORT/CATCHER]
--- UVM Report catcher Summary ---
aes_cipher_fi 38813606758193825953347972034782322203272758386284272433906280772644437324163 150
UVM_INFO @ 10007138531 ps: (uvm_report_catcher.svh:705) [UVM/REPORT/CATCHER]
--- UVM Report catcher Summary ---
aes_cipher_fi 77756594387666652388655059166371769838593606462384249552432881567127666176850 151
UVM_INFO @ 10023174023 ps: (uvm_report_catcher.svh:705) [UVM/REPORT/CATCHER]
--- UVM Report catcher Summary ---
aes_cipher_fi 26834102116001067932414755257262655741612444122277262970111446706504871416441 149
UVM_INFO @ 10035467859 ps: (uvm_report_catcher.svh:705) [UVM/REPORT/CATCHER]
--- UVM Report catcher Summary ---
aes_cipher_fi 95054882555474053883949044014383615133684817092639824988924351337332003963419 141
UVM_INFO @ 10326928344 ps: (uvm_report_catcher.svh:705) [UVM/REPORT/CATCHER]
--- UVM Report catcher Summary ---
aes_cipher_fi 5866342363046686317033811873780973921404498909345369725446688688599565603350 145
UVM_INFO @ 10022007535 ps: (uvm_report_catcher.svh:705) [UVM/REPORT/CATCHER]
--- UVM Report catcher Summary ---
aes_cipher_fi 85010803657803142930611121573815593392240459780061853499922990919946188658606 150
UVM_INFO @ 10004548858 ps: (uvm_report_catcher.svh:705) [UVM/REPORT/CATCHER]
--- UVM Report catcher Summary ---
aes_cipher_fi 42389639428761716454534015528006422733227277044522945750437311850642881784605 144
UVM_INFO @ 10006465241 ps: (uvm_report_catcher.svh:705) [UVM/REPORT/CATCHER]
--- UVM Report catcher Summary ---
aes_cipher_fi 81845821675856452306087655773949195656490175226482842954982965005241891182749 143
UVM_INFO @ 10007379610 ps: (uvm_report_catcher.svh:705) [UVM/REPORT/CATCHER]
--- UVM Report catcher Summary ---
aes_cipher_fi 115131440916945309691424767387131666129352730298257458476817113952901611219893 142
UVM_INFO @ 10010607200 ps: (uvm_report_catcher.svh:705) [UVM/REPORT/CATCHER]
--- UVM Report catcher Summary ---
aes_cipher_fi 87569753328186762577381512254349329131586200313515117254329258125192141366251 141
UVM_INFO @ 10004718146 ps: (uvm_report_catcher.svh:705) [UVM/REPORT/CATCHER]
--- UVM Report catcher Summary ---
UVM_FATAL (aes_control_fi_vseq.sv:62) [aes_control_fi_vseq] wait timeout occurred! 24 test runs
aes_control_fi 115371813682611571543695679535102074686888739076436528701542798307396841109976 147
UVM_INFO @ 10018695880 ps: (uvm_report_catcher.svh:705) [UVM/REPORT/CATCHER]
--- UVM Report catcher Summary ---
aes_control_fi 57893350860188379938511013244547758692443763046418173552025279188533854794245 145
UVM_INFO @ 10074199601 ps: (uvm_report_catcher.svh:705) [UVM/REPORT/CATCHER]
--- UVM Report catcher Summary ---
aes_control_fi 77996888360076198012812626036778863506247243187024553593911054208625548360223 144
UVM_INFO @ 10009705730 ps: (uvm_report_catcher.svh:705) [UVM/REPORT/CATCHER]
--- UVM Report catcher Summary ---
aes_control_fi 101032785772504950435524181074244047434975339748691074357006425751611185330580 152
UVM_INFO @ 10082500979 ps: (uvm_report_catcher.svh:705) [UVM/REPORT/CATCHER]
--- UVM Report catcher Summary ---
aes_control_fi 69384521732479348630712411562814950763814805519494703900156995813603997391160 138
UVM_INFO @ 10095186228 ps: (uvm_report_catcher.svh:705) [UVM/REPORT/CATCHER]
--- UVM Report catcher Summary ---
aes_control_fi 1495366493785586738781806927262409538545002895369484011003314073079567241161 146
UVM_INFO @ 10009742961 ps: (uvm_report_catcher.svh:705) [UVM/REPORT/CATCHER]
--- UVM Report catcher Summary ---
aes_control_fi 114756340796817762244459276364370275615681367841921420595577474502151646854054 146
UVM_INFO @ 10065928398 ps: (uvm_report_catcher.svh:705) [UVM/REPORT/CATCHER]
--- UVM Report catcher Summary ---
aes_control_fi 69677779903911343838851434920619516541803982683859872544792549947562668251831 147
UVM_INFO @ 10006526061 ps: (uvm_report_catcher.svh:705) [UVM/REPORT/CATCHER]
--- UVM Report catcher Summary ---
aes_control_fi 61961507185210491337013730386923061865378962725817939765071994222557860696152 149
UVM_INFO @ 10021158630 ps: (uvm_report_catcher.svh:705) [UVM/REPORT/CATCHER]
--- UVM Report catcher Summary ---
aes_control_fi 11398833582659977692058703189317009519944952835443579214793306163876774691122 149
UVM_INFO @ 10007413035 ps: (uvm_report_catcher.svh:705) [UVM/REPORT/CATCHER]
--- UVM Report catcher Summary ---
aes_control_fi 68260807084884260430849060423232104790880403540428709298740994351121027686809 143
UVM_INFO @ 10003874615 ps: (uvm_report_catcher.svh:705) [UVM/REPORT/CATCHER]
--- UVM Report catcher Summary ---
aes_control_fi 72225166846211736027445194041502938838485549452428624571900447402566068701278 143
UVM_INFO @ 10006895766 ps: (uvm_report_catcher.svh:705) [UVM/REPORT/CATCHER]
--- UVM Report catcher Summary ---
aes_control_fi 61921721863871289909723122401122234361599567886813334859661772885873542716096 150
UVM_INFO @ 10024321202 ps: (uvm_report_catcher.svh:705) [UVM/REPORT/CATCHER]
--- UVM Report catcher Summary ---
aes_control_fi 78987212320865787863128127728847724725543931669307955016071425786695291886677 151
UVM_INFO @ 10053543739 ps: (uvm_report_catcher.svh:705) [UVM/REPORT/CATCHER]
--- UVM Report catcher Summary ---
aes_control_fi 33699701206752431223737160012299504970531824685156963023787549156261067375115 147
UVM_INFO @ 10014496305 ps: (uvm_report_catcher.svh:705) [UVM/REPORT/CATCHER]
--- UVM Report catcher Summary ---
aes_control_fi 99927858122754091030105132194007674675954672062670196931072615997630282315170 146
UVM_INFO @ 10006472078 ps: (uvm_report_catcher.svh:705) [UVM/REPORT/CATCHER]
--- UVM Report catcher Summary ---
aes_control_fi 101774026534994697990583584364461306326173432340071165594117278396260577662090 151
UVM_INFO @ 10016053868 ps: (uvm_report_catcher.svh:705) [UVM/REPORT/CATCHER]
--- UVM Report catcher Summary ---
aes_control_fi 11881398173675869352512986020284439907118845862713812177367652641777021224142 147
UVM_INFO @ 10007338248 ps: (uvm_report_catcher.svh:705) [UVM/REPORT/CATCHER]
--- UVM Report catcher Summary ---
aes_control_fi 69278999511679705916417494257542518474429757367886433292405508945875608208486 141
UVM_INFO @ 10012506534 ps: (uvm_report_catcher.svh:705) [UVM/REPORT/CATCHER]
--- UVM Report catcher Summary ---
aes_control_fi 55868516990562888525170495754109437774400350637003622452550028475283752184638 149
UVM_INFO @ 10008086584 ps: (uvm_report_catcher.svh:705) [UVM/REPORT/CATCHER]
--- UVM Report catcher Summary ---
aes_control_fi 45371381505983601527358591667356749030178480193526303719313627680250507107564 143
UVM_INFO @ 10003561144 ps: (uvm_report_catcher.svh:705) [UVM/REPORT/CATCHER]
--- UVM Report catcher Summary ---
aes_control_fi 60634293350989546609110586256770013628637578663142848432698103138435360148145 151
UVM_INFO @ 10042524446 ps: (uvm_report_catcher.svh:705) [UVM/REPORT/CATCHER]
--- UVM Report catcher Summary ---
aes_control_fi 22280266142080936571428326509207971081348348667601949641855868941357392566109 141
UVM_INFO @ 10009047193 ps: (uvm_report_catcher.svh:705) [UVM/REPORT/CATCHER]
--- UVM Report catcher Summary ---
aes_control_fi 111591264031616826545084662153055786915222271578784213481902319260747658789665 141
UVM_INFO @ 10157873065 ps: (uvm_report_catcher.svh:705) [UVM/REPORT/CATCHER]
--- UVM Report catcher Summary ---
Job timed out after * minutes 20 test runs
aes_control_fi 70286720994246620120482960414639426839273611375256182681117689908773906584912 None
aes_control_fi 3361783340264814840426963636258567428663056060673554613201609184382577084836 None
aes_control_fi 10324869451714610995691515632689306085389959089147119008789866590077570512711 None
aes_control_fi 16870060970956583971334286924595269975742707816421202880615368578203296643856 None
aes_control_fi 20894395955802498594243991847139379197083687551805987493522584904655852408570 None
aes_control_fi 78761714196879323130563030323129587411719014992317612324602664155784846826803 None
aes_control_fi 39221803423420989356852715994096266407106589838581763553654855829232052949523 None
aes_cipher_fi 77189858189747678693832014578599036868023570845702321828480201899809815340913 None
aes_cipher_fi 25427177356370361120337124006772895937609963808145418584818637718282879525530 None
aes_control_fi 81926263856626911005768827197699497961680600040606805250266020179778992184578 None
aes_control_fi 11826598059743893487250962707140076432613822249927654329481305851697394669728 None
aes_control_fi 12503022404020018788093714294735195764742815962286819574219650111997217767759 None
aes_cipher_fi 43598583332749951687440515141802686009765955696971458932185763096253785241524 None
aes_control_fi 37918841174694542624309099737059536658336998751048101187404799994079737909193 None
aes_cipher_fi 70911524395527710249595983792810896400695840022862173912697679907157625742653 None
aes_control_fi 69403292118989997122504387119774575275191761807965668451612342129159190158079 None
aes_control_fi 75772262974347904661074109542932372330441550806814868546854612489250749155621 None
aes_control_fi 107122526802709573543077431135333421557666475096191993514120942759193815944803 None
aes_control_fi 57708179001939199518063338801950951056805629411403038666278228112679265660750 None
aes_control_fi 84412747496581417297507648292019769206490466878902376582811631798876650058602 None
UVM_ERROR (uvm_sequencer_base.svh:757) sequencer [SEQREQZMB] The task responsible for requesting a wait_for_grant on sequencer 'sequencer' for sequence 'parent_sequence' has been killed, to avoid a deadlock the sequence will be removed from the arbitration queues 18 test runs
aes_stress_all 11978548107828262758661072706534165079360700656788454127556802119418582216593 49571
UVM_INFO @ 231765000 ps: (uvm_report_catcher.svh:705) [UVM/REPORT/CATCHER]
--- UVM Report catcher Summary ---
aes_reseed 27963172836343757416014648475983177041285857991387479607503415602727241360916 5192
UVM_INFO @ 73503333 ps: (uvm_report_catcher.svh:705) [UVM/REPORT/CATCHER]
--- UVM Report catcher Summary ---
aes_stress_all 115668135296991935420105629653804359441854422588229510378433951114353561571059 24026
UVM_INFO @ 1777560532 ps: (uvm_report_catcher.svh:705) [UVM/REPORT/CATCHER]
--- UVM Report catcher Summary ---
aes_stress_all_with_rand_reset 45269692765610632921740063518675192119668165801392108295952139428377996617084 1206
UVM_INFO @ 2105054138 ps: (uvm_report_catcher.svh:705) [UVM/REPORT/CATCHER]
--- UVM Report catcher Summary ---
aes_reseed 21670297770778620458973450222242528992565136061453822829974224911516706430229 89152
UVM_INFO @ 941580306 ps: (uvm_report_catcher.svh:705) [UVM/REPORT/CATCHER]
--- UVM Report catcher Summary ---
aes_reseed 85402969177351314948603711757767230474551956139006310389836450772690718554088 3635
UVM_INFO @ 170013263 ps: (uvm_report_catcher.svh:705) [UVM/REPORT/CATCHER]
--- UVM Report catcher Summary ---
aes_stress_all_with_rand_reset 48169681670828471370189369348121263530153074874019918670350672515717164380097 184
UVM_INFO @ 271144295 ps: (uvm_report_catcher.svh:705) [UVM/REPORT/CATCHER]
--- UVM Report catcher Summary ---
aes_reseed 12933541503009167890077762700578569995340812568660971961388782368399764214776 12968
UVM_INFO @ 309436669 ps: (uvm_report_catcher.svh:705) [UVM/REPORT/CATCHER]
--- UVM Report catcher Summary ---
aes_stress_all 75927543660856663048141481654368181221945941503524133850722891551497413348368 119092
UVM_INFO @ 5559952187 ps: (uvm_report_catcher.svh:705) [UVM/REPORT/CATCHER]
--- UVM Report catcher Summary ---
aes_reseed 64693277874134962000868097352818218691470448254203998148019027321919632893890 17521
UVM_INFO @ 121253728 ps: (uvm_report_catcher.svh:705) [UVM/REPORT/CATCHER]
--- UVM Report catcher Summary ---
aes_stress_all 9018336996650863342037844240455078448100835320627211577823248084398417822312 10822
UVM_INFO @ 52450805 ps: (uvm_report_catcher.svh:705) [UVM/REPORT/CATCHER]
--- UVM Report catcher Summary ---
aes_stress_all_with_rand_reset 53526002795912324665200467279079579583173085305282870139088836212643695825231 1109
UVM_INFO @ 3956968968 ps: (uvm_report_catcher.svh:705) [UVM/REPORT/CATCHER]
--- UVM Report catcher Summary ---
aes_reseed 61253236321015154892702414715362931090489056730138931358140772010582698880398 1609
UVM_INFO @ 127364811 ps: (uvm_report_catcher.svh:705) [UVM/REPORT/CATCHER]
--- UVM Report catcher Summary ---
aes_reseed 92893633763131288637162126529283732527408903045375773581893287273229278060853 8708
UVM_INFO @ 54570484 ps: (uvm_report_catcher.svh:705) [UVM/REPORT/CATCHER]
--- UVM Report catcher Summary ---
aes_stress_all 89337537227993001264570566696789047208481075826630893272132507446382229264575 47235
UVM_INFO @ 2270300226 ps: (uvm_report_catcher.svh:705) [UVM/REPORT/CATCHER]
--- UVM Report catcher Summary ---
aes_stress_all_with_rand_reset 66131834215073747575515361712921612652406142554673034214505131137667614822111 184
UVM_INFO @ 77114735 ps: (uvm_report_catcher.svh:705) [UVM/REPORT/CATCHER]
--- UVM Report catcher Summary ---
aes_reseed 92472623788061438174254002805291038308033745358535295135473832764309446809379 230520
UVM_INFO @ 6853894650 ps: (uvm_report_catcher.svh:705) [UVM/REPORT/CATCHER]
--- UVM Report catcher Summary ---
aes_stress_all 788835728001374414159830427247153742433199784974083560407925902311692282866 8485
UVM_INFO @ 33911779 ps: (uvm_report_catcher.svh:705) [UVM/REPORT/CATCHER]
--- UVM Report catcher Summary ---
UVM_FATAL (aes_scoreboard.sv:926) scoreboard [scoreboard] 11 test runs
aes_fi 1930640333503986166096328668574390677384130572172393769249767540252519708024 9301
----| NO FAILURES BUT NUMBER OF EXPECTED MESSAGES DOES NOT MATCH ACTUAL
----| Expected: 6
----| Seen: 5
----| Expected corrupted: 0
aes_fi 25787251966441138119846763492719329866028535582106079429975638556035944553430 8189
----| NO FAILURES BUT NUMBER OF EXPECTED MESSAGES DOES NOT MATCH ACTUAL
----| Expected: 5
----| Seen: 4
----| Expected corrupted: 0
aes_fi 98593323123426131821084318277225180156586162099075409741974741323791123130794 13395
----| NO FAILURES BUT NUMBER OF EXPECTED MESSAGES DOES NOT MATCH ACTUAL
----| Expected: 3
----| Seen: 2
----| Expected corrupted: 0
aes_stress_all 6051334421224133780024887677380678944327434674260484547184053414526339461852 113890
----| NO FAILURES BUT NUMBER OF EXPECTED MESSAGES DOES NOT MATCH ACTUAL
----| Expected: 6
----| Seen: 5
----| Expected corrupted: 0
aes_fi 29008873799351411892149443652455007801972932833175862295712097505149221953579 17137
----| NO FAILURES BUT NUMBER OF EXPECTED MESSAGES DOES NOT MATCH ACTUAL
----| Expected: 5
----| Seen: 4
----| Expected corrupted: 0
aes_fi 61152391378926998894853088946415145789481477060740982193249191659737137629197 14498
----| NO FAILURES BUT NUMBER OF EXPECTED MESSAGES DOES NOT MATCH ACTUAL
----| Expected: 5
----| Seen: 3
----| Expected corrupted: 0
aes_fi 91774730875767583067399896330866316689700227064259608296661251493136122280257 6209
----| NO FAILURES BUT NUMBER OF EXPECTED MESSAGES DOES NOT MATCH ACTUAL
----| Expected: 4
----| Seen: 3
----| Expected corrupted: 0
aes_fi 106443416750545808744219891479575790286804218102618945241918495313106145966299 7662
----| NO FAILURES BUT NUMBER OF EXPECTED MESSAGES DOES NOT MATCH ACTUAL
----| Expected: 3
----| Seen: 2
----| Expected corrupted: 0
aes_fi 79306202239608304001716566800125431342776333326685110273656769451445034038593 9263
----| NO FAILURES BUT NUMBER OF EXPECTED MESSAGES DOES NOT MATCH ACTUAL
----| Expected: 4
----| Seen: 3
----| Expected corrupted: 0
aes_fi 56171391362747849580582836500313835053738659790087801303888318465538470350792 5634
----| NO FAILURES BUT NUMBER OF EXPECTED MESSAGES DOES NOT MATCH ACTUAL
----| Expected: 5
----| Seen: 4
----| Expected corrupted: 0
aes_fi 79263746247455032160877309715244341205225368205005695272522823091235582994411 10536
----| NO FAILURES BUT NUMBER OF EXPECTED MESSAGES DOES NOT MATCH ACTUAL
----| Expected: 6
----| Seen: 5
----| Expected corrupted: 0
UVM_FATAL (aes_core_fi_vseq.sv:70) [aes_core_fi_vseq] wait timeout occurred! 5 test runs
aes_core_fi 63166702582489097407548662085637055521859622250607519384537655749719260385952 152
UVM_INFO @ 10028632825 ps: (uvm_report_catcher.svh:705) [UVM/REPORT/CATCHER]
--- UVM Report catcher Summary ---
aes_core_fi 27506476425105228409687487815661316726884690226137753516985259423088436730181 142
UVM_INFO @ 10005116467 ps: (uvm_report_catcher.svh:705) [UVM/REPORT/CATCHER]
--- UVM Report catcher Summary ---
aes_core_fi 29012270616693426410625977596787306488914311606585283499540292153002111665142 145
UVM_INFO @ 10029291625 ps: (uvm_report_catcher.svh:705) [UVM/REPORT/CATCHER]
--- UVM Report catcher Summary ---
aes_core_fi 1633354222087178503046251044384212236072366587901046493270083523972922279864 147
UVM_INFO @ 10028021678 ps: (uvm_report_catcher.svh:705) [UVM/REPORT/CATCHER]
--- UVM Report catcher Summary ---
aes_core_fi 17887721745312478917951112714396771968187428240417092032302121786491209488890 144
UVM_INFO @ 10014844935 ps: (uvm_report_catcher.svh:705) [UVM/REPORT/CATCHER]
--- UVM Report catcher Summary ---
UVM_FATAL (cip_base_vseq.sv:1220) [aes_common_vseq] Check failed (vseq_done) 4 test runs
aes_stress_all_with_rand_reset 10166965530990411480530809384402313342646092629274189832282682822541110273860 255
UVM_INFO @ 1214636844 ps: (uvm_report_catcher.svh:705) [UVM/REPORT/CATCHER]
--- UVM Report catcher Summary ---
aes_stress_all_with_rand_reset 87925470587334678887091105704000940631408568700157651967958839901940598670023 395
UVM_INFO @ 1792257184 ps: (uvm_report_catcher.svh:705) [UVM/REPORT/CATCHER]
--- UVM Report catcher Summary ---
aes_stress_all_with_rand_reset 44903936521118394883844407150018152321475085060670428803034110772137578872933 147
UVM_INFO @ 22592456 ps: (uvm_report_catcher.svh:705) [UVM/REPORT/CATCHER]
--- UVM Report catcher Summary ---
aes_stress_all_with_rand_reset 19806741784321727702783096759427221200924484222990333795226442535965256432559 154
UVM_INFO @ 9551072 ps: (uvm_report_catcher.svh:705) [UVM/REPORT/CATCHER]
--- UVM Report catcher Summary ---
UVM_FATAL (aes_base_vseq.sv:87) [aes_stress_all_vseq] Check failed (aes_ctrl_aux[*] == cfg.do_reseed) 2 test runs
aes_stress_all_with_rand_reset 69280098903511489541167239553789387023220493314240624172434254374170229442589 109
UVM_INFO @ 4554919 ps: (uvm_report_catcher.svh:705) [UVM/REPORT/CATCHER]
--- UVM Report catcher Summary ---
aes_stress_all_with_rand_reset 40635277753090543446593041623462967675148423383137892809916907413154977893613 109
UVM_INFO @ 5109353 ps: (uvm_report_catcher.svh:705) [UVM/REPORT/CATCHER]
--- UVM Report catcher Summary ---
UVM_FATAL (aes_scoreboard.sv:785) scoreboard [scoreboard] # * 1 test run
aes_stress_all 88232907225772713275995804299179692049485344079304680422909951790970756772940 22912
TEST FAILED MESSAGES DID NOT MATCH
0 20 03 03 0
1 00 f3 f3 0
UVM_ERROR (csr_utils_pkg.sv:458) [csr_utils_pkg::csr_rd_check.isolation_fork.unmblk1] Check failed obs == exp (* [*] vs * [*]) Regname: aes_reg_block_extended.ctrl_shadowed reset value: * 1 test run
aes_shadow_reg_errors 96333671520640690153389436539931524939186742235753395073795658492542001366400 106
UVM_INFO @ 153995786 ps: (uvm_report_catcher.svh:705) [UVM/REPORT/CATCHER]
--- UVM Report catcher Summary ---
xmsim: *E,ASRTST (/nightly/current_run/scratch/master/aes_masked-sim-xcelium/default/fusesoc-work/src/lowrisc_ip_aes_*/rtl/aes_core.sv,1136): Assertion AesSecCmDataRegLocalEscDataOut has failed (* cycles, starting * PS) 1 test run
aes_alert_reset 52962214061360281389397247616954932251342767138077994185385491704322686275228 2715
UVM_ERROR @ 26133030 ps: (aes_core.sv:1136) [ASSERT FAILED] AesSecCmDataRegLocalEscDataOut
UVM_INFO @ 26133030 ps: (uvm_report_catcher.svh:705) [UVM/REPORT/CATCHER]
--- UVM Report catcher Summary ---
UVM_FATAL (csr_utils_pkg.sv:618) [csr_utils_pkg::csr_spinwait.isolation_fork] timeout aes_reg_block_extended.status.idle (addr=*, Comparison=CompareOpEq, exp_data=*, call_count=8) 1 test run
aes_core_fi 7995138932101694572034786637748999345627370786113625524280161078413642832397 137
UVM_INFO @ 10008049780 ps: (uvm_report_catcher.svh:705) [UVM/REPORT/CATCHER]
--- UVM Report catcher Summary ---