Simulation Results: chip

 
13/06/2026 02:15:06 DVSim: v1.49.0 sha: 9424e63 json Branch: master Tool: vcs [unknown]
Coverage statistics
  • Total
  • 94.41 %
  • code
  • 85.85 %
  • assert
  • 98.00 %
  • func
  • 99.38 %
  • line
  • 94.78 %
  • branch
  • 94.86 %
  • cond
  • 93.47 %
  • toggle
  • 89.00 %
  • FSM
  • 57.14 %
Validation stages
V1
98.44%
V2
86.10%
V2S
100.00%
V3
88.05%
unmapped
58.06%
Testpoint Test Max Runtime Sim Time Pass Total %
chip_sw_example_tests 12 12 100.00
chip_sw_example_flash 220.720s 3450.755us 3 3 100.00
chip_sw_example_rom 104.650s 2534.036us 3 3 100.00
chip_sw_example_manufacturer 244.190s 3067.946us 3 3 100.00
chip_sw_example_concurrency 225.790s 2657.204us 3 3 100.00
csr_hw_reset 1 1 100.00
chip_csr_hw_reset 184.440s 4520.544us 1 1 100.00
csr_rw 5 5 100.00
chip_csr_rw 518.640s 6136.806us 5 5 100.00
csr_bit_bash 1 1 100.00
chip_csr_bit_bash 2676.840s 31576.217us 1 1 100.00
csr_aliasing 1 1 100.00
chip_csr_aliasing 4747.760s 28853.588us 1 1 100.00
csr_mem_rw_with_rand_reset 3 5 60.00
chip_csr_mem_rw_with_rand_reset 649.240s 9333.467us 3 5 60.00
regwen_csr_and_corresponding_lockable_csr 6 6 100.00
chip_csr_aliasing 4747.760s 28853.588us 1 1 100.00
chip_csr_rw 518.640s 6136.806us 5 5 100.00
xbar_smoke 50 50 100.00
xbar_smoke 10.960s 241.418us 50 50 100.00
chip_sw_gpio_out 3 3 100.00
chip_sw_gpio 422.300s 4723.675us 3 3 100.00
chip_sw_gpio_in 3 3 100.00
chip_sw_gpio 422.300s 4723.675us 3 3 100.00
chip_sw_gpio_irq 3 3 100.00
chip_sw_gpio 422.300s 4723.675us 3 3 100.00
chip_sw_uart_tx_rx 5 5 100.00
chip_sw_uart_tx_rx 572.190s 4717.999us 5 5 100.00
chip_sw_uart_rx_overflow 20 20 100.00
chip_sw_uart_tx_rx 572.190s 4717.999us 5 5 100.00
chip_sw_uart_tx_rx_idx1 520.880s 4051.573us 5 5 100.00
chip_sw_uart_tx_rx_idx2 560.760s 4626.391us 5 5 100.00
chip_sw_uart_tx_rx_idx3 503.980s 4587.035us 5 5 100.00
chip_sw_uart_baud_rate 20 20 100.00
chip_sw_uart_rand_baudrate 2302.320s 13339.141us 20 20 100.00
chip_sw_uart_tx_rx_alt_clk_freq 10 10 100.00
chip_sw_uart_tx_rx_alt_clk_freq 2196.630s 12733.923us 5 5 100.00
chip_sw_uart_tx_rx_alt_clk_freq_low_speed 951.330s 8860.127us 5 5 100.00
Testpoint Test Max Runtime Sim Time Pass Total %
chip_pin_mux 10 10 100.00
chip_padctrl_attributes 339.820s 5513.072us 10 10 100.00
chip_padctrl_attributes 10 10 100.00
chip_padctrl_attributes 339.820s 5513.072us 10 10 100.00
chip_sw_sleep_pin_mio_dio_val 3 3 100.00
chip_sw_sleep_pin_mio_dio_val 245.100s 3584.385us 3 3 100.00
chip_sw_sleep_pin_wake 3 3 100.00
chip_sw_sleep_pin_wake 455.890s 5384.812us 3 3 100.00
chip_sw_sleep_pin_retention 3 3 100.00
chip_sw_sleep_pin_retention 302.160s 4634.177us 3 3 100.00
chip_sw_tap_strap_sampling 20 20 100.00
chip_tap_straps_dev 1264.510s 13448.350us 5 5 100.00
chip_tap_straps_testunlock0 502.700s 6689.890us 5 5 100.00
chip_tap_straps_rma 878.620s 9443.216us 5 5 100.00
chip_tap_straps_prod 633.660s 9018.565us 5 5 100.00
chip_sw_pattgen_ios 3 3 100.00
chip_sw_pattgen_ios 276.660s 3779.572us 3 3 100.00
chip_sw_sleep_pwm_pulses 3 3 100.00
chip_sw_sleep_pwm_pulses 1041.580s 10040.682us 3 3 100.00
chip_sw_data_integrity 6 6 100.00
chip_sw_data_integrity_escalation 682.830s 6509.969us 6 6 100.00
chip_sw_instruction_integrity 6 6 100.00
chip_sw_data_integrity_escalation 682.830s 6509.969us 6 6 100.00
chip_sw_ast_clk_outputs 3 3 100.00
chip_sw_ast_clk_outputs 897.480s 8158.512us 3 3 100.00
chip_sw_ast_clk_rst_inputs 0 3 0.00
chip_sw_ast_clk_rst_inputs 1876.830s 12409.674us 0 3 0.00
chip_sw_ast_sys_clk_jitter 30 30 100.00
chip_sw_flash_ctrl_ops_jitter_en 493.360s 4130.639us 3 3 100.00
chip_sw_flash_ctrl_access_jitter_en 797.350s 5837.653us 3 3 100.00
chip_sw_otbn_ecdsa_op_irq_jitter_en 5135.770s 20115.284us 3 3 100.00
chip_sw_aes_enc_jitter_en 256.210s 2850.911us 3 3 100.00
chip_sw_edn_entropy_reqs_jitter 978.550s 7289.530us 3 3 100.00
chip_sw_hmac_enc_jitter_en 265.570s 3409.539us 3 3 100.00
chip_sw_keymgr_key_derivation_jitter_en 1662.000s 11046.746us 3 3 100.00
chip_sw_kmac_mode_kmac_jitter_en 315.360s 3787.144us 3 3 100.00
chip_sw_sram_ctrl_scrambled_access_jitter_en 520.970s 5381.626us 3 3 100.00
chip_sw_clkmgr_jitter 223.440s 3216.524us 3 3 100.00
chip_sw_ast_usb_clk_calib 1 1 100.00
chip_sw_usb_ast_clk_calib 290.290s 3466.370us 1 1 100.00
chip_sw_sensor_ctrl_ast_alerts 7 8 87.50
chip_sw_sensor_ctrl_alert 624.800s 7528.979us 4 5 80.00
chip_sw_pwrmgr_sleep_sensor_ctrl_alert_wakeup 364.060s 5227.200us 3 3 100.00
chip_sw_sensor_ctrl_ast_status 3 3 100.00
chip_sw_sensor_ctrl_status 212.350s 3216.086us 3 3 100.00
chip_sw_pwrmgr_sleep_sensor_ctrl_alert_wakeup 3 3 100.00
chip_sw_pwrmgr_sleep_sensor_ctrl_alert_wakeup 364.060s 5227.200us 3 3 100.00
chip_sw_smoketest 51 51 100.00
chip_sw_flash_scrambling_smoketest 239.080s 2601.457us 3 3 100.00
chip_sw_aes_smoketest 270.990s 3548.619us 3 3 100.00
chip_sw_aon_timer_smoketest 273.700s 3259.878us 3 3 100.00
chip_sw_clkmgr_smoketest 276.950s 3194.141us 3 3 100.00
chip_sw_csrng_smoketest 260.680s 3927.457us 3 3 100.00
chip_sw_entropy_src_smoketest 1150.980s 7371.580us 3 3 100.00
chip_sw_gpio_smoketest 245.160s 3400.354us 3 3 100.00
chip_sw_hmac_smoketest 337.980s 3619.541us 3 3 100.00
chip_sw_kmac_smoketest 263.600s 3338.099us 3 3 100.00
chip_sw_otbn_smoketest 2001.440s 11827.612us 3 3 100.00
chip_sw_pwrmgr_smoketest 428.310s 5937.770us 3 3 100.00
chip_sw_pwrmgr_usbdev_smoketest 373.500s 6847.804us 3 3 100.00
chip_sw_rv_plic_smoketest 229.200s 2790.960us 3 3 100.00
chip_sw_rv_timer_smoketest 237.350s 3660.005us 3 3 100.00
chip_sw_rstmgr_smoketest 195.540s 2809.774us 3 3 100.00
chip_sw_sram_ctrl_smoketest 221.330s 3694.237us 3 3 100.00
chip_sw_uart_smoketest 255.550s 3354.655us 3 3 100.00
chip_sw_otp_smoketest 3 3 100.00
chip_sw_otp_ctrl_smoketest 250.090s 3445.090us 3 3 100.00
chip_sw_rom_functests 0 3 0.00
rom_keymgr_functest 560.230s 5590.205us 0 3 0.00
chip_sw_boot 3 3 100.00
chip_sw_uart_tx_rx_bootstrap 13447.520s 63190.195us 3 3 100.00
chip_sw_secure_boot 3 3 100.00
rom_e2e_smoke 3907.590s 19665.007us 3 3 100.00
chip_sw_rom_raw_unlock 0 3 0.00
rom_raw_unlock 11.822s 0.000us 0 3 0.00
chip_sw_power_idle_load 0 3 0.00
chip_sw_power_idle_load 321.200s 4067.144us 0 3 0.00
chip_sw_power_sleep_load 0 3 0.00
chip_sw_power_sleep_load 226.770s 3432.865us 0 3 0.00
chip_sw_exit_test_unlocked_bootstrap 3 3 100.00
chip_sw_exit_test_unlocked_bootstrap 11104.480s 56884.283us 3 3 100.00
chip_sw_inject_scramble_seed 3 3 100.00
chip_sw_inject_scramble_seed 12394.030s 58982.825us 3 3 100.00
tl_d_oob_addr_access 5 30 16.67
chip_tl_errors 307.430s 4442.575us 5 30 16.67
tl_d_illegal_access 5 30 16.67
chip_tl_errors 307.430s 4442.575us 5 30 16.67
tl_d_outstanding_access 12 12 100.00
chip_csr_aliasing 4747.760s 28853.588us 1 1 100.00
chip_same_csr_outstanding 3406.840s 30495.857us 5 5 100.00
chip_csr_hw_reset 184.440s 4520.544us 1 1 100.00
chip_csr_rw 518.640s 6136.806us 5 5 100.00
tl_d_partial_access 12 12 100.00
chip_csr_aliasing 4747.760s 28853.588us 1 1 100.00
chip_same_csr_outstanding 3406.840s 30495.857us 5 5 100.00
chip_csr_hw_reset 184.440s 4520.544us 1 1 100.00
chip_csr_rw 518.640s 6136.806us 5 5 100.00
xbar_base_random_sequence 50 50 100.00
xbar_random 74.410s 1804.814us 50 50 100.00
xbar_random_delay 300 300 100.00
xbar_smoke_zero_delays 7.570s 53.095us 50 50 100.00
xbar_smoke_large_delays 103.770s 12045.162us 50 50 100.00
xbar_smoke_slow_rsp 76.330s 6933.387us 50 50 100.00
xbar_random_zero_delays 49.890s 603.647us 50 50 100.00
xbar_random_large_delays 429.890s 52948.388us 50 50 100.00
xbar_random_slow_rsp 375.350s 33457.156us 50 50 100.00
xbar_unmapped_address 100 100 100.00
xbar_unmapped_addr 61.310s 1531.479us 50 50 100.00
xbar_error_and_unmapped_addr 56.990s 1224.026us 50 50 100.00
xbar_error_cases 100 100 100.00
xbar_error_random 86.120s 2881.708us 50 50 100.00
xbar_error_and_unmapped_addr 56.990s 1224.026us 50 50 100.00
xbar_all_access_same_device 100 100 100.00
xbar_access_same_device 125.670s 3010.046us 50 50 100.00
xbar_access_same_device_slow_rsp 985.910s 86605.638us 50 50 100.00
xbar_all_hosts_use_same_source_id 50 50 100.00
xbar_same_source 78.690s 2686.883us 50 50 100.00
xbar_stress_all 100 100 100.00
xbar_stress_all 500.660s 17210.118us 50 50 100.00
xbar_stress_all_with_error 664.180s 23182.739us 50 50 100.00
xbar_stress_with_reset 100 100 100.00
xbar_stress_all_with_rand_reset 783.360s 19804.028us 50 50 100.00
xbar_stress_all_with_reset_error 521.720s 7196.869us 50 50 100.00
rom_e2e_smoke 3 3 100.00
rom_e2e_smoke 3907.590s 19665.007us 3 3 100.00
rom_e2e_shutdown_output 3 3 100.00
rom_e2e_shutdown_output 3505.980s 26325.542us 3 3 100.00
rom_e2e_shutdown_exception_c 3 3 100.00
rom_e2e_shutdown_exception_c 3889.820s 15771.064us 3 3 100.00
rom_e2e_boot_policy_valid 0 15 0.00
rom_e2e_boot_policy_valid_a_good_b_good_test_unlocked0 39.431s 0.000us 0 1 0.00
rom_e2e_boot_policy_valid_a_good_b_good_dev 11.448s 0.000us 0 1 0.00
rom_e2e_boot_policy_valid_a_good_b_good_prod 11.186s 0.000us 0 1 0.00
rom_e2e_boot_policy_valid_a_good_b_good_prod_end 11.921s 0.000us 0 1 0.00
rom_e2e_boot_policy_valid_a_good_b_good_rma 11.390s 0.000us 0 1 0.00
rom_e2e_boot_policy_valid_a_good_b_bad_test_unlocked0 55.301s 0.000us 0 1 0.00
rom_e2e_boot_policy_valid_a_good_b_bad_dev 11.684s 0.000us 0 1 0.00
rom_e2e_boot_policy_valid_a_good_b_bad_prod 11.145s 0.000us 0 1 0.00
rom_e2e_boot_policy_valid_a_good_b_bad_prod_end 11.190s 0.000us 0 1 0.00
rom_e2e_boot_policy_valid_a_good_b_bad_rma 11.734s 0.000us 0 1 0.00
rom_e2e_boot_policy_valid_a_bad_b_good_test_unlocked0 87.491s 0.000us 0 1 0.00
rom_e2e_boot_policy_valid_a_bad_b_good_dev 11.833s 0.000us 0 1 0.00
rom_e2e_boot_policy_valid_a_bad_b_good_prod 10.880s 0.000us 0 1 0.00
rom_e2e_boot_policy_valid_a_bad_b_good_prod_end 11.675s 0.000us 0 1 0.00
rom_e2e_boot_policy_valid_a_bad_b_good_rma 11.457s 0.000us 0 1 0.00
rom_e2e_sigverify_always 0 15 0.00
rom_e2e_sigverify_always_a_bad_b_bad_test_unlocked0 20.310s 10.320us 0 1 0.00
rom_e2e_sigverify_always_a_bad_b_bad_dev 19.560s 10.260us 0 1 0.00
rom_e2e_sigverify_always_a_bad_b_bad_prod 33.470s 10.400us 0 1 0.00
rom_e2e_sigverify_always_a_bad_b_bad_prod_end 32.920s 10.300us 0 1 0.00
rom_e2e_sigverify_always_a_bad_b_bad_rma 34.790s 10.300us 0 1 0.00
rom_e2e_sigverify_always_a_bad_b_nothing_test_unlocked0 25.800s 10.340us 0 1 0.00
rom_e2e_sigverify_always_a_bad_b_nothing_dev 34.250s 10.180us 0 1 0.00
rom_e2e_sigverify_always_a_bad_b_nothing_prod 29.540s 10.240us 0 1 0.00
rom_e2e_sigverify_always_a_bad_b_nothing_prod_end 33.910s 10.260us 0 1 0.00
rom_e2e_sigverify_always_a_bad_b_nothing_rma 29.450s 10.220us 0 1 0.00
rom_e2e_sigverify_always_a_nothing_b_bad_test_unlocked0 23.900s 10.320us 0 1 0.00
rom_e2e_sigverify_always_a_nothing_b_bad_dev 20.200s 10.100us 0 1 0.00
rom_e2e_sigverify_always_a_nothing_b_bad_prod 31.290s 10.140us 0 1 0.00
rom_e2e_sigverify_always_a_nothing_b_bad_prod_end 32.530s 10.140us 0 1 0.00
rom_e2e_sigverify_always_a_nothing_b_bad_rma 28.440s 10.280us 0 1 0.00
rom_e2e_asm_init 0 15 0.00
rom_e2e_asm_init_test_unlocked0 78.384s 0.000us 0 3 0.00
rom_e2e_asm_init_dev 12.348s 0.000us 0 3 0.00
rom_e2e_asm_init_prod 12.236s 0.000us 0 3 0.00
rom_e2e_asm_init_prod_end 11.412s 0.000us 0 3 0.00
rom_e2e_asm_init_rma 11.987s 0.000us 0 3 0.00
rom_e2e_keymgr_init 6 9 66.67
rom_e2e_keymgr_init_rom_ext_meas 7604.950s 29862.247us 1 3 33.33
rom_e2e_keymgr_init_rom_ext_no_meas 7938.120s 31356.823us 3 3 100.00
rom_e2e_keymgr_init_rom_ext_invalid_meas 7813.390s 29894.042us 2 3 66.67
rom_e2e_static_critical 3 3 100.00
rom_e2e_static_critical 4108.080s 16783.611us 3 3 100.00
chip_sw_adc_ctrl_debug_cable_irq 0 3 0.00
chip_sw_adc_ctrl_sleep_debug_cable_wakeup 3600.174s 0.000us 0 3 0.00
chip_sw_adc_ctrl_sleep_debug_cable_wakeup 0 3 0.00
chip_sw_adc_ctrl_sleep_debug_cable_wakeup 3600.174s 0.000us 0 3 0.00
chip_sw_aes_enc 6 6 100.00
chip_sw_aes_enc 231.900s 3639.919us 3 3 100.00
chip_sw_aes_enc_jitter_en 256.210s 2850.911us 3 3 100.00
chip_sw_aes_entropy 3 3 100.00
chip_sw_aes_entropy 214.390s 2583.710us 3 3 100.00
chip_sw_aes_idle 3 3 100.00
chip_sw_aes_idle 244.860s 2956.361us 3 3 100.00
chip_sw_aes_sideload 3 3 100.00
chip_sw_keymgr_sideload_aes 1886.010s 10250.090us 3 3 100.00
chip_sw_alert_handler_alerts 0 3 0.00
chip_sw_alert_test 271.540s 3772.053us 0 3 0.00
chip_sw_alert_handler_escalations 3 3 100.00
chip_sw_alert_handler_escalation 526.280s 5323.247us 3 3 100.00
chip_sw_all_escalation_resets 96 100 96.00
chip_sw_all_escalation_resets 649.420s 5939.764us 96 100 96.00
chip_sw_alert_handler_irqs 9 9 100.00
chip_plic_all_irqs_0 707.100s 5328.168us 3 3 100.00
chip_plic_all_irqs_10 413.410s 3943.026us 3 3 100.00
chip_plic_all_irqs_20 548.760s 5038.543us 3 3 100.00
chip_sw_alert_handler_entropy 3 3 100.00
chip_sw_alert_handler_entropy 256.670s 3097.159us 3 3 100.00
chip_sw_alert_handler_crashdump 3 3 100.00
chip_sw_rstmgr_alert_info 1465.630s 13321.707us 3 3 100.00
chip_sw_alert_handler_ping_timeout 3 3 100.00
chip_sw_alert_handler_ping_timeout 384.700s 4652.185us 3 3 100.00
chip_sw_alert_handler_lpg_sleep_mode_alerts 0 90 0.00
chip_sw_alert_handler_lpg_sleep_mode_alerts 304.040s 2986.075us 0 90 0.00
chip_sw_alert_handler_lpg_sleep_mode_pings 0 3 0.00
chip_sw_alert_handler_lpg_sleep_mode_pings 14400.174s 0.000us 0 3 0.00
chip_sw_alert_handler_lpg_clock_off 3 3 100.00
chip_sw_alert_handler_lpg_clkoff 1712.950s 9693.312us 3 3 100.00
chip_sw_alert_handler_lpg_reset_toggle 3 3 100.00
chip_sw_alert_handler_lpg_reset_toggle 1655.590s 8765.349us 3 3 100.00
chip_sw_alert_handler_ping_ok 3 3 100.00
chip_sw_alert_handler_ping_ok 1081.550s 8573.761us 3 3 100.00
chip_sw_alert_handler_reverse_ping_in_deep_sleep 3 3 100.00
chip_sw_alert_handler_reverse_ping_in_deep_sleep 13681.370s 255062.869us 3 3 100.00
chip_sw_aon_timer_wakeup_irq 3 3 100.00
chip_sw_aon_timer_irq 381.220s 4256.696us 3 3 100.00
chip_sw_aon_timer_sleep_wakeup 3 3 100.00
chip_sw_pwrmgr_smoketest 428.310s 5937.770us 3 3 100.00
chip_sw_aon_timer_wdog_bark_irq 3 3 100.00
chip_sw_aon_timer_irq 381.220s 4256.696us 3 3 100.00
chip_sw_aon_timer_wdog_bite_reset 1 3 33.33
chip_sw_aon_timer_wdog_bite_reset 836.960s 8668.132us 1 3 33.33
chip_sw_aon_timer_sleep_wdog_bite_reset 1 3 33.33
chip_sw_aon_timer_wdog_bite_reset 836.960s 8668.132us 1 3 33.33
chip_sw_aon_timer_sleep_wdog_sleep_pause 5 5 100.00
chip_sw_aon_timer_sleep_wdog_sleep_pause 471.950s 6933.049us 5 5 100.00
chip_sw_aon_timer_wdog_lc_escalate 3 3 100.00
chip_sw_aon_timer_wdog_lc_escalate 475.010s 5947.589us 3 3 100.00
chip_sw_clkmgr_idle_trans 12 12 100.00
chip_sw_otbn_randomness 846.440s 5746.820us 3 3 100.00
chip_sw_aes_idle 244.860s 2956.361us 3 3 100.00
chip_sw_hmac_enc_idle 246.980s 3252.052us 3 3 100.00
chip_sw_kmac_idle 291.080s 3519.423us 3 3 100.00
chip_sw_clkmgr_off_trans 12 12 100.00
chip_sw_clkmgr_off_aes_trans 444.220s 4903.525us 3 3 100.00
chip_sw_clkmgr_off_hmac_trans 438.460s 5015.322us 3 3 100.00
chip_sw_clkmgr_off_kmac_trans 393.300s 4581.086us 3 3 100.00
chip_sw_clkmgr_off_otbn_trans 394.380s 5523.945us 3 3 100.00
chip_sw_clkmgr_off_peri 3 3 100.00
chip_sw_clkmgr_off_peri 1216.290s 12117.316us 3 3 100.00
chip_sw_clkmgr_div 21 21 100.00
chip_sw_clkmgr_external_clk_src_for_sw_fast_test_unlocked0 521.870s 4074.825us 3 3 100.00
chip_sw_clkmgr_external_clk_src_for_sw_slow_test_unlocked0 537.610s 4908.728us 3 3 100.00
chip_sw_clkmgr_external_clk_src_for_sw_fast_dev 562.950s 4778.213us 3 3 100.00
chip_sw_clkmgr_external_clk_src_for_sw_slow_dev 526.960s 4630.699us 3 3 100.00
chip_sw_clkmgr_external_clk_src_for_sw_fast_rma 532.880s 4356.618us 3 3 100.00
chip_sw_clkmgr_external_clk_src_for_sw_slow_rma 531.830s 5195.647us 3 3 100.00
chip_sw_ast_clk_outputs 897.480s 8158.512us 3 3 100.00
chip_sw_clkmgr_external_clk_src_for_lc 3 3 100.00
chip_sw_clkmgr_external_clk_src_for_lc 677.730s 10340.106us 3 3 100.00
chip_sw_clkmgr_external_clk_src_for_sw 6 6 100.00
chip_sw_clkmgr_external_clk_src_for_sw_fast_dev 562.950s 4778.213us 3 3 100.00
chip_sw_clkmgr_external_clk_src_for_sw_slow_dev 526.960s 4630.699us 3 3 100.00
chip_sw_clkmgr_jitter 30 30 100.00
chip_sw_flash_ctrl_ops_jitter_en 493.360s 4130.639us 3 3 100.00
chip_sw_flash_ctrl_access_jitter_en 797.350s 5837.653us 3 3 100.00
chip_sw_otbn_ecdsa_op_irq_jitter_en 5135.770s 20115.284us 3 3 100.00
chip_sw_aes_enc_jitter_en 256.210s 2850.911us 3 3 100.00
chip_sw_edn_entropy_reqs_jitter 978.550s 7289.530us 3 3 100.00
chip_sw_hmac_enc_jitter_en 265.570s 3409.539us 3 3 100.00
chip_sw_keymgr_key_derivation_jitter_en 1662.000s 11046.746us 3 3 100.00
chip_sw_kmac_mode_kmac_jitter_en 315.360s 3787.144us 3 3 100.00
chip_sw_sram_ctrl_scrambled_access_jitter_en 520.970s 5381.626us 3 3 100.00
chip_sw_clkmgr_jitter 223.440s 3216.524us 3 3 100.00
chip_sw_clkmgr_extended_range 33 33 100.00
chip_sw_clkmgr_jitter_reduced_freq 218.750s 3266.141us 3 3 100.00
chip_sw_flash_ctrl_ops_jitter_en_reduced_freq 580.270s 5114.625us 3 3 100.00
chip_sw_flash_ctrl_access_jitter_en_reduced_freq 935.490s 7159.083us 3 3 100.00
chip_sw_otbn_ecdsa_op_irq_jitter_en_reduced_freq 5284.210s 25309.684us 3 3 100.00
chip_sw_aes_enc_jitter_en_reduced_freq 255.480s 2784.049us 3 3 100.00
chip_sw_hmac_enc_jitter_en_reduced_freq 203.550s 3177.638us 3 3 100.00
chip_sw_keymgr_key_derivation_jitter_en_reduced_freq 1519.780s 12049.040us 3 3 100.00
chip_sw_kmac_mode_kmac_jitter_en_reduced_freq 318.990s 3407.985us 3 3 100.00
chip_sw_sram_ctrl_scrambled_access_jitter_en_reduced_freq 515.010s 6086.599us 3 3 100.00
chip_sw_flash_init_reduced_freq 1723.300s 22915.404us 3 3 100.00
chip_sw_csrng_edn_concurrency_reduced_freq 22863.510s 142048.019us 3 3 100.00
chip_sw_clkmgr_deep_sleep_frequency 3 3 100.00
chip_sw_ast_clk_outputs 897.480s 8158.512us 3 3 100.00
chip_sw_clkmgr_sleep_frequency 3 3 100.00
chip_sw_clkmgr_sleep_frequency 435.030s 4515.979us 3 3 100.00
chip_sw_clkmgr_reset_frequency 3 3 100.00
chip_sw_clkmgr_reset_frequency 358.490s 4159.996us 3 3 100.00
chip_sw_clkmgr_escalation_reset 96 100 96.00
chip_sw_all_escalation_resets 649.420s 5939.764us 96 100 96.00
chip_sw_clkmgr_alert_handler_clock_enables 3 3 100.00
chip_sw_alert_handler_lpg_clkoff 1712.950s 9693.312us 3 3 100.00
chip_sw_csrng_edn_cmd 3 3 100.00
chip_sw_entropy_src_csrng 2564.330s 24449.506us 3 3 100.00
chip_sw_csrng_fuse_en_sw_app_read 1 3 33.33
chip_sw_csrng_fuse_en_sw_app_read_test 370.420s 4838.473us 1 3 33.33
chip_sw_csrng_lc_hw_debug_en 3 3 100.00
chip_sw_csrng_lc_hw_debug_en_test 672.180s 7749.454us 3 3 100.00
chip_sw_csrng_known_answer_tests 3 3 100.00
chip_sw_csrng_kat_test 236.160s 3253.475us 3 3 100.00
chip_sw_edn_entropy_reqs 16 16 100.00
chip_sw_csrng_edn_concurrency 7396.090s 31218.116us 10 10 100.00
chip_sw_entropy_src_ast_rng_req 281.530s 3261.436us 3 3 100.00
chip_sw_edn_entropy_reqs 1060.810s 7957.453us 3 3 100.00
chip_sw_entropy_src_ast_rng_req 3 3 100.00
chip_sw_entropy_src_ast_rng_req 281.530s 3261.436us 3 3 100.00
chip_sw_entropy_src_csrng 3 3 100.00
chip_sw_entropy_src_csrng 2564.330s 24449.506us 3 3 100.00
chip_sw_entropy_src_known_answer_tests 3 3 100.00
chip_sw_entropy_src_kat_test 249.500s 2766.872us 3 3 100.00
chip_sw_flash_init 3 3 100.00
chip_sw_flash_init 1413.860s 25146.036us 3 3 100.00
chip_sw_flash_host_access 6 6 100.00
chip_sw_flash_ctrl_access 816.260s 5452.219us 3 3 100.00
chip_sw_flash_ctrl_access_jitter_en 797.350s 5837.653us 3 3 100.00
chip_sw_flash_ctrl_ops 6 6 100.00
chip_sw_flash_ctrl_ops 519.310s 4135.460us 3 3 100.00
chip_sw_flash_ctrl_ops_jitter_en 493.360s 4130.639us 3 3 100.00
chip_sw_flash_rma_unlocked 3 3 100.00
chip_sw_flash_rma_unlocked 5095.930s 42464.441us 3 3 100.00
chip_sw_flash_scramble 3 3 100.00
chip_sw_flash_init 1413.860s 25146.036us 3 3 100.00
chip_sw_flash_idle_low_power 3 3 100.00
chip_sw_flash_ctrl_idle_low_power 324.560s 4116.805us 3 3 100.00
chip_sw_flash_keymgr_seeds 3 3 100.00
chip_sw_keymgr_key_derivation 2226.700s 13628.489us 3 3 100.00
chip_sw_flash_lc_creator_seed_sw_rw_en 0 3 0.00
chip_sw_flash_ctrl_lc_rw_en 258.080s 3146.299us 0 3 0.00
chip_sw_flash_creator_seed_wipe_on_rma 3 3 100.00
chip_sw_flash_rma_unlocked 5095.930s 42464.441us 3 3 100.00
chip_sw_flash_lc_owner_seed_sw_rw_en 0 3 0.00
chip_sw_flash_ctrl_lc_rw_en 258.080s 3146.299us 0 3 0.00
chip_sw_flash_lc_iso_part_sw_rd_en 0 3 0.00
chip_sw_flash_ctrl_lc_rw_en 258.080s 3146.299us 0 3 0.00
chip_sw_flash_lc_iso_part_sw_wr_en 0 3 0.00
chip_sw_flash_ctrl_lc_rw_en 258.080s 3146.299us 0 3 0.00
chip_sw_flash_lc_seed_hw_rd_en 0 3 0.00
chip_sw_flash_ctrl_lc_rw_en 258.080s 3146.299us 0 3 0.00
chip_sw_flash_lc_escalate_en 96 100 96.00
chip_sw_all_escalation_resets 649.420s 5939.764us 96 100 96.00
chip_sw_flash_prim_tl_access 3 3 100.00
chip_prim_tl_access 551.950s 14160.866us 3 3 100.00
chip_sw_flash_ctrl_clock_freqs 3 3 100.00
chip_sw_flash_ctrl_clock_freqs 775.490s 5229.132us 3 3 100.00
chip_sw_flash_ctrl_escalation_reset 3 3 100.00
chip_sw_flash_crash_alert 562.420s 5081.176us 3 3 100.00
chip_sw_flash_ctrl_write_clear 3 3 100.00
chip_sw_flash_crash_alert 562.420s 5081.176us 3 3 100.00
chip_sw_hmac_enc 6 6 100.00
chip_sw_hmac_enc 253.140s 2802.665us 3 3 100.00
chip_sw_hmac_enc_jitter_en 265.570s 3409.539us 3 3 100.00
chip_sw_hmac_idle 3 3 100.00
chip_sw_hmac_enc_idle 246.980s 3252.052us 3 3 100.00
chip_sw_hmac_all_configurations 0 3 0.00
chip_sw_hmac_oneshot 2287.060s 12018.439us 0 3 0.00
chip_sw_hmac_multistream_mode 0 3 0.00
chip_sw_hmac_multistream 2183.180s 12018.432us 0 3 0.00
chip_sw_i2c_host_tx_rx 9 9 100.00
chip_sw_i2c_host_tx_rx 602.120s 5288.037us 3 3 100.00
chip_sw_i2c_host_tx_rx_idx1 544.530s 5197.145us 3 3 100.00
chip_sw_i2c_host_tx_rx_idx2 708.570s 6456.437us 3 3 100.00
chip_sw_i2c_device_tx_rx 3 3 100.00
chip_sw_i2c_device_tx_rx 455.510s 3799.111us 3 3 100.00
chip_sw_keymgr_key_derivation 6 6 100.00
chip_sw_keymgr_key_derivation 2226.700s 13628.489us 3 3 100.00
chip_sw_keymgr_key_derivation_jitter_en 1662.000s 11046.746us 3 3 100.00
chip_sw_keymgr_sideload_kmac 3 3 100.00
chip_sw_keymgr_sideload_kmac 2119.690s 12699.559us 3 3 100.00
chip_sw_keymgr_sideload_aes 3 3 100.00
chip_sw_keymgr_sideload_aes 1886.010s 10250.090us 3 3 100.00
chip_sw_keymgr_sideload_otbn 0 3 0.00
chip_sw_keymgr_sideload_otbn 5722.180s 20018.320us 0 3 0.00
chip_sw_kmac_enc 9 9 100.00
chip_sw_kmac_mode_cshake 210.920s 2911.680us 3 3 100.00
chip_sw_kmac_mode_kmac 296.680s 3516.955us 3 3 100.00
chip_sw_kmac_mode_kmac_jitter_en 315.360s 3787.144us 3 3 100.00
chip_sw_kmac_app_keymgr 3 3 100.00
chip_sw_keymgr_key_derivation 2226.700s 13628.489us 3 3 100.00
chip_sw_kmac_app_lc 14 15 93.33
chip_sw_lc_ctrl_transition 1024.220s 26049.111us 14 15 93.33
chip_sw_kmac_app_rom 3 3 100.00
chip_sw_kmac_app_rom 296.840s 3745.113us 3 3 100.00
chip_sw_kmac_entropy 3 3 100.00
chip_sw_kmac_entropy 1913.080s 11692.724us 3 3 100.00
chip_sw_kmac_idle 3 3 100.00
chip_sw_kmac_idle 291.080s 3519.423us 3 3 100.00
chip_sw_lc_ctrl_alert_handler_escalation 3 3 100.00
chip_sw_alert_handler_escalation 526.280s 5323.247us 3 3 100.00
chip_sw_lc_ctrl_jtag_access 15 15 100.00
chip_tap_straps_dev 1264.510s 13448.350us 5 5 100.00
chip_tap_straps_rma 878.620s 9443.216us 5 5 100.00
chip_tap_straps_prod 633.660s 9018.565us 5 5 100.00
chip_sw_lc_ctrl_otp_hw_cfg0 3 3 100.00
chip_sw_lc_ctrl_otp_hw_cfg0 211.940s 2862.584us 3 3 100.00
chip_sw_lc_ctrl_init 14 15 93.33
chip_sw_lc_ctrl_transition 1024.220s 26049.111us 14 15 93.33
chip_sw_lc_ctrl_transitions 14 15 93.33
chip_sw_lc_ctrl_transition 1024.220s 26049.111us 14 15 93.33
chip_sw_lc_ctrl_kmac_req 14 15 93.33
chip_sw_lc_ctrl_transition 1024.220s 26049.111us 14 15 93.33
chip_sw_lc_ctrl_key_div 3 3 100.00
chip_sw_keymgr_key_derivation_prod 1737.560s 10538.233us 3 3 100.00
chip_sw_lc_ctrl_broadcast 74 84 88.10
chip_sw_flash_ctrl_lc_rw_en 258.080s 3146.299us 0 3 0.00
chip_sw_flash_rma_unlocked 5095.930s 42464.441us 3 3 100.00
chip_sw_otp_ctrl_lc_signals_test_unlocked0 332.300s 4044.439us 3 3 100.00
chip_sw_otp_ctrl_lc_signals_dev 777.020s 8464.770us 3 3 100.00
chip_sw_otp_ctrl_lc_signals_prod 745.330s 6995.672us 3 3 100.00
chip_sw_otp_ctrl_lc_signals_rma 646.920s 7913.912us 0 3 0.00
chip_sw_lc_ctrl_transition 1024.220s 26049.111us 14 15 93.33
chip_sw_keymgr_key_derivation 2226.700s 13628.489us 3 3 100.00
chip_sw_rom_ctrl_integrity_check 446.380s 10322.378us 3 3 100.00
chip_sw_sram_ctrl_execution_main 732.350s 9651.618us 3 3 100.00
chip_prim_tl_access 551.950s 14160.866us 3 3 100.00
chip_sw_clkmgr_external_clk_src_for_lc 677.730s 10340.106us 3 3 100.00
chip_sw_clkmgr_external_clk_src_for_sw_fast_test_unlocked0 521.870s 4074.825us 3 3 100.00
chip_sw_clkmgr_external_clk_src_for_sw_slow_test_unlocked0 537.610s 4908.728us 3 3 100.00
chip_sw_clkmgr_external_clk_src_for_sw_fast_dev 562.950s 4778.213us 3 3 100.00
chip_sw_clkmgr_external_clk_src_for_sw_slow_dev 526.960s 4630.699us 3 3 100.00
chip_sw_clkmgr_external_clk_src_for_sw_fast_rma 532.880s 4356.618us 3 3 100.00
chip_sw_clkmgr_external_clk_src_for_sw_slow_rma 531.830s 5195.647us 3 3 100.00
chip_tap_straps_dev 1264.510s 13448.350us 5 5 100.00
chip_tap_straps_rma 878.620s 9443.216us 5 5 100.00
chip_tap_straps_prod 633.660s 9018.565us 5 5 100.00
chip_rv_dm_lc_disabled 186.170s 5334.196us 0 3 0.00
chip_lc_scrap 6 6 100.00
chip_sw_lc_ctrl_rma_to_scrap 259.420s 3559.148us 1 1 100.00
chip_sw_lc_ctrl_raw_to_scrap 97.090s 3145.916us 1 1 100.00
chip_sw_lc_ctrl_test_locked0_to_scrap 142.270s 2649.117us 1 1 100.00
chip_sw_lc_ctrl_rand_to_scrap 199.850s 3285.177us 3 3 100.00
chip_lc_test_locked 2 6 33.33
chip_sw_lc_walkthrough_testunlocks 2558.580s 42691.801us 2 3 66.67
chip_rv_dm_lc_disabled 186.170s 5334.196us 0 3 0.00
chip_sw_lc_walkthrough 5 15 33.33
chip_sw_lc_walkthrough_dev 856.330s 12055.671us 0 3 0.00
chip_sw_lc_walkthrough_prod 873.750s 9217.828us 0 3 0.00
chip_sw_lc_walkthrough_prodend 872.580s 11746.985us 3 3 100.00
chip_sw_lc_walkthrough_rma 578.350s 6271.103us 0 3 0.00
chip_sw_lc_walkthrough_testunlocks 2558.580s 42691.801us 2 3 66.67
chip_sw_lc_ctrl_volatile_raw_unlock 5 9 55.56
chip_sw_lc_ctrl_volatile_raw_unlock 119.110s 2328.094us 2 3 66.67
chip_sw_lc_ctrl_volatile_raw_unlock_ext_clk_48mhz 116.980s 2421.096us 3 3 100.00
rom_volatile_raw_unlock 35.355s 0.000us 0 3 0.00
chip_sw_otbn_op 6 6 100.00
chip_sw_otbn_ecdsa_op_irq 4672.940s 17923.376us 3 3 100.00
chip_sw_otbn_ecdsa_op_irq_jitter_en 5135.770s 20115.284us 3 3 100.00
chip_sw_otbn_rnd_entropy 3 3 100.00
chip_sw_otbn_randomness 846.440s 5746.820us 3 3 100.00
chip_sw_otbn_urnd_entropy 3 3 100.00
chip_sw_otbn_randomness 846.440s 5746.820us 3 3 100.00
chip_sw_otbn_idle 3 3 100.00
chip_sw_otbn_randomness 846.440s 5746.820us 3 3 100.00
chip_sw_otbn_mem_scramble 3 3 100.00
chip_sw_otbn_mem_scramble 423.340s 4203.686us 3 3 100.00
chip_otp_ctrl_init 14 15 93.33
chip_sw_lc_ctrl_transition 1024.220s 26049.111us 14 15 93.33
chip_sw_otp_ctrl_keys 15 15 100.00
chip_sw_flash_init 1413.860s 25146.036us 3 3 100.00
chip_sw_otbn_mem_scramble 423.340s 4203.686us 3 3 100.00
chip_sw_keymgr_key_derivation 2226.700s 13628.489us 3 3 100.00
chip_sw_sram_ctrl_scrambled_access 553.780s 6040.375us 3 3 100.00
chip_sw_rv_core_ibex_icache_invalidate 268.430s 3846.458us 3 3 100.00
chip_sw_otp_ctrl_entropy 15 15 100.00
chip_sw_flash_init 1413.860s 25146.036us 3 3 100.00
chip_sw_otbn_mem_scramble 423.340s 4203.686us 3 3 100.00
chip_sw_keymgr_key_derivation 2226.700s 13628.489us 3 3 100.00
chip_sw_sram_ctrl_scrambled_access 553.780s 6040.375us 3 3 100.00
chip_sw_rv_core_ibex_icache_invalidate 268.430s 3846.458us 3 3 100.00
chip_sw_otp_ctrl_program 14 15 93.33
chip_sw_lc_ctrl_transition 1024.220s 26049.111us 14 15 93.33
chip_sw_otp_ctrl_program_error 3 3 100.00
chip_sw_lc_ctrl_program_error 442.320s 5232.393us 3 3 100.00
chip_sw_otp_ctrl_hw_cfg0 3 3 100.00
chip_sw_lc_ctrl_otp_hw_cfg0 211.940s 2862.584us 3 3 100.00
chip_sw_otp_ctrl_lc_signals 26 30 86.67
chip_sw_otp_ctrl_lc_signals_test_unlocked0 332.300s 4044.439us 3 3 100.00
chip_sw_otp_ctrl_lc_signals_dev 777.020s 8464.770us 3 3 100.00
chip_sw_otp_ctrl_lc_signals_prod 745.330s 6995.672us 3 3 100.00
chip_sw_otp_ctrl_lc_signals_rma 646.920s 7913.912us 0 3 0.00
chip_sw_lc_ctrl_transition 1024.220s 26049.111us 14 15 93.33
chip_prim_tl_access 551.950s 14160.866us 3 3 100.00
chip_sw_otp_prim_tl_access 3 3 100.00
chip_prim_tl_access 551.950s 14160.866us 3 3 100.00
chip_sw_otp_ctrl_dai_lock 1 1 100.00
chip_sw_otp_ctrl_dai_lock 1115.920s 7331.879us 1 1 100.00
chip_sw_pwrmgr_external_full_reset 0 3 0.00
chip_sw_pwrmgr_full_aon_reset 327.500s 6711.643us 0 3 0.00
chip_sw_pwrmgr_random_sleep_all_wake_ups 3 3 100.00
chip_sw_pwrmgr_random_sleep_all_wake_ups 1464.850s 25943.816us 3 3 100.00
chip_sw_pwrmgr_normal_sleep_all_wake_ups 3 3 100.00
chip_sw_pwrmgr_normal_sleep_all_wake_ups 313.850s 6925.307us 3 3 100.00
chip_sw_pwrmgr_deep_sleep_por_reset 1 3 33.33
chip_sw_pwrmgr_deep_sleep_por_reset 518.820s 8086.535us 1 3 33.33
chip_sw_pwrmgr_normal_sleep_por_reset 3 3 100.00
chip_sw_pwrmgr_normal_sleep_por_reset 612.570s 6585.468us 3 3 100.00
chip_sw_pwrmgr_deep_sleep_all_wake_ups 3 3 100.00
chip_sw_pwrmgr_deep_sleep_all_wake_ups 1436.960s 25494.501us 3 3 100.00
chip_sw_pwrmgr_deep_sleep_all_reset_reqs 2 6 33.33
chip_sw_pwrmgr_deep_sleep_all_reset_reqs 1320.720s 14170.976us 1 3 33.33
chip_sw_aon_timer_wdog_bite_reset 836.960s 8668.132us 1 3 33.33
chip_sw_pwrmgr_normal_sleep_all_reset_reqs 3 3 100.00
chip_sw_pwrmgr_normal_sleep_all_reset_reqs 1082.420s 11423.602us 3 3 100.00
chip_sw_pwrmgr_wdog_reset 3 3 100.00
chip_sw_pwrmgr_wdog_reset 504.230s 6153.524us 3 3 100.00
chip_sw_pwrmgr_aon_power_glitch_reset 0 3 0.00
chip_sw_pwrmgr_full_aon_reset 327.500s 6711.643us 0 3 0.00
chip_sw_pwrmgr_main_power_glitch_reset 3 3 100.00
chip_sw_pwrmgr_main_power_glitch_reset 478.750s 5322.263us 3 3 100.00
chip_sw_pwrmgr_random_sleep_power_glitch_reset 0 3 0.00
chip_sw_pwrmgr_random_sleep_power_glitch_reset 1298.100s 19357.733us 0 3 0.00
chip_sw_pwrmgr_deep_sleep_power_glitch_reset 3 3 100.00
chip_sw_pwrmgr_deep_sleep_power_glitch_reset 535.950s 7867.764us 3 3 100.00
chip_sw_pwrmgr_sleep_power_glitch_reset 0 3 0.00
chip_sw_pwrmgr_sleep_power_glitch_reset 227.580s 3705.431us 0 3 0.00
chip_sw_pwrmgr_random_sleep_all_reset_reqs 1 3 33.33
chip_sw_pwrmgr_random_sleep_all_reset_reqs 2307.140s 22280.097us 1 3 33.33
chip_sw_pwrmgr_sysrst_ctrl_reset 6 6 100.00
chip_sw_pwrmgr_sysrst_ctrl_reset 1082.290s 9956.757us 3 3 100.00
chip_sw_pwrmgr_all_reset_reqs 1448.480s 10479.990us 3 3 100.00
chip_sw_pwrmgr_b2b_sleep_reset_req 3 3 100.00
chip_sw_pwrmgr_b2b_sleep_reset_req 2411.920s 27615.702us 3 3 100.00
chip_sw_pwrmgr_sleep_disabled 3 3 100.00
chip_sw_pwrmgr_sleep_disabled 256.480s 3001.759us 3 3 100.00
chip_sw_pwrmgr_escalation_reset 96 100 96.00
chip_sw_all_escalation_resets 649.420s 5939.764us 96 100 96.00
chip_sw_rom_access 3 3 100.00
chip_sw_rom_ctrl_integrity_check 446.380s 10322.378us 3 3 100.00
chip_sw_rom_ctrl_integrity_check 3 3 100.00
chip_sw_rom_ctrl_integrity_check 446.380s 10322.378us 3 3 100.00
chip_sw_rstmgr_non_sys_reset_info 10 12 83.33
chip_sw_pwrmgr_all_reset_reqs 1448.480s 10479.990us 3 3 100.00
chip_sw_pwrmgr_random_sleep_all_reset_reqs 2307.140s 22280.097us 1 3 33.33
chip_sw_pwrmgr_wdog_reset 504.230s 6153.524us 3 3 100.00
chip_sw_pwrmgr_smoketest 428.310s 5937.770us 3 3 100.00
chip_sw_rstmgr_sys_reset_info 3 3 100.00
chip_rv_dm_ndm_reset_req 413.930s 5159.119us 3 3 100.00
chip_sw_rstmgr_cpu_info 3 3 100.00
chip_sw_rstmgr_cpu_info 619.900s 6823.665us 3 3 100.00
chip_sw_rstmgr_sw_req_reset 3 3 100.00
chip_sw_rstmgr_sw_req 410.310s 4981.368us 3 3 100.00
chip_sw_rstmgr_alert_info 3 3 100.00
chip_sw_rstmgr_alert_info 1465.630s 13321.707us 3 3 100.00
chip_sw_rstmgr_sw_rst 3 3 100.00
chip_sw_rstmgr_sw_rst 240.330s 3543.013us 3 3 100.00
chip_sw_rstmgr_escalation_reset 96 100 96.00
chip_sw_all_escalation_resets 649.420s 5939.764us 96 100 96.00
chip_sw_rstmgr_alert_handler_reset_enables 3 3 100.00
chip_sw_alert_handler_lpg_reset_toggle 1655.590s 8765.349us 3 3 100.00
chip_sw_nmi_irq 3 3 100.00
chip_sw_rv_core_ibex_nmi_irq 668.230s 5100.989us 3 3 100.00
chip_sw_rv_core_ibex_rnd 3 3 100.00
chip_sw_rv_core_ibex_rnd 639.820s 4369.771us 3 3 100.00
chip_sw_rv_core_ibex_address_translation 3 3 100.00
chip_sw_rv_core_ibex_address_translation 288.010s 3560.145us 3 3 100.00
chip_sw_rv_core_ibex_icache_scrambled_access 3 3 100.00
chip_sw_rv_core_ibex_icache_invalidate 268.430s 3846.458us 3 3 100.00
chip_sw_rv_core_ibex_fault_dump 3 3 100.00
chip_sw_rstmgr_cpu_info 619.900s 6823.665us 3 3 100.00
chip_sw_rv_core_ibex_double_fault 3 3 100.00
chip_sw_rstmgr_cpu_info 619.900s 6823.665us 3 3 100.00
chip_jtag_csr_rw 3 3 100.00
chip_jtag_csr_rw 1922.090s 17543.131us 3 3 100.00
chip_jtag_mem_access 3 3 100.00
chip_jtag_mem_access 1165.020s 13362.295us 3 3 100.00
chip_rv_dm_ndm_reset_req 3 3 100.00
chip_rv_dm_ndm_reset_req 413.930s 5159.119us 3 3 100.00
chip_sw_rv_dm_ndm_reset_req_when_cpu_halted 0 3 0.00
chip_sw_rv_dm_ndm_reset_req_when_cpu_halted 269.220s 3327.265us 0 3 0.00
chip_rv_dm_access_after_wakeup 3 3 100.00
chip_sw_rv_dm_access_after_wakeup 451.520s 6248.915us 3 3 100.00
chip_sw_rv_dm_jtag_tap_sel 5 5 100.00
chip_tap_straps_rma 878.620s 9443.216us 5 5 100.00
chip_rv_dm_lc_disabled 0 3 0.00
chip_rv_dm_lc_disabled 186.170s 5334.196us 0 3 0.00
chip_sw_plic_all_irqs 9 9 100.00
chip_plic_all_irqs_0 707.100s 5328.168us 3 3 100.00
chip_plic_all_irqs_10 413.410s 3943.026us 3 3 100.00
chip_plic_all_irqs_20 548.760s 5038.543us 3 3 100.00
chip_sw_plic_sw_irq 3 3 100.00
chip_sw_plic_sw_irq 210.010s 2617.350us 3 3 100.00
chip_sw_timer 3 3 100.00
chip_sw_rv_timer_irq 242.490s 3205.507us 3 3 100.00
chip_sw_spi_device_flash_mode 3 3 100.00
rom_e2e_smoke 3907.590s 19665.007us 3 3 100.00
chip_sw_spi_device_pass_through 3 3 100.00
chip_sw_spi_device_pass_through 351.840s 4342.031us 3 3 100.00
chip_sw_spi_device_pass_through_collision 0 3 0.00
chip_sw_spi_device_pass_through_collision 269.970s 3418.762us 0 3 0.00
chip_sw_spi_device_tpm 3 3 100.00
chip_sw_spi_device_tpm 327.580s 3900.159us 3 3 100.00
chip_sw_spi_host_tx_rx 3 3 100.00
chip_sw_spi_host_tx_rx 271.520s 3728.568us 3 3 100.00
chip_sw_sram_scrambled_access 6 6 100.00
chip_sw_sram_ctrl_scrambled_access 553.780s 6040.375us 3 3 100.00
chip_sw_sram_ctrl_scrambled_access_jitter_en 520.970s 5381.626us 3 3 100.00
chip_sw_sleep_sram_ret_contents 6 6 100.00
chip_sw_sleep_sram_ret_contents_no_scramble 585.290s 7528.333us 3 3 100.00
chip_sw_sleep_sram_ret_contents_scramble 697.970s 8177.025us 3 3 100.00
chip_sw_sram_execution 3 3 100.00
chip_sw_sram_ctrl_execution_main 732.350s 9651.618us 3 3 100.00
chip_sw_sram_lc_escalation 102 106 96.23
chip_sw_all_escalation_resets 649.420s 5939.764us 96 100 96.00
chip_sw_data_integrity_escalation 682.830s 6509.969us 6 6 100.00
chip_sw_sysrst_ctrl_reset 6 6 100.00
chip_sw_pwrmgr_sysrst_ctrl_reset 1082.290s 9956.757us 3 3 100.00
chip_sw_sysrst_ctrl_reset 1598.980s 24129.039us 3 3 100.00
chip_sw_sysrst_ctrl_inputs 3 3 100.00
chip_sw_sysrst_ctrl_inputs 235.800s 3629.458us 3 3 100.00
chip_sw_sysrst_ctrl_outputs 3 3 100.00
chip_sw_sysrst_ctrl_outputs 309.200s 4214.034us 3 3 100.00
chip_sw_sysrst_ctrl_in_irq 3 3 100.00
chip_sw_sysrst_ctrl_in_irq 533.990s 5426.220us 3 3 100.00
chip_sw_sysrst_ctrl_sleep_wakeup 3 3 100.00
chip_sw_sysrst_ctrl_reset 1598.980s 24129.039us 3 3 100.00
chip_sw_sysrst_ctrl_sleep_reset 3 3 100.00
chip_sw_sysrst_ctrl_reset 1598.980s 24129.039us 3 3 100.00
chip_sw_sysrst_ctrl_ec_rst_l 3 3 100.00
chip_sw_sysrst_ctrl_ec_rst_l 3155.240s 20397.713us 3 3 100.00
chip_sw_sysrst_ctrl_flash_wp_l 3 3 100.00
chip_sw_sysrst_ctrl_ec_rst_l 3155.240s 20397.713us 3 3 100.00
chip_sw_sysrst_ctrl_ulp_z3_wakeup 3 6 50.00
chip_sw_sysrst_ctrl_ulp_z3_wakeup 451.370s 6169.177us 3 3 100.00
chip_sw_adc_ctrl_sleep_debug_cable_wakeup 3600.174s 0.000us 0 3 0.00
chip_sw_usbdev_vbus 1 1 100.00
chip_sw_usbdev_vbus 237.040s 3075.393us 1 1 100.00
chip_sw_usbdev_pullup 1 1 100.00
chip_sw_usbdev_pullup 199.340s 2860.876us 1 1 100.00
chip_sw_usbdev_aon_pullup 1 1 100.00
chip_sw_usbdev_aon_pullup 379.500s 3931.719us 1 1 100.00
chip_sw_usbdev_setup_rx 1 1 100.00
chip_sw_usbdev_setuprx 438.390s 4259.114us 1 1 100.00
chip_sw_usbdev_config_host 1 1 100.00
chip_sw_usbdev_config_host 1351.020s 7859.935us 1 1 100.00
chip_sw_usbdev_pincfg 1 1 100.00
chip_sw_usbdev_pincfg 6998.030s 31890.559us 1 1 100.00
chip_sw_usbdev_tx_rx 1 1 100.00
chip_sw_usbdev_dpi 2416.160s 12163.646us 1 1 100.00
chip_sw_usbdev_toggle_restore 1 1 100.00
chip_sw_usbdev_toggle_restore 197.040s 3607.141us 1 1 100.00
Testpoint Test Max Runtime Sim Time Pass Total %
chip_sw_aes_masking_off 3 3 100.00
chip_sw_aes_masking_off 276.350s 2974.919us 3 3 100.00
chip_sw_rv_core_ibex_lockstep_glitch 3 3 100.00
chip_sw_rv_core_ibex_lockstep_glitch 187.100s 2744.820us 3 3 100.00
Testpoint Test Max Runtime Sim Time Pass Total %
chip_sw_coremark 1 1 100.00
chip_sw_coremark 16954.670s 71904.386us 1 1 100.00
chip_sw_power_max_load 3 3 100.00
chip_sw_power_virus 1397.560s 6628.091us 3 3 100.00
rom_e2e_debug 0 3 0.00
rom_e2e_jtag_debug_test_unlocked0 333.210s 4211.020us 0 1 0.00
rom_e2e_jtag_debug_dev 231.400s 3668.059us 0 1 0.00
rom_e2e_jtag_debug_rma 695.530s 7891.060us 0 1 0.00
rom_e2e_jtag_inject 1 3 33.33
rom_e2e_jtag_inject_test_unlocked0 74.030s 2315.324us 0 1 0.00
rom_e2e_jtag_inject_dev 360.140s 5380.934us 1 1 100.00
rom_e2e_jtag_inject_rma 75.960s 1801.817us 0 1 0.00
rom_e2e_self_hash 0 3 0.00
rom_e2e_self_hash 22.905s 0.000us 0 3 0.00
chip_sw_clkmgr_jitter_cycle_measurements 0 3 0.00
chip_sw_clkmgr_jitter_frequency 436.030s 4409.954us 0 3 0.00
chip_sw_edn_boot_mode 3 3 100.00
chip_sw_edn_boot_mode 424.590s 2925.762us 3 3 100.00
chip_sw_edn_auto_mode 3 3 100.00
chip_sw_edn_auto_mode 1274.580s 6908.590us 3 3 100.00
chip_sw_edn_sw_mode 3 3 100.00
chip_sw_edn_sw_mode 1968.680s 11244.493us 3 3 100.00
chip_sw_edn_kat 3 3 100.00
chip_sw_edn_kat 343.230s 2813.574us 3 3 100.00
chip_sw_flash_memory_protection 3 3 100.00
chip_sw_flash_ctrl_mem_protection 824.230s 6076.530us 3 3 100.00
chip_sw_otp_ctrl_vendor_test_csr_access 3 3 100.00
chip_sw_otp_ctrl_vendor_test_csr_access 270.180s 3222.426us 3 3 100.00
chip_sw_otp_ctrl_escalation 0 1 0.00
chip_sw_otp_ctrl_escalation 212.390s 3205.463us 0 1 0.00
chip_sw_sensor_ctrl_deep_sleep_wake_up 3 3 100.00
chip_sw_pwrmgr_sensor_ctrl_deep_sleep_wake_up 460.540s 7176.276us 3 3 100.00
chip_sw_pwrmgr_usb_clk_disabled_when_active 3 3 100.00
chip_sw_pwrmgr_usb_clk_disabled_when_active 426.680s 5616.614us 3 3 100.00
chip_sw_all_resets 3 3 100.00
chip_sw_pwrmgr_all_reset_reqs 1448.480s 10479.990us 3 3 100.00
chip_rv_dm_perform_debug 0 3 0.00
rom_e2e_jtag_debug_test_unlocked0 333.210s 4211.020us 0 1 0.00
rom_e2e_jtag_debug_dev 231.400s 3668.059us 0 1 0.00
rom_e2e_jtag_debug_rma 695.530s 7891.060us 0 1 0.00
chip_sw_rv_dm_access_after_hw_reset 3 3 100.00
chip_sw_rv_dm_access_after_escalation_reset 475.340s 5705.662us 3 3 100.00
chip_sw_plic_alerts 96 100 96.00
chip_sw_all_escalation_resets 649.420s 5939.764us 96 100 96.00
tick_configuration 0 3 0.00
chip_sw_rv_timer_systick_test 7200.176s 0.000us 0 3 0.00
counter_wrap 0 3 0.00
chip_sw_rv_timer_systick_test 7200.176s 0.000us 0 3 0.00
chip_sw_spi_device_output_when_disabled_or_sleeping 3 3 100.00
chip_sw_spi_device_pinmux_sleep_retention 233.380s 3718.333us 3 3 100.00
chip_sw_uart_watermarks 5 5 100.00
chip_sw_uart_tx_rx 572.190s 4717.999us 5 5 100.00
chip_sw_usbdev_stream 1 1 100.00
chip_sw_usbdev_stream 3945.090s 18795.980us 1 1 100.00
Testpoint Test Max Runtime Sim Time Pass Total %
Unmapped 18 31 58.06
chip_sival_flash_info_access 289.300s 3455.207us 3 3 100.00
chip_sw_rstmgr_rst_cnsty_escalation 31.430s 10.300us 0 3 0.00
chip_sw_otp_ctrl_rot_auth_config 7.080s 0.000us 0 1 0.00
chip_sw_otp_ctrl_ecc_error_vendor_test 203.790s 2771.916us 3 3 100.00
chip_sw_otp_ctrl_descrambling 262.990s 3038.537us 3 3 100.00
chip_sw_pwrmgr_lowpower_cancel 321.780s 4313.123us 3 3 100.00
chip_sw_pwrmgr_sleep_wake_5_bug 14.661s 0.000us 0 3 0.00
chip_sw_flash_ctrl_write_clear 277.390s 2541.884us 3 3 100.00
ate_bootstrap_flash_erase 916.540s 10010.260us 0 3 0.00
ate_bootstrap_one_frame 9762.010s 44915.661us 3 3 100.00
ate_bootstrap_disjoint 10800.170s 0.000us 0 3 0.00

Error Messages

   Test seed line log context
UVM_ERROR @ * us: (sw_logger_if.sv:526) [alert_handler_lpg_sleep_mode_alerts_test_sim_dv(sw/device/lib/testing/ret_sram_testutils.c:67)] CHECK-fail: testing_utilities != ((void*)0) 90 test runs
chip_sw_alert_handler_lpg_sleep_mode_alerts 14497381402158649746130211766554853507942567344958684713829325287164872271978 308
UVM_INFO @ 2986.075278 us: (uvm_report_catcher.svh:705) [UVM/REPORT/CATCHER]
--- UVM Report catcher Summary ---
chip_sw_alert_handler_lpg_sleep_mode_alerts 43367564199096071183483526395004893313662729655648710738565005876271157175463 308
UVM_INFO @ 2341.607006 us: (uvm_report_catcher.svh:705) [UVM/REPORT/CATCHER]
--- UVM Report catcher Summary ---
chip_sw_alert_handler_lpg_sleep_mode_alerts 34261370302586911183241624181360207498884404941594379850664115389757696535485 308
UVM_INFO @ 2826.433253 us: (uvm_report_catcher.svh:705) [UVM/REPORT/CATCHER]
--- UVM Report catcher Summary ---
chip_sw_alert_handler_lpg_sleep_mode_alerts 49420167241704902837903821082384071026492428519479065699020841103708581580471 308
UVM_INFO @ 2480.037480 us: (uvm_report_catcher.svh:705) [UVM/REPORT/CATCHER]
--- UVM Report catcher Summary ---
chip_sw_alert_handler_lpg_sleep_mode_alerts 9363209175555781560312325099377875150924514422631921661005592727704595567879 308
UVM_INFO @ 3500.583101 us: (uvm_report_catcher.svh:705) [UVM/REPORT/CATCHER]
--- UVM Report catcher Summary ---
chip_sw_alert_handler_lpg_sleep_mode_alerts 26493087631505731428057634427520213008289784132224665153671040645160749983833 308
UVM_INFO @ 2343.638216 us: (uvm_report_catcher.svh:705) [UVM/REPORT/CATCHER]
--- UVM Report catcher Summary ---
chip_sw_alert_handler_lpg_sleep_mode_alerts 2532182135989321724711429723015390801162737516782699310298982958083366378158 308
UVM_INFO @ 2798.845929 us: (uvm_report_catcher.svh:705) [UVM/REPORT/CATCHER]
--- UVM Report catcher Summary ---
chip_sw_alert_handler_lpg_sleep_mode_alerts 19896118666918698366112503545640784129638325650426024259844709501953192193595 308
UVM_INFO @ 3209.395786 us: (uvm_report_catcher.svh:705) [UVM/REPORT/CATCHER]
--- UVM Report catcher Summary ---
chip_sw_alert_handler_lpg_sleep_mode_alerts 107941308030816108604141719223637321841239449829284623486242485372261710977097 308
UVM_INFO @ 2569.304352 us: (uvm_report_catcher.svh:705) [UVM/REPORT/CATCHER]
--- UVM Report catcher Summary ---
chip_sw_alert_handler_lpg_sleep_mode_alerts 82072471625558869869876803587525569687720026359127260790061351628973972304941 308
UVM_INFO @ 3775.070520 us: (uvm_report_catcher.svh:705) [UVM/REPORT/CATCHER]
--- UVM Report catcher Summary ---
chip_sw_alert_handler_lpg_sleep_mode_alerts 80474652998993479115094626801218579413271657707985481376952220214335279967861 308
UVM_INFO @ 2955.422975 us: (uvm_report_catcher.svh:705) [UVM/REPORT/CATCHER]
--- UVM Report catcher Summary ---
chip_sw_alert_handler_lpg_sleep_mode_alerts 86708835735230859553919328954332404951838498138082330052134843673632132225490 308
UVM_INFO @ 2917.204782 us: (uvm_report_catcher.svh:705) [UVM/REPORT/CATCHER]
--- UVM Report catcher Summary ---
chip_sw_alert_handler_lpg_sleep_mode_alerts 61199574758767777891817649322931094443712684765005408981816764378165823077475 308
UVM_INFO @ 2533.319694 us: (uvm_report_catcher.svh:705) [UVM/REPORT/CATCHER]
--- UVM Report catcher Summary ---
chip_sw_alert_handler_lpg_sleep_mode_alerts 7612420284936029613805126068028270513709311082477518431582377751748754020016 308
UVM_INFO @ 2543.810682 us: (uvm_report_catcher.svh:705) [UVM/REPORT/CATCHER]
--- UVM Report catcher Summary ---
chip_sw_alert_handler_lpg_sleep_mode_alerts 69024108178174096406947865176816680975153541390423810666877490882570094916012 308
UVM_INFO @ 2981.163858 us: (uvm_report_catcher.svh:705) [UVM/REPORT/CATCHER]
--- UVM Report catcher Summary ---
chip_sw_alert_handler_lpg_sleep_mode_alerts 60905862914462873167938701413151922175223299187203248972189810467800080410969 308
UVM_INFO @ 2293.934974 us: (uvm_report_catcher.svh:705) [UVM/REPORT/CATCHER]
--- UVM Report catcher Summary ---
chip_sw_alert_handler_lpg_sleep_mode_alerts 105952603717266039600331696677515663725784422590427335841612436457257732988875 308
UVM_INFO @ 2409.313600 us: (uvm_report_catcher.svh:705) [UVM/REPORT/CATCHER]
--- UVM Report catcher Summary ---
chip_sw_alert_handler_lpg_sleep_mode_alerts 74615542149089571444211586666549921575801864643036478502077834568897261394071 308
UVM_INFO @ 3204.606102 us: (uvm_report_catcher.svh:705) [UVM/REPORT/CATCHER]
--- UVM Report catcher Summary ---
chip_sw_alert_handler_lpg_sleep_mode_alerts 102116645589327025878129980531297068847318617972026763663285927794744793443946 308
UVM_INFO @ 2900.595616 us: (uvm_report_catcher.svh:705) [UVM/REPORT/CATCHER]
--- UVM Report catcher Summary ---
chip_sw_alert_handler_lpg_sleep_mode_alerts 10574305020098041490012955855837020525531744114487733529564185471009355601506 308
UVM_INFO @ 2370.000448 us: (uvm_report_catcher.svh:705) [UVM/REPORT/CATCHER]
--- UVM Report catcher Summary ---
chip_sw_alert_handler_lpg_sleep_mode_alerts 60199163971774266389984486491498489957272776171129339585737678529921897152734 308
UVM_INFO @ 3191.357246 us: (uvm_report_catcher.svh:705) [UVM/REPORT/CATCHER]
--- UVM Report catcher Summary ---
chip_sw_alert_handler_lpg_sleep_mode_alerts 55011369674967906548059114974010385663851123516975310325267211706459431943795 308
UVM_INFO @ 3276.502712 us: (uvm_report_catcher.svh:705) [UVM/REPORT/CATCHER]
--- UVM Report catcher Summary ---
chip_sw_alert_handler_lpg_sleep_mode_alerts 3492654261215906807768533500078954870553528232177730009975999446844963543078 308
UVM_INFO @ 2345.397464 us: (uvm_report_catcher.svh:705) [UVM/REPORT/CATCHER]
--- UVM Report catcher Summary ---
chip_sw_alert_handler_lpg_sleep_mode_alerts 23185373411269614204772485708588364762989735749481877394259542134504941678360 308
UVM_INFO @ 3137.634575 us: (uvm_report_catcher.svh:705) [UVM/REPORT/CATCHER]
--- UVM Report catcher Summary ---
chip_sw_alert_handler_lpg_sleep_mode_alerts 44466238220044035689047396104051232449807188501150375835227591581139170528661 308
UVM_INFO @ 3195.757213 us: (uvm_report_catcher.svh:705) [UVM/REPORT/CATCHER]
--- UVM Report catcher Summary ---
chip_sw_alert_handler_lpg_sleep_mode_alerts 78987961135690040573205146628927494415468629924879768838341702055300699899541 308
UVM_INFO @ 3300.048184 us: (uvm_report_catcher.svh:705) [UVM/REPORT/CATCHER]
--- UVM Report catcher Summary ---
chip_sw_alert_handler_lpg_sleep_mode_alerts 93446114873793963325866924559324481843328947880101439811804560668359791766177 308
UVM_INFO @ 2905.090900 us: (uvm_report_catcher.svh:705) [UVM/REPORT/CATCHER]
--- UVM Report catcher Summary ---
chip_sw_alert_handler_lpg_sleep_mode_alerts 91438311761053410079954172530598716031656236608675040739089718627450471487582 308
UVM_INFO @ 3217.126592 us: (uvm_report_catcher.svh:705) [UVM/REPORT/CATCHER]
--- UVM Report catcher Summary ---
chip_sw_alert_handler_lpg_sleep_mode_alerts 30282876670375806343921504839837869872787813673506775966779256025972883637536 308
UVM_INFO @ 2575.493353 us: (uvm_report_catcher.svh:705) [UVM/REPORT/CATCHER]
--- UVM Report catcher Summary ---
chip_sw_alert_handler_lpg_sleep_mode_alerts 21065668626875125721184900402076772207972346257241472691425127709725824176390 308
UVM_INFO @ 2932.039260 us: (uvm_report_catcher.svh:705) [UVM/REPORT/CATCHER]
--- UVM Report catcher Summary ---
chip_sw_alert_handler_lpg_sleep_mode_alerts 6249353509741337704146942966655479743265396566903268801201896158186068919951 308
UVM_INFO @ 2450.495499 us: (uvm_report_catcher.svh:705) [UVM/REPORT/CATCHER]
--- UVM Report catcher Summary ---
chip_sw_alert_handler_lpg_sleep_mode_alerts 11563233321676165745772176606247555736454999059511930276388227098955408900504 308
UVM_INFO @ 2961.834632 us: (uvm_report_catcher.svh:705) [UVM/REPORT/CATCHER]
--- UVM Report catcher Summary ---
chip_sw_alert_handler_lpg_sleep_mode_alerts 234890921449082281837664827129439471145732834181811283070527564383915589848 308
UVM_INFO @ 2512.363883 us: (uvm_report_catcher.svh:705) [UVM/REPORT/CATCHER]
--- UVM Report catcher Summary ---
chip_sw_alert_handler_lpg_sleep_mode_alerts 109514939451987394914002704585962437581643335098281449900752675339901365775371 308
UVM_INFO @ 2629.362156 us: (uvm_report_catcher.svh:705) [UVM/REPORT/CATCHER]
--- UVM Report catcher Summary ---
chip_sw_alert_handler_lpg_sleep_mode_alerts 48679464942803829006535406058212377148555759465890416860666041593338118337527 308
UVM_INFO @ 3684.859284 us: (uvm_report_catcher.svh:705) [UVM/REPORT/CATCHER]
--- UVM Report catcher Summary ---
chip_sw_alert_handler_lpg_sleep_mode_alerts 60147798670596810566217677859694874510627306428048046755787457015713644479654 308
UVM_INFO @ 3226.684560 us: (uvm_report_catcher.svh:705) [UVM/REPORT/CATCHER]
--- UVM Report catcher Summary ---
chip_sw_alert_handler_lpg_sleep_mode_alerts 20497783313588381356862472824420608568242481186558059828681930951495784717551 308
UVM_INFO @ 2705.025740 us: (uvm_report_catcher.svh:705) [UVM/REPORT/CATCHER]
--- UVM Report catcher Summary ---
chip_sw_alert_handler_lpg_sleep_mode_alerts 98252314439051245587365550142067469108535719409646608605031623205992308809228 308
UVM_INFO @ 3330.293285 us: (uvm_report_catcher.svh:705) [UVM/REPORT/CATCHER]
--- UVM Report catcher Summary ---
chip_sw_alert_handler_lpg_sleep_mode_alerts 12011844250296487443020283725162955209887817457717571508615367712915005895619 308
UVM_INFO @ 2568.553887 us: (uvm_report_catcher.svh:705) [UVM/REPORT/CATCHER]
--- UVM Report catcher Summary ---
chip_sw_alert_handler_lpg_sleep_mode_alerts 80583033111219751300347251739089116033868997714225352269065353848777429813329 308
UVM_INFO @ 2447.773583 us: (uvm_report_catcher.svh:705) [UVM/REPORT/CATCHER]
--- UVM Report catcher Summary ---
chip_sw_alert_handler_lpg_sleep_mode_alerts 81002090573797815837098276797750057734679115269406859891907188183951113599351 308
UVM_INFO @ 3093.318276 us: (uvm_report_catcher.svh:705) [UVM/REPORT/CATCHER]
--- UVM Report catcher Summary ---
chip_sw_alert_handler_lpg_sleep_mode_alerts 59308788902457765860667479059404883079100827906015279188699206749721714104197 308
UVM_INFO @ 2445.874980 us: (uvm_report_catcher.svh:705) [UVM/REPORT/CATCHER]
--- UVM Report catcher Summary ---
chip_sw_alert_handler_lpg_sleep_mode_alerts 71223768544495185171762451760167229114973489956286197483110468681097222270956 308
UVM_INFO @ 2970.549179 us: (uvm_report_catcher.svh:705) [UVM/REPORT/CATCHER]
--- UVM Report catcher Summary ---
chip_sw_alert_handler_lpg_sleep_mode_alerts 84994844351061999318049713850308638227290736902113526889416949092175308939408 308
UVM_INFO @ 2410.423472 us: (uvm_report_catcher.svh:705) [UVM/REPORT/CATCHER]
--- UVM Report catcher Summary ---
chip_sw_alert_handler_lpg_sleep_mode_alerts 15322433396407852521987911213727387435178070091218419376280410910106551754627 308
UVM_INFO @ 2507.288110 us: (uvm_report_catcher.svh:705) [UVM/REPORT/CATCHER]
--- UVM Report catcher Summary ---
chip_sw_alert_handler_lpg_sleep_mode_alerts 19722013168788380024190860248417279267837160666680509569087967073515772236349 308
UVM_INFO @ 3025.853686 us: (uvm_report_catcher.svh:705) [UVM/REPORT/CATCHER]
--- UVM Report catcher Summary ---
chip_sw_alert_handler_lpg_sleep_mode_alerts 92293311809490200440446124307817446187593070198222927040756759063994022446246 308
UVM_INFO @ 2745.094404 us: (uvm_report_catcher.svh:705) [UVM/REPORT/CATCHER]
--- UVM Report catcher Summary ---
chip_sw_alert_handler_lpg_sleep_mode_alerts 105029554516709265230377852252287073361877643845784234151258564873630768734142 308
UVM_INFO @ 2238.593180 us: (uvm_report_catcher.svh:705) [UVM/REPORT/CATCHER]
--- UVM Report catcher Summary ---
chip_sw_alert_handler_lpg_sleep_mode_alerts 107686173680089739402000936823423506663871644448545941330369277780009159411632 308
UVM_INFO @ 3139.380924 us: (uvm_report_catcher.svh:705) [UVM/REPORT/CATCHER]
--- UVM Report catcher Summary ---
chip_sw_alert_handler_lpg_sleep_mode_alerts 8903949528359857239211835476768884744786505051422602229638151264524355007967 308
UVM_INFO @ 2672.964350 us: (uvm_report_catcher.svh:705) [UVM/REPORT/CATCHER]
--- UVM Report catcher Summary ---
chip_sw_alert_handler_lpg_sleep_mode_alerts 69657421083840220337303727661271700261817506364501359455697293734505973236565 308
UVM_INFO @ 3672.962755 us: (uvm_report_catcher.svh:705) [UVM/REPORT/CATCHER]
--- UVM Report catcher Summary ---
chip_sw_alert_handler_lpg_sleep_mode_alerts 10715007363888111182156398030932470635729150217120021766418621822986824848730 308
UVM_INFO @ 3222.107220 us: (uvm_report_catcher.svh:705) [UVM/REPORT/CATCHER]
--- UVM Report catcher Summary ---
chip_sw_alert_handler_lpg_sleep_mode_alerts 28670149921727795911506798229114129910285077239600158357707054831045394419726 308
UVM_INFO @ 2813.272024 us: (uvm_report_catcher.svh:705) [UVM/REPORT/CATCHER]
--- UVM Report catcher Summary ---
chip_sw_alert_handler_lpg_sleep_mode_alerts 17264902248478396594346026568812866318485035329247006796819878055871392335665 308
UVM_INFO @ 2571.063044 us: (uvm_report_catcher.svh:705) [UVM/REPORT/CATCHER]
--- UVM Report catcher Summary ---
chip_sw_alert_handler_lpg_sleep_mode_alerts 113623483040848571995873787101535404387473739239432453447520644011627207446409 308
UVM_INFO @ 3179.382725 us: (uvm_report_catcher.svh:705) [UVM/REPORT/CATCHER]
--- UVM Report catcher Summary ---
chip_sw_alert_handler_lpg_sleep_mode_alerts 49351987187514603218611635299016072730575590925513452152428883925252110833264 308
UVM_INFO @ 3472.799881 us: (uvm_report_catcher.svh:705) [UVM/REPORT/CATCHER]
--- UVM Report catcher Summary ---
chip_sw_alert_handler_lpg_sleep_mode_alerts 105133856461845036003562312935734780110606245999497193463229881966836514040982 308
UVM_INFO @ 3416.323119 us: (uvm_report_catcher.svh:705) [UVM/REPORT/CATCHER]
--- UVM Report catcher Summary ---
chip_sw_alert_handler_lpg_sleep_mode_alerts 17924959053270231251170991992614059742417194156057823090361096837964233598268 308
UVM_INFO @ 3255.441721 us: (uvm_report_catcher.svh:705) [UVM/REPORT/CATCHER]
--- UVM Report catcher Summary ---
chip_sw_alert_handler_lpg_sleep_mode_alerts 18202330164587476021921545276479899455449427430071205239756350752088442638720 308
UVM_INFO @ 2663.093416 us: (uvm_report_catcher.svh:705) [UVM/REPORT/CATCHER]
--- UVM Report catcher Summary ---
chip_sw_alert_handler_lpg_sleep_mode_alerts 53794141023896831844327006782695513141277270471179332713736858463356734619686 308
UVM_INFO @ 3270.492450 us: (uvm_report_catcher.svh:705) [UVM/REPORT/CATCHER]
--- UVM Report catcher Summary ---
chip_sw_alert_handler_lpg_sleep_mode_alerts 66471837059707236659733279542053696268493592791204406710439666068312501059182 308
UVM_INFO @ 3057.705590 us: (uvm_report_catcher.svh:705) [UVM/REPORT/CATCHER]
--- UVM Report catcher Summary ---
chip_sw_alert_handler_lpg_sleep_mode_alerts 57688969813273831134901146351197357153006140319466345817158644206226671075510 308
UVM_INFO @ 3064.160136 us: (uvm_report_catcher.svh:705) [UVM/REPORT/CATCHER]
--- UVM Report catcher Summary ---
chip_sw_alert_handler_lpg_sleep_mode_alerts 54938786046844651890617561405797086884929675094252117845583248351888529470640 308
UVM_INFO @ 2693.000614 us: (uvm_report_catcher.svh:705) [UVM/REPORT/CATCHER]
--- UVM Report catcher Summary ---
chip_sw_alert_handler_lpg_sleep_mode_alerts 111319528035132588695906064240016309201692662609339064266459355307052786552633 308
UVM_INFO @ 2662.073240 us: (uvm_report_catcher.svh:705) [UVM/REPORT/CATCHER]
--- UVM Report catcher Summary ---
chip_sw_alert_handler_lpg_sleep_mode_alerts 9968197784979219663603848326569816704029072531498380573031587852115643489731 308
UVM_INFO @ 3113.511335 us: (uvm_report_catcher.svh:705) [UVM/REPORT/CATCHER]
--- UVM Report catcher Summary ---
chip_sw_alert_handler_lpg_sleep_mode_alerts 15140731670993060758657005015391373512481133175612807377863998656347499418978 308
UVM_INFO @ 2872.300760 us: (uvm_report_catcher.svh:705) [UVM/REPORT/CATCHER]
--- UVM Report catcher Summary ---
chip_sw_alert_handler_lpg_sleep_mode_alerts 1220849697751693576127273233642330114817497240256866692788344128948405842637 308
UVM_INFO @ 3018.344928 us: (uvm_report_catcher.svh:705) [UVM/REPORT/CATCHER]
--- UVM Report catcher Summary ---
chip_sw_alert_handler_lpg_sleep_mode_alerts 53207913045486794990780203929018347221301611450678195198301613280101451448225 308
UVM_INFO @ 3109.771247 us: (uvm_report_catcher.svh:705) [UVM/REPORT/CATCHER]
--- UVM Report catcher Summary ---
chip_sw_alert_handler_lpg_sleep_mode_alerts 34179071905333458038287035019584704942602676203943887387113978960855043238913 308
UVM_INFO @ 2219.596300 us: (uvm_report_catcher.svh:705) [UVM/REPORT/CATCHER]
--- UVM Report catcher Summary ---
chip_sw_alert_handler_lpg_sleep_mode_alerts 13681821238573663299299172574087946975555413234722452121939077812812700202047 308
UVM_INFO @ 2878.852226 us: (uvm_report_catcher.svh:705) [UVM/REPORT/CATCHER]
--- UVM Report catcher Summary ---
chip_sw_alert_handler_lpg_sleep_mode_alerts 9389541370989464047043336187346336624829228432498021822574164982129080054960 308
UVM_INFO @ 2821.379166 us: (uvm_report_catcher.svh:705) [UVM/REPORT/CATCHER]
--- UVM Report catcher Summary ---
chip_sw_alert_handler_lpg_sleep_mode_alerts 86611654246506893025241608285815115296164632350603005805538099891875245064692 308
UVM_INFO @ 3169.644280 us: (uvm_report_catcher.svh:705) [UVM/REPORT/CATCHER]
--- UVM Report catcher Summary ---
chip_sw_alert_handler_lpg_sleep_mode_alerts 30071242640567810803715840041104173437024827008607259383163200842566907561403 308
UVM_INFO @ 2705.732938 us: (uvm_report_catcher.svh:705) [UVM/REPORT/CATCHER]
--- UVM Report catcher Summary ---
chip_sw_alert_handler_lpg_sleep_mode_alerts 77908921499351220199547700438501280555673857628879317142176955521393550597247 308
UVM_INFO @ 3179.695744 us: (uvm_report_catcher.svh:705) [UVM/REPORT/CATCHER]
--- UVM Report catcher Summary ---
chip_sw_alert_handler_lpg_sleep_mode_alerts 81788315014345535972507557041776665115050565241708729405216935773241665778492 308
UVM_INFO @ 3252.824510 us: (uvm_report_catcher.svh:705) [UVM/REPORT/CATCHER]
--- UVM Report catcher Summary ---
chip_sw_alert_handler_lpg_sleep_mode_alerts 40238578889148061953790543954020817315723917350499531928741296313429007844790 308
UVM_INFO @ 3161.065133 us: (uvm_report_catcher.svh:705) [UVM/REPORT/CATCHER]
--- UVM Report catcher Summary ---
chip_sw_alert_handler_lpg_sleep_mode_alerts 49853472794640612513285711087617994031693310491931965401738860618059860314872 308
UVM_INFO @ 2279.063016 us: (uvm_report_catcher.svh:705) [UVM/REPORT/CATCHER]
--- UVM Report catcher Summary ---
chip_sw_alert_handler_lpg_sleep_mode_alerts 61545969844696863584040108057497712849370523361946715894686774218195449982939 308
UVM_INFO @ 3327.071574 us: (uvm_report_catcher.svh:705) [UVM/REPORT/CATCHER]
--- UVM Report catcher Summary ---
chip_sw_alert_handler_lpg_sleep_mode_alerts 72924126605216405406416152423700698427129573573577189450963248996432910618036 308
UVM_INFO @ 3547.046572 us: (uvm_report_catcher.svh:705) [UVM/REPORT/CATCHER]
--- UVM Report catcher Summary ---
chip_sw_alert_handler_lpg_sleep_mode_alerts 50468042203986961165607206996850277664163352065819874783986947352464978932517 308
UVM_INFO @ 2922.522250 us: (uvm_report_catcher.svh:705) [UVM/REPORT/CATCHER]
--- UVM Report catcher Summary ---
chip_sw_alert_handler_lpg_sleep_mode_alerts 7875446597832337964386433908667665832045234541217464091014846834273803740970 308
UVM_INFO @ 2946.045314 us: (uvm_report_catcher.svh:705) [UVM/REPORT/CATCHER]
--- UVM Report catcher Summary ---
chip_sw_alert_handler_lpg_sleep_mode_alerts 30359310403718165795246279877661938477114717077260783299942322079288220214219 308
UVM_INFO @ 3175.199728 us: (uvm_report_catcher.svh:705) [UVM/REPORT/CATCHER]
--- UVM Report catcher Summary ---
chip_sw_alert_handler_lpg_sleep_mode_alerts 97340824960462083126991650297795526051368316264177554988772598592739217605453 308
UVM_INFO @ 2979.934635 us: (uvm_report_catcher.svh:705) [UVM/REPORT/CATCHER]
--- UVM Report catcher Summary ---
chip_sw_alert_handler_lpg_sleep_mode_alerts 33336040322715264679876169187302972289184212694358881981889212812765530662371 308
UVM_INFO @ 2764.683077 us: (uvm_report_catcher.svh:705) [UVM/REPORT/CATCHER]
--- UVM Report catcher Summary ---
chip_sw_alert_handler_lpg_sleep_mode_alerts 70259927304686291993846456946195209784548407244033272485748489172498120650075 308
UVM_INFO @ 3131.347880 us: (uvm_report_catcher.svh:705) [UVM/REPORT/CATCHER]
--- UVM Report catcher Summary ---
chip_sw_alert_handler_lpg_sleep_mode_alerts 93684719057556760242543924379924011373878582736340748936637839683168722939345 308
UVM_INFO @ 3078.750170 us: (uvm_report_catcher.svh:705) [UVM/REPORT/CATCHER]
--- UVM Report catcher Summary ---
chip_sw_alert_handler_lpg_sleep_mode_alerts 72849255109017229235205455727473568645540932270115609356853058662704183886304 308
UVM_INFO @ 2781.602887 us: (uvm_report_catcher.svh:705) [UVM/REPORT/CATCHER]
--- UVM Report catcher Summary ---
chip_sw_alert_handler_lpg_sleep_mode_alerts 101571394876229590240347317245682682905588478847458881074704338638173713776177 308
UVM_INFO @ 2598.846250 us: (uvm_report_catcher.svh:705) [UVM/REPORT/CATCHER]
--- UVM Report catcher Summary ---
chip_sw_alert_handler_lpg_sleep_mode_alerts 58280547102378733369247048288230707027516380756773905378253240798154998292982 308
UVM_INFO @ 3289.245312 us: (uvm_report_catcher.svh:705) [UVM/REPORT/CATCHER]
--- UVM Report catcher Summary ---
chip_sw_alert_handler_lpg_sleep_mode_alerts 3903515566601013593696574753280708656877801130562524497513294339271361644044 308
UVM_INFO @ 3309.342732 us: (uvm_report_catcher.svh:705) [UVM/REPORT/CATCHER]
--- UVM Report catcher Summary ---
Some pass patterns missing: ['^TEST PASSED (UVM_)?CHECKS$'] 42 test runs
chip_sw_pwrmgr_sleep_wake_5_bug 68851844002115124975586655976100077623390653109284584031706751238697681408958 None
Another command (pid=3249179) is running. Waiting for it to complete on the server (server_pid=260029)...
Another command (pid=3249845) is running. Waiting for it to complete on the server (server_pid=260029)...
Another command (pid=3250000) is running. Waiting for it to complete on the server (server_pid=260029)...
WARNING: Target pattern parsing failed.
ERROR: Skipping '//sw/device/tests:pwrmgr_sleep_wake_5_bug_test_sim_dv': no such target '//sw/device/tests:pwrmgr_sleep_wake_5_bug_test_sim_dv': target 'pwrmgr_sleep_wake_5_bug_test_sim_dv' not declared in package 'sw/device/tests' defined by /nightly/current_run/opentitan/sw/device/tests/BUILD
ERROR: no such target '//sw/device/tests:pwrmgr_sleep_wake_5_bug_test_sim_dv': target 'pwrmgr_sleep_wake_5_bug_test_sim_dv' not declared in package 'sw/device/tests' defined by /nightly/current_run/opentitan/sw/device/tests/BUILD
ERROR: Build did NOT complete successfully
_run_cmd -> had a non-zero return code of 1.
make: *** [/nightly/current_run/opentitan/hw/dv/tools/dvsim/sim.mk:58: sw_build] Error 1
rom_e2e_boot_policy_valid_a_good_b_good_test_unlocked0 97931737642143709424186528686866178425751903979196693729601222694665914947350 None
Another command (pid=283842) is running. Waiting for it to complete on the server (server_pid=260029)...
Another command (pid=281413) is running. Waiting for it to complete on the server (server_pid=260029)...
Another command (pid=264738) is running. Waiting for it to complete on the server (server_pid=260029)...
WARNING: Target pattern parsing failed.
ERROR: Skipping '//sw/device/silicon_creator/rom/e2e:empty_test_slot_a_fake_ecdsa_prod_key_0_sim_dv': no such target '//sw/device/silicon_creator/rom/e2e:empty_test_slot_a_fake_ecdsa_prod_key_0_sim_dv': target 'empty_test_slot_a_fake_ecdsa_prod_key_0_sim_dv' not declared in package 'sw/device/silicon_creator/rom/e2e' defined by /nightly/current_run/opentitan/sw/device/silicon_creator/rom/e2e/BUILD
ERROR: no such target '//sw/device/silicon_creator/rom/e2e:empty_test_slot_a_fake_ecdsa_prod_key_0_sim_dv': target 'empty_test_slot_a_fake_ecdsa_prod_key_0_sim_dv' not declared in package 'sw/device/silicon_creator/rom/e2e' defined by /nightly/current_run/opentitan/sw/device/silicon_creator/rom/e2e/BUILD
ERROR: Build did NOT complete successfully
_run_cmd -> had a non-zero return code of 1.
make: *** [/nightly/current_run/opentitan/hw/dv/tools/dvsim/sim.mk:58: sw_build] Error 1
rom_e2e_boot_policy_valid_a_good_b_good_dev 26886521208170451298742716861484299932017216805989804591183708578177216042059 None
---- STDOUT ----
---- STDERR ----
WARNING: Target pattern parsing failed.
ERROR: Skipping '//sw/device/silicon_creator/rom/e2e:empty_test_slot_a_fake_ecdsa_prod_key_0_sim_dv': no such target '//sw/device/silicon_creator/rom/e2e:empty_test_slot_a_fake_ecdsa_prod_key_0_sim_dv': target 'empty_test_slot_a_fake_ecdsa_prod_key_0_sim_dv' not declared in package 'sw/device/silicon_creator/rom/e2e' defined by /nightly/current_run/opentitan/sw/device/silicon_creator/rom/e2e/BUILD
ERROR: no such target '//sw/device/silicon_creator/rom/e2e:empty_test_slot_a_fake_ecdsa_prod_key_0_sim_dv': target 'empty_test_slot_a_fake_ecdsa_prod_key_0_sim_dv' not declared in package 'sw/device/silicon_creator/rom/e2e' defined by /nightly/current_run/opentitan/sw/device/silicon_creator/rom/e2e/BUILD
ERROR: Build did NOT complete successfully
_run_cmd -> had a non-zero return code of 1.
make: *** [/nightly/current_run/opentitan/hw/dv/tools/dvsim/sim.mk:58: sw_build] Error 1
rom_e2e_boot_policy_valid_a_good_b_good_prod 58907894649243267681836699865585846546678561912422257365990422770272851355051 None
---- STDOUT ----
---- STDERR ----
WARNING: Target pattern parsing failed.
ERROR: Skipping '//sw/device/silicon_creator/rom/e2e:empty_test_slot_a_fake_ecdsa_prod_key_0_sim_dv': no such target '//sw/device/silicon_creator/rom/e2e:empty_test_slot_a_fake_ecdsa_prod_key_0_sim_dv': target 'empty_test_slot_a_fake_ecdsa_prod_key_0_sim_dv' not declared in package 'sw/device/silicon_creator/rom/e2e' defined by /nightly/current_run/opentitan/sw/device/silicon_creator/rom/e2e/BUILD
ERROR: no such target '//sw/device/silicon_creator/rom/e2e:empty_test_slot_a_fake_ecdsa_prod_key_0_sim_dv': target 'empty_test_slot_a_fake_ecdsa_prod_key_0_sim_dv' not declared in package 'sw/device/silicon_creator/rom/e2e' defined by /nightly/current_run/opentitan/sw/device/silicon_creator/rom/e2e/BUILD
ERROR: Build did NOT complete successfully
_run_cmd -> had a non-zero return code of 1.
make: *** [/nightly/current_run/opentitan/hw/dv/tools/dvsim/sim.mk:58: sw_build] Error 1
rom_e2e_boot_policy_valid_a_good_b_good_prod_end 88906018903213024825228988968483670430092001269348283411521390808358419383506 None
---- STDOUT ----
---- STDERR ----
WARNING: Target pattern parsing failed.
ERROR: Skipping '//sw/device/silicon_creator/rom/e2e:empty_test_slot_a_fake_ecdsa_prod_key_0_sim_dv': no such target '//sw/device/silicon_creator/rom/e2e:empty_test_slot_a_fake_ecdsa_prod_key_0_sim_dv': target 'empty_test_slot_a_fake_ecdsa_prod_key_0_sim_dv' not declared in package 'sw/device/silicon_creator/rom/e2e' defined by /nightly/current_run/opentitan/sw/device/silicon_creator/rom/e2e/BUILD
ERROR: no such target '//sw/device/silicon_creator/rom/e2e:empty_test_slot_a_fake_ecdsa_prod_key_0_sim_dv': target 'empty_test_slot_a_fake_ecdsa_prod_key_0_sim_dv' not declared in package 'sw/device/silicon_creator/rom/e2e' defined by /nightly/current_run/opentitan/sw/device/silicon_creator/rom/e2e/BUILD
ERROR: Build did NOT complete successfully
_run_cmd -> had a non-zero return code of 1.
make: *** [/nightly/current_run/opentitan/hw/dv/tools/dvsim/sim.mk:58: sw_build] Error 1
rom_e2e_boot_policy_valid_a_good_b_good_rma 29600568520209300173644548276782924970628457200688455337838334239565772478291 None
---- STDOUT ----
---- STDERR ----
WARNING: Target pattern parsing failed.
ERROR: Skipping '//sw/device/silicon_creator/rom/e2e:empty_test_slot_a_fake_ecdsa_prod_key_0_sim_dv': no such target '//sw/device/silicon_creator/rom/e2e:empty_test_slot_a_fake_ecdsa_prod_key_0_sim_dv': target 'empty_test_slot_a_fake_ecdsa_prod_key_0_sim_dv' not declared in package 'sw/device/silicon_creator/rom/e2e' defined by /nightly/current_run/opentitan/sw/device/silicon_creator/rom/e2e/BUILD
ERROR: no such target '//sw/device/silicon_creator/rom/e2e:empty_test_slot_a_fake_ecdsa_prod_key_0_sim_dv': target 'empty_test_slot_a_fake_ecdsa_prod_key_0_sim_dv' not declared in package 'sw/device/silicon_creator/rom/e2e' defined by /nightly/current_run/opentitan/sw/device/silicon_creator/rom/e2e/BUILD
ERROR: Build did NOT complete successfully
_run_cmd -> had a non-zero return code of 1.
make: *** [/nightly/current_run/opentitan/hw/dv/tools/dvsim/sim.mk:58: sw_build] Error 1
rom_e2e_boot_policy_valid_a_good_b_bad_test_unlocked0 32935494479480408909517591498708066114550986562991283196044021373149926928822 None
Another command (pid=263971) is running. Waiting for it to complete on the server (server_pid=260029)...
Another command (pid=285574) is running. Waiting for it to complete on the server (server_pid=260029)...
Another command (pid=283842) is running. Waiting for it to complete on the server (server_pid=260029)...
WARNING: Target pattern parsing failed.
ERROR: Skipping '//sw/device/silicon_creator/rom/e2e:empty_test_slot_a_fake_ecdsa_prod_key_0_sim_dv': no such target '//sw/device/silicon_creator/rom/e2e:empty_test_slot_a_fake_ecdsa_prod_key_0_sim_dv': target 'empty_test_slot_a_fake_ecdsa_prod_key_0_sim_dv' not declared in package 'sw/device/silicon_creator/rom/e2e' defined by /nightly/current_run/opentitan/sw/device/silicon_creator/rom/e2e/BUILD
ERROR: no such target '//sw/device/silicon_creator/rom/e2e:empty_test_slot_a_fake_ecdsa_prod_key_0_sim_dv': target 'empty_test_slot_a_fake_ecdsa_prod_key_0_sim_dv' not declared in package 'sw/device/silicon_creator/rom/e2e' defined by /nightly/current_run/opentitan/sw/device/silicon_creator/rom/e2e/BUILD
ERROR: Build did NOT complete successfully
_run_cmd -> had a non-zero return code of 1.
make: *** [/nightly/current_run/opentitan/hw/dv/tools/dvsim/sim.mk:58: sw_build] Error 1
rom_e2e_boot_policy_valid_a_good_b_bad_dev 34224617477037441176267496998218965437026091715743917382377594084155325572931 None
---- STDOUT ----
---- STDERR ----
WARNING: Target pattern parsing failed.
ERROR: Skipping '//sw/device/silicon_creator/rom/e2e:empty_test_slot_a_fake_ecdsa_prod_key_0_sim_dv': no such target '//sw/device/silicon_creator/rom/e2e:empty_test_slot_a_fake_ecdsa_prod_key_0_sim_dv': target 'empty_test_slot_a_fake_ecdsa_prod_key_0_sim_dv' not declared in package 'sw/device/silicon_creator/rom/e2e' defined by /nightly/current_run/opentitan/sw/device/silicon_creator/rom/e2e/BUILD
ERROR: no such target '//sw/device/silicon_creator/rom/e2e:empty_test_slot_a_fake_ecdsa_prod_key_0_sim_dv': target 'empty_test_slot_a_fake_ecdsa_prod_key_0_sim_dv' not declared in package 'sw/device/silicon_creator/rom/e2e' defined by /nightly/current_run/opentitan/sw/device/silicon_creator/rom/e2e/BUILD
ERROR: Build did NOT complete successfully
_run_cmd -> had a non-zero return code of 1.
make: *** [/nightly/current_run/opentitan/hw/dv/tools/dvsim/sim.mk:58: sw_build] Error 1
rom_e2e_boot_policy_valid_a_good_b_bad_prod 3236062699027072178534156933134942254861326102695168248285682036255009293795 None
---- STDOUT ----
---- STDERR ----
WARNING: Target pattern parsing failed.
ERROR: Skipping '//sw/device/silicon_creator/rom/e2e:empty_test_slot_a_fake_ecdsa_prod_key_0_sim_dv': no such target '//sw/device/silicon_creator/rom/e2e:empty_test_slot_a_fake_ecdsa_prod_key_0_sim_dv': target 'empty_test_slot_a_fake_ecdsa_prod_key_0_sim_dv' not declared in package 'sw/device/silicon_creator/rom/e2e' defined by /nightly/current_run/opentitan/sw/device/silicon_creator/rom/e2e/BUILD
ERROR: no such target '//sw/device/silicon_creator/rom/e2e:empty_test_slot_a_fake_ecdsa_prod_key_0_sim_dv': target 'empty_test_slot_a_fake_ecdsa_prod_key_0_sim_dv' not declared in package 'sw/device/silicon_creator/rom/e2e' defined by /nightly/current_run/opentitan/sw/device/silicon_creator/rom/e2e/BUILD
ERROR: Build did NOT complete successfully
_run_cmd -> had a non-zero return code of 1.
make: *** [/nightly/current_run/opentitan/hw/dv/tools/dvsim/sim.mk:58: sw_build] Error 1
rom_e2e_boot_policy_valid_a_good_b_bad_prod_end 17531412539253678610000114261010568503353154539222328175966453242822223373482 None
---- STDOUT ----
---- STDERR ----
WARNING: Target pattern parsing failed.
ERROR: Skipping '//sw/device/silicon_creator/rom/e2e:empty_test_slot_a_fake_ecdsa_prod_key_0_sim_dv': no such target '//sw/device/silicon_creator/rom/e2e:empty_test_slot_a_fake_ecdsa_prod_key_0_sim_dv': target 'empty_test_slot_a_fake_ecdsa_prod_key_0_sim_dv' not declared in package 'sw/device/silicon_creator/rom/e2e' defined by /nightly/current_run/opentitan/sw/device/silicon_creator/rom/e2e/BUILD
ERROR: no such target '//sw/device/silicon_creator/rom/e2e:empty_test_slot_a_fake_ecdsa_prod_key_0_sim_dv': target 'empty_test_slot_a_fake_ecdsa_prod_key_0_sim_dv' not declared in package 'sw/device/silicon_creator/rom/e2e' defined by /nightly/current_run/opentitan/sw/device/silicon_creator/rom/e2e/BUILD
ERROR: Build did NOT complete successfully
_run_cmd -> had a non-zero return code of 1.
make: *** [/nightly/current_run/opentitan/hw/dv/tools/dvsim/sim.mk:58: sw_build] Error 1
rom_e2e_boot_policy_valid_a_good_b_bad_rma 100236403278018090389710552322136780739442295473482797261068937954529414211264 None
---- STDOUT ----
---- STDERR ----
WARNING: Target pattern parsing failed.
ERROR: Skipping '//sw/device/silicon_creator/rom/e2e:empty_test_slot_a_fake_ecdsa_prod_key_0_sim_dv': no such target '//sw/device/silicon_creator/rom/e2e:empty_test_slot_a_fake_ecdsa_prod_key_0_sim_dv': target 'empty_test_slot_a_fake_ecdsa_prod_key_0_sim_dv' not declared in package 'sw/device/silicon_creator/rom/e2e' defined by /nightly/current_run/opentitan/sw/device/silicon_creator/rom/e2e/BUILD
ERROR: no such target '//sw/device/silicon_creator/rom/e2e:empty_test_slot_a_fake_ecdsa_prod_key_0_sim_dv': target 'empty_test_slot_a_fake_ecdsa_prod_key_0_sim_dv' not declared in package 'sw/device/silicon_creator/rom/e2e' defined by /nightly/current_run/opentitan/sw/device/silicon_creator/rom/e2e/BUILD
ERROR: Build did NOT complete successfully
_run_cmd -> had a non-zero return code of 1.
make: *** [/nightly/current_run/opentitan/hw/dv/tools/dvsim/sim.mk:58: sw_build] Error 1
rom_e2e_boot_policy_valid_a_bad_b_good_test_unlocked0 48420022943049335554436717689014863565253252951012577332878883370706252909229 None
---- STDERR ----
Another command (pid=292860) is running. Waiting for it to complete on the server (server_pid=260029)...
WARNING: Target pattern parsing failed.
ERROR: Skipping '//sw/device/silicon_creator/rom/e2e:empty_test_slot_b_fake_ecdsa_prod_key_0_sim_dv': no such target '//sw/device/silicon_creator/rom/e2e:empty_test_slot_b_fake_ecdsa_prod_key_0_sim_dv': target 'empty_test_slot_b_fake_ecdsa_prod_key_0_sim_dv' not declared in package 'sw/device/silicon_creator/rom/e2e' defined by /nightly/current_run/opentitan/sw/device/silicon_creator/rom/e2e/BUILD
ERROR: no such target '//sw/device/silicon_creator/rom/e2e:empty_test_slot_b_fake_ecdsa_prod_key_0_sim_dv': target 'empty_test_slot_b_fake_ecdsa_prod_key_0_sim_dv' not declared in package 'sw/device/silicon_creator/rom/e2e' defined by /nightly/current_run/opentitan/sw/device/silicon_creator/rom/e2e/BUILD
ERROR: Build did NOT complete successfully
_run_cmd -> had a non-zero return code of 1.
make: *** [/nightly/current_run/opentitan/hw/dv/tools/dvsim/sim.mk:58: sw_build] Error 1
rom_e2e_boot_policy_valid_a_bad_b_good_dev 113430053458236965954657280205851175669571316519474021473194533227292352596032 None
---- STDOUT ----
---- STDERR ----
WARNING: Target pattern parsing failed.
ERROR: Skipping '//sw/device/silicon_creator/rom/e2e:empty_test_slot_b_fake_ecdsa_prod_key_0_sim_dv': no such target '//sw/device/silicon_creator/rom/e2e:empty_test_slot_b_fake_ecdsa_prod_key_0_sim_dv': target 'empty_test_slot_b_fake_ecdsa_prod_key_0_sim_dv' not declared in package 'sw/device/silicon_creator/rom/e2e' defined by /nightly/current_run/opentitan/sw/device/silicon_creator/rom/e2e/BUILD
ERROR: no such target '//sw/device/silicon_creator/rom/e2e:empty_test_slot_b_fake_ecdsa_prod_key_0_sim_dv': target 'empty_test_slot_b_fake_ecdsa_prod_key_0_sim_dv' not declared in package 'sw/device/silicon_creator/rom/e2e' defined by /nightly/current_run/opentitan/sw/device/silicon_creator/rom/e2e/BUILD
ERROR: Build did NOT complete successfully
_run_cmd -> had a non-zero return code of 1.
make: *** [/nightly/current_run/opentitan/hw/dv/tools/dvsim/sim.mk:58: sw_build] Error 1
rom_e2e_boot_policy_valid_a_bad_b_good_prod 95255513598857521468965072222365361546409031229976720936197689455051553167473 None
---- STDOUT ----
---- STDERR ----
WARNING: Target pattern parsing failed.
ERROR: Skipping '//sw/device/silicon_creator/rom/e2e:empty_test_slot_b_fake_ecdsa_prod_key_0_sim_dv': no such target '//sw/device/silicon_creator/rom/e2e:empty_test_slot_b_fake_ecdsa_prod_key_0_sim_dv': target 'empty_test_slot_b_fake_ecdsa_prod_key_0_sim_dv' not declared in package 'sw/device/silicon_creator/rom/e2e' defined by /nightly/current_run/opentitan/sw/device/silicon_creator/rom/e2e/BUILD
ERROR: no such target '//sw/device/silicon_creator/rom/e2e:empty_test_slot_b_fake_ecdsa_prod_key_0_sim_dv': target 'empty_test_slot_b_fake_ecdsa_prod_key_0_sim_dv' not declared in package 'sw/device/silicon_creator/rom/e2e' defined by /nightly/current_run/opentitan/sw/device/silicon_creator/rom/e2e/BUILD
ERROR: Build did NOT complete successfully
_run_cmd -> had a non-zero return code of 1.
make: *** [/nightly/current_run/opentitan/hw/dv/tools/dvsim/sim.mk:58: sw_build] Error 1
rom_e2e_boot_policy_valid_a_bad_b_good_prod_end 26399823255722150338659324484226597362223451799569763320382205028822910540303 None
---- STDOUT ----
---- STDERR ----
WARNING: Target pattern parsing failed.
ERROR: Skipping '//sw/device/silicon_creator/rom/e2e:empty_test_slot_b_fake_ecdsa_prod_key_0_sim_dv': no such target '//sw/device/silicon_creator/rom/e2e:empty_test_slot_b_fake_ecdsa_prod_key_0_sim_dv': target 'empty_test_slot_b_fake_ecdsa_prod_key_0_sim_dv' not declared in package 'sw/device/silicon_creator/rom/e2e' defined by /nightly/current_run/opentitan/sw/device/silicon_creator/rom/e2e/BUILD
ERROR: no such target '//sw/device/silicon_creator/rom/e2e:empty_test_slot_b_fake_ecdsa_prod_key_0_sim_dv': target 'empty_test_slot_b_fake_ecdsa_prod_key_0_sim_dv' not declared in package 'sw/device/silicon_creator/rom/e2e' defined by /nightly/current_run/opentitan/sw/device/silicon_creator/rom/e2e/BUILD
ERROR: Build did NOT complete successfully
_run_cmd -> had a non-zero return code of 1.
make: *** [/nightly/current_run/opentitan/hw/dv/tools/dvsim/sim.mk:58: sw_build] Error 1
rom_e2e_boot_policy_valid_a_bad_b_good_rma 114861927981573469479245206453843893230773103163719427598294478463350750358044 None
---- STDOUT ----
---- STDERR ----
WARNING: Target pattern parsing failed.
ERROR: Skipping '//sw/device/silicon_creator/rom/e2e:empty_test_slot_b_fake_ecdsa_prod_key_0_sim_dv': no such target '//sw/device/silicon_creator/rom/e2e:empty_test_slot_b_fake_ecdsa_prod_key_0_sim_dv': target 'empty_test_slot_b_fake_ecdsa_prod_key_0_sim_dv' not declared in package 'sw/device/silicon_creator/rom/e2e' defined by /nightly/current_run/opentitan/sw/device/silicon_creator/rom/e2e/BUILD
ERROR: no such target '//sw/device/silicon_creator/rom/e2e:empty_test_slot_b_fake_ecdsa_prod_key_0_sim_dv': target 'empty_test_slot_b_fake_ecdsa_prod_key_0_sim_dv' not declared in package 'sw/device/silicon_creator/rom/e2e' defined by /nightly/current_run/opentitan/sw/device/silicon_creator/rom/e2e/BUILD
ERROR: Build did NOT complete successfully
_run_cmd -> had a non-zero return code of 1.
make: *** [/nightly/current_run/opentitan/hw/dv/tools/dvsim/sim.mk:58: sw_build] Error 1
rom_e2e_asm_init_test_unlocked0 75525678235149217967309198691839463428279022945268254159753405072973020172896 None
Another command (pid=263971) is running. Waiting for it to complete on the server (server_pid=260029)...
Another command (pid=285574) is running. Waiting for it to complete on the server (server_pid=260029)...
Another command (pid=283842) is running. Waiting for it to complete on the server (server_pid=260029)...
WARNING: Target pattern parsing failed.
ERROR: Skipping '//sw/device/silicon_creator/rom/e2e:empty_test_slot_a_fake_ecdsa_prod_key_0_sim_dv': no such target '//sw/device/silicon_creator/rom/e2e:empty_test_slot_a_fake_ecdsa_prod_key_0_sim_dv': target 'empty_test_slot_a_fake_ecdsa_prod_key_0_sim_dv' not declared in package 'sw/device/silicon_creator/rom/e2e' defined by /nightly/current_run/opentitan/sw/device/silicon_creator/rom/e2e/BUILD
ERROR: no such target '//sw/device/silicon_creator/rom/e2e:empty_test_slot_a_fake_ecdsa_prod_key_0_sim_dv': target 'empty_test_slot_a_fake_ecdsa_prod_key_0_sim_dv' not declared in package 'sw/device/silicon_creator/rom/e2e' defined by /nightly/current_run/opentitan/sw/device/silicon_creator/rom/e2e/BUILD
ERROR: Build did NOT complete successfully
_run_cmd -> had a non-zero return code of 1.
make: *** [/nightly/current_run/opentitan/hw/dv/tools/dvsim/sim.mk:58: sw_build] Error 1
rom_e2e_asm_init_dev 3930910742146623788085720558054296648131554288765559663306110775502826831189 None
---- STDERR ----
Another command (pid=430867) is running. Waiting for it to complete on the server (server_pid=260029)...
WARNING: Target pattern parsing failed.
ERROR: Skipping '//sw/device/silicon_creator/rom/e2e:empty_test_slot_a_fake_ecdsa_prod_key_0_sim_dv': no such target '//sw/device/silicon_creator/rom/e2e:empty_test_slot_a_fake_ecdsa_prod_key_0_sim_dv': target 'empty_test_slot_a_fake_ecdsa_prod_key_0_sim_dv' not declared in package 'sw/device/silicon_creator/rom/e2e' defined by /nightly/current_run/opentitan/sw/device/silicon_creator/rom/e2e/BUILD
ERROR: no such target '//sw/device/silicon_creator/rom/e2e:empty_test_slot_a_fake_ecdsa_prod_key_0_sim_dv': target 'empty_test_slot_a_fake_ecdsa_prod_key_0_sim_dv' not declared in package 'sw/device/silicon_creator/rom/e2e' defined by /nightly/current_run/opentitan/sw/device/silicon_creator/rom/e2e/BUILD
ERROR: Build did NOT complete successfully
_run_cmd -> had a non-zero return code of 1.
make: *** [/nightly/current_run/opentitan/hw/dv/tools/dvsim/sim.mk:58: sw_build] Error 1
rom_e2e_asm_init_prod 6957903985527149451943002888983633639255128439988073521036462842957671526445 None
---- STDOUT ----
---- STDERR ----
WARNING: Target pattern parsing failed.
ERROR: Skipping '//sw/device/silicon_creator/rom/e2e:empty_test_slot_a_fake_ecdsa_prod_key_0_sim_dv': no such target '//sw/device/silicon_creator/rom/e2e:empty_test_slot_a_fake_ecdsa_prod_key_0_sim_dv': target 'empty_test_slot_a_fake_ecdsa_prod_key_0_sim_dv' not declared in package 'sw/device/silicon_creator/rom/e2e' defined by /nightly/current_run/opentitan/sw/device/silicon_creator/rom/e2e/BUILD
ERROR: no such target '//sw/device/silicon_creator/rom/e2e:empty_test_slot_a_fake_ecdsa_prod_key_0_sim_dv': target 'empty_test_slot_a_fake_ecdsa_prod_key_0_sim_dv' not declared in package 'sw/device/silicon_creator/rom/e2e' defined by /nightly/current_run/opentitan/sw/device/silicon_creator/rom/e2e/BUILD
ERROR: Build did NOT complete successfully
_run_cmd -> had a non-zero return code of 1.
make: *** [/nightly/current_run/opentitan/hw/dv/tools/dvsim/sim.mk:58: sw_build] Error 1
rom_e2e_asm_init_prod_end 31670462088070948957206279465156555292633266205117755336397047268820873897219 None
---- STDOUT ----
---- STDERR ----
WARNING: Target pattern parsing failed.
ERROR: Skipping '//sw/device/silicon_creator/rom/e2e:empty_test_slot_a_fake_ecdsa_prod_key_0_sim_dv': no such target '//sw/device/silicon_creator/rom/e2e:empty_test_slot_a_fake_ecdsa_prod_key_0_sim_dv': target 'empty_test_slot_a_fake_ecdsa_prod_key_0_sim_dv' not declared in package 'sw/device/silicon_creator/rom/e2e' defined by /nightly/current_run/opentitan/sw/device/silicon_creator/rom/e2e/BUILD
ERROR: no such target '//sw/device/silicon_creator/rom/e2e:empty_test_slot_a_fake_ecdsa_prod_key_0_sim_dv': target 'empty_test_slot_a_fake_ecdsa_prod_key_0_sim_dv' not declared in package 'sw/device/silicon_creator/rom/e2e' defined by /nightly/current_run/opentitan/sw/device/silicon_creator/rom/e2e/BUILD
ERROR: Build did NOT complete successfully
_run_cmd -> had a non-zero return code of 1.
make: *** [/nightly/current_run/opentitan/hw/dv/tools/dvsim/sim.mk:58: sw_build] Error 1
rom_e2e_asm_init_rma 25814164770597302824629397117368325414809542046675323411766988458457956854317 None
---- STDOUT ----
---- STDERR ----
WARNING: Target pattern parsing failed.
ERROR: Skipping '//sw/device/silicon_creator/rom/e2e:empty_test_slot_a_fake_ecdsa_prod_key_0_sim_dv': no such target '//sw/device/silicon_creator/rom/e2e:empty_test_slot_a_fake_ecdsa_prod_key_0_sim_dv': target 'empty_test_slot_a_fake_ecdsa_prod_key_0_sim_dv' not declared in package 'sw/device/silicon_creator/rom/e2e' defined by /nightly/current_run/opentitan/sw/device/silicon_creator/rom/e2e/BUILD
ERROR: no such target '//sw/device/silicon_creator/rom/e2e:empty_test_slot_a_fake_ecdsa_prod_key_0_sim_dv': target 'empty_test_slot_a_fake_ecdsa_prod_key_0_sim_dv' not declared in package 'sw/device/silicon_creator/rom/e2e' defined by /nightly/current_run/opentitan/sw/device/silicon_creator/rom/e2e/BUILD
ERROR: Build did NOT complete successfully
_run_cmd -> had a non-zero return code of 1.
make: *** [/nightly/current_run/opentitan/hw/dv/tools/dvsim/sim.mk:58: sw_build] Error 1
rom_volatile_raw_unlock 85843798555721512990838914606628458707385192327257032065355905437092011421768 None
Another command (pid=315917) is running. Waiting for it to complete on the server (server_pid=260029)...
Another command (pid=315045) is running. Waiting for it to complete on the server (server_pid=260029)...
Another command (pid=318318) is running. Waiting for it to complete on the server (server_pid=260029)...
WARNING: Target pattern parsing failed.
ERROR: Skipping '//sw/device/silicon_creator/rom/e2e:empty_test_slot_a_fake_ecdsa_test_key_0_sim_dv': no such target '//sw/device/silicon_creator/rom/e2e:empty_test_slot_a_fake_ecdsa_test_key_0_sim_dv': target 'empty_test_slot_a_fake_ecdsa_test_key_0_sim_dv' not declared in package 'sw/device/silicon_creator/rom/e2e' defined by /nightly/current_run/opentitan/sw/device/silicon_creator/rom/e2e/BUILD
ERROR: no such target '//sw/device/silicon_creator/rom/e2e:empty_test_slot_a_fake_ecdsa_test_key_0_sim_dv': target 'empty_test_slot_a_fake_ecdsa_test_key_0_sim_dv' not declared in package 'sw/device/silicon_creator/rom/e2e' defined by /nightly/current_run/opentitan/sw/device/silicon_creator/rom/e2e/BUILD
ERROR: Build did NOT complete successfully
_run_cmd -> had a non-zero return code of 1.
make: *** [/nightly/current_run/opentitan/hw/dv/tools/dvsim/sim.mk:58: sw_build] Error 1
rom_raw_unlock 18660521875006589140193821387244092791408679223630224003849416700382100583713 None
---- STDERR ----
Another command (pid=296339) is running. Waiting for it to complete on the server (server_pid=260029)...
WARNING: Target pattern parsing failed.
ERROR: Skipping '//sw/device/silicon_creator/rom/e2e:empty_test_slot_a_fake_ecdsa_test_key_0_sim_dv': no such target '//sw/device/silicon_creator/rom/e2e:empty_test_slot_a_fake_ecdsa_test_key_0_sim_dv': target 'empty_test_slot_a_fake_ecdsa_test_key_0_sim_dv' not declared in package 'sw/device/silicon_creator/rom/e2e' defined by /nightly/current_run/opentitan/sw/device/silicon_creator/rom/e2e/BUILD
ERROR: no such target '//sw/device/silicon_creator/rom/e2e:empty_test_slot_a_fake_ecdsa_test_key_0_sim_dv': target 'empty_test_slot_a_fake_ecdsa_test_key_0_sim_dv' not declared in package 'sw/device/silicon_creator/rom/e2e' defined by /nightly/current_run/opentitan/sw/device/silicon_creator/rom/e2e/BUILD
ERROR: Build did NOT complete successfully
_run_cmd -> had a non-zero return code of 1.
make: *** [/nightly/current_run/opentitan/hw/dv/tools/dvsim/sim.mk:58: sw_build] Error 1
rom_e2e_self_hash 92289293064469840482321897679089849087510723671736902099430192271170108597537 None
Another command (pid=263706) is running. Waiting for it to complete on the server (server_pid=260029)...
Another command (pid=296771) is running. Waiting for it to complete on the server (server_pid=260029)...
Another command (pid=296123) is running. Waiting for it to complete on the server (server_pid=260029)...
WARNING: Target pattern parsing failed.
ERROR: Skipping '//sw/device/silicon_creator/rom/e2e/release:rom_e2e_self_hash_test_sim_dv': no such target '//sw/device/silicon_creator/rom/e2e/release:rom_e2e_self_hash_test_sim_dv': target 'rom_e2e_self_hash_test_sim_dv' not declared in package 'sw/device/silicon_creator/rom/e2e/release' defined by /nightly/current_run/opentitan/sw/device/silicon_creator/rom/e2e/release/BUILD
ERROR: no such target '//sw/device/silicon_creator/rom/e2e/release:rom_e2e_self_hash_test_sim_dv': target 'rom_e2e_self_hash_test_sim_dv' not declared in package 'sw/device/silicon_creator/rom/e2e/release' defined by /nightly/current_run/opentitan/sw/device/silicon_creator/rom/e2e/release/BUILD
ERROR: Build did NOT complete successfully
_run_cmd -> had a non-zero return code of 1.
make: *** [/nightly/current_run/opentitan/hw/dv/tools/dvsim/sim.mk:58: sw_build] Error 1
chip_sw_pwrmgr_sleep_wake_5_bug 74056459110236588461458841360914110277239050568728393812960796118472217713340 None
---- STDERR ----
Another command (pid=4162442) is running. Waiting for it to complete on the server (server_pid=260029)...
Another command (pid=4164669) is running. Waiting for it to complete on the server (server_pid=260029)...
WARNING: Target pattern parsing failed.
ERROR: Skipping '//sw/device/tests:pwrmgr_sleep_wake_5_bug_test_sim_dv': no such target '//sw/device/tests:pwrmgr_sleep_wake_5_bug_test_sim_dv': target 'pwrmgr_sleep_wake_5_bug_test_sim_dv' not declared in package 'sw/device/tests' defined by /nightly/current_run/opentitan/sw/device/tests/BUILD
ERROR: no such target '//sw/device/tests:pwrmgr_sleep_wake_5_bug_test_sim_dv': target 'pwrmgr_sleep_wake_5_bug_test_sim_dv' not declared in package 'sw/device/tests' defined by /nightly/current_run/opentitan/sw/device/tests/BUILD
ERROR: Build did NOT complete successfully
_run_cmd -> had a non-zero return code of 1.
make: *** [/nightly/current_run/opentitan/hw/dv/tools/dvsim/sim.mk:58: sw_build] Error 1
rom_e2e_asm_init_test_unlocked0 97795726176690278453697412642447531757298396374946108995878460411782855448757 None
Another command (pid=305142) is running. Waiting for it to complete on the server (server_pid=260029)...
Another command (pid=316615) is running. Waiting for it to complete on the server (server_pid=260029)...
Another command (pid=315917) is running. Waiting for it to complete on the server (server_pid=260029)...
WARNING: Target pattern parsing failed.
ERROR: Skipping '//sw/device/silicon_creator/rom/e2e:empty_test_slot_a_fake_ecdsa_prod_key_0_sim_dv': no such target '//sw/device/silicon_creator/rom/e2e:empty_test_slot_a_fake_ecdsa_prod_key_0_sim_dv': target 'empty_test_slot_a_fake_ecdsa_prod_key_0_sim_dv' not declared in package 'sw/device/silicon_creator/rom/e2e' defined by /nightly/current_run/opentitan/sw/device/silicon_creator/rom/e2e/BUILD
ERROR: no such target '//sw/device/silicon_creator/rom/e2e:empty_test_slot_a_fake_ecdsa_prod_key_0_sim_dv': target 'empty_test_slot_a_fake_ecdsa_prod_key_0_sim_dv' not declared in package 'sw/device/silicon_creator/rom/e2e' defined by /nightly/current_run/opentitan/sw/device/silicon_creator/rom/e2e/BUILD
ERROR: Build did NOT complete successfully
_run_cmd -> had a non-zero return code of 1.
make: *** [/nightly/current_run/opentitan/hw/dv/tools/dvsim/sim.mk:58: sw_build] Error 1
rom_e2e_asm_init_dev 23222164268384812733802878630627663440039701869816677578127045247563840066647 None
---- STDOUT ----
---- STDERR ----
WARNING: Target pattern parsing failed.
ERROR: Skipping '//sw/device/silicon_creator/rom/e2e:empty_test_slot_a_fake_ecdsa_prod_key_0_sim_dv': no such target '//sw/device/silicon_creator/rom/e2e:empty_test_slot_a_fake_ecdsa_prod_key_0_sim_dv': target 'empty_test_slot_a_fake_ecdsa_prod_key_0_sim_dv' not declared in package 'sw/device/silicon_creator/rom/e2e' defined by /nightly/current_run/opentitan/sw/device/silicon_creator/rom/e2e/BUILD
ERROR: no such target '//sw/device/silicon_creator/rom/e2e:empty_test_slot_a_fake_ecdsa_prod_key_0_sim_dv': target 'empty_test_slot_a_fake_ecdsa_prod_key_0_sim_dv' not declared in package 'sw/device/silicon_creator/rom/e2e' defined by /nightly/current_run/opentitan/sw/device/silicon_creator/rom/e2e/BUILD
ERROR: Build did NOT complete successfully
_run_cmd -> had a non-zero return code of 1.
make: *** [/nightly/current_run/opentitan/hw/dv/tools/dvsim/sim.mk:58: sw_build] Error 1
rom_e2e_asm_init_prod 57212160141847871893266386093551394424727786281825427642742076621182836863339 None
---- STDOUT ----
---- STDERR ----
WARNING: Target pattern parsing failed.
ERROR: Skipping '//sw/device/silicon_creator/rom/e2e:empty_test_slot_a_fake_ecdsa_prod_key_0_sim_dv': no such target '//sw/device/silicon_creator/rom/e2e:empty_test_slot_a_fake_ecdsa_prod_key_0_sim_dv': target 'empty_test_slot_a_fake_ecdsa_prod_key_0_sim_dv' not declared in package 'sw/device/silicon_creator/rom/e2e' defined by /nightly/current_run/opentitan/sw/device/silicon_creator/rom/e2e/BUILD
ERROR: no such target '//sw/device/silicon_creator/rom/e2e:empty_test_slot_a_fake_ecdsa_prod_key_0_sim_dv': target 'empty_test_slot_a_fake_ecdsa_prod_key_0_sim_dv' not declared in package 'sw/device/silicon_creator/rom/e2e' defined by /nightly/current_run/opentitan/sw/device/silicon_creator/rom/e2e/BUILD
ERROR: Build did NOT complete successfully
_run_cmd -> had a non-zero return code of 1.
make: *** [/nightly/current_run/opentitan/hw/dv/tools/dvsim/sim.mk:58: sw_build] Error 1
rom_e2e_asm_init_prod_end 92276933221325181012277769879144429799755309610139322450596623722904653064597 None
---- STDOUT ----
---- STDERR ----
WARNING: Target pattern parsing failed.
ERROR: Skipping '//sw/device/silicon_creator/rom/e2e:empty_test_slot_a_fake_ecdsa_prod_key_0_sim_dv': no such target '//sw/device/silicon_creator/rom/e2e:empty_test_slot_a_fake_ecdsa_prod_key_0_sim_dv': target 'empty_test_slot_a_fake_ecdsa_prod_key_0_sim_dv' not declared in package 'sw/device/silicon_creator/rom/e2e' defined by /nightly/current_run/opentitan/sw/device/silicon_creator/rom/e2e/BUILD
ERROR: no such target '//sw/device/silicon_creator/rom/e2e:empty_test_slot_a_fake_ecdsa_prod_key_0_sim_dv': target 'empty_test_slot_a_fake_ecdsa_prod_key_0_sim_dv' not declared in package 'sw/device/silicon_creator/rom/e2e' defined by /nightly/current_run/opentitan/sw/device/silicon_creator/rom/e2e/BUILD
ERROR: Build did NOT complete successfully
_run_cmd -> had a non-zero return code of 1.
make: *** [/nightly/current_run/opentitan/hw/dv/tools/dvsim/sim.mk:58: sw_build] Error 1
rom_e2e_asm_init_rma 81047356547458275211192510450052559220035379067959151142851497967857904469661 None
---- STDOUT ----
---- STDERR ----
WARNING: Target pattern parsing failed.
ERROR: Skipping '//sw/device/silicon_creator/rom/e2e:empty_test_slot_a_fake_ecdsa_prod_key_0_sim_dv': no such target '//sw/device/silicon_creator/rom/e2e:empty_test_slot_a_fake_ecdsa_prod_key_0_sim_dv': target 'empty_test_slot_a_fake_ecdsa_prod_key_0_sim_dv' not declared in package 'sw/device/silicon_creator/rom/e2e' defined by /nightly/current_run/opentitan/sw/device/silicon_creator/rom/e2e/BUILD
ERROR: no such target '//sw/device/silicon_creator/rom/e2e:empty_test_slot_a_fake_ecdsa_prod_key_0_sim_dv': target 'empty_test_slot_a_fake_ecdsa_prod_key_0_sim_dv' not declared in package 'sw/device/silicon_creator/rom/e2e' defined by /nightly/current_run/opentitan/sw/device/silicon_creator/rom/e2e/BUILD
ERROR: Build did NOT complete successfully
_run_cmd -> had a non-zero return code of 1.
make: *** [/nightly/current_run/opentitan/hw/dv/tools/dvsim/sim.mk:58: sw_build] Error 1
rom_volatile_raw_unlock 87803158341543179321658458202172187019293859114258305544434068300842308782794 None
Another command (pid=330084) is running. Waiting for it to complete on the server (server_pid=260029)...
Another command (pid=330132) is running. Waiting for it to complete on the server (server_pid=260029)...
Another command (pid=330950) is running. Waiting for it to complete on the server (server_pid=260029)...
WARNING: Target pattern parsing failed.
ERROR: Skipping '//sw/device/silicon_creator/rom/e2e:empty_test_slot_a_fake_ecdsa_test_key_0_sim_dv': no such target '//sw/device/silicon_creator/rom/e2e:empty_test_slot_a_fake_ecdsa_test_key_0_sim_dv': target 'empty_test_slot_a_fake_ecdsa_test_key_0_sim_dv' not declared in package 'sw/device/silicon_creator/rom/e2e' defined by /nightly/current_run/opentitan/sw/device/silicon_creator/rom/e2e/BUILD
ERROR: no such target '//sw/device/silicon_creator/rom/e2e:empty_test_slot_a_fake_ecdsa_test_key_0_sim_dv': target 'empty_test_slot_a_fake_ecdsa_test_key_0_sim_dv' not declared in package 'sw/device/silicon_creator/rom/e2e' defined by /nightly/current_run/opentitan/sw/device/silicon_creator/rom/e2e/BUILD
ERROR: Build did NOT complete successfully
_run_cmd -> had a non-zero return code of 1.
make: *** [/nightly/current_run/opentitan/hw/dv/tools/dvsim/sim.mk:58: sw_build] Error 1
rom_raw_unlock 18639420476858484507408996936294469698317346403809635156804703222967705370562 None
---- STDERR ----
Another command (pid=322286) is running. Waiting for it to complete on the server (server_pid=260029)...
Another command (pid=321025) is running. Waiting for it to complete on the server (server_pid=260029)...
WARNING: Target pattern parsing failed.
ERROR: Skipping '//sw/device/silicon_creator/rom/e2e:empty_test_slot_a_fake_ecdsa_test_key_0_sim_dv': no such target '//sw/device/silicon_creator/rom/e2e:empty_test_slot_a_fake_ecdsa_test_key_0_sim_dv': target 'empty_test_slot_a_fake_ecdsa_test_key_0_sim_dv' not declared in package 'sw/device/silicon_creator/rom/e2e' defined by /nightly/current_run/opentitan/sw/device/silicon_creator/rom/e2e/BUILD
ERROR: no such target '//sw/device/silicon_creator/rom/e2e:empty_test_slot_a_fake_ecdsa_test_key_0_sim_dv': target 'empty_test_slot_a_fake_ecdsa_test_key_0_sim_dv' not declared in package 'sw/device/silicon_creator/rom/e2e' defined by /nightly/current_run/opentitan/sw/device/silicon_creator/rom/e2e/BUILD
ERROR: Build did NOT complete successfully
_run_cmd -> had a non-zero return code of 1.
make: *** [/nightly/current_run/opentitan/hw/dv/tools/dvsim/sim.mk:58: sw_build] Error 1
rom_e2e_self_hash 68441652118821479345060562612114108289760361534534491908238531642240728744470 None
Another command (pid=308554) is running. Waiting for it to complete on the server (server_pid=260029)...
Another command (pid=311369) is running. Waiting for it to complete on the server (server_pid=260029)...
Another command (pid=314488) is running. Waiting for it to complete on the server (server_pid=260029)...
WARNING: Target pattern parsing failed.
ERROR: Skipping '//sw/device/silicon_creator/rom/e2e/release:rom_e2e_self_hash_test_sim_dv': no such target '//sw/device/silicon_creator/rom/e2e/release:rom_e2e_self_hash_test_sim_dv': target 'rom_e2e_self_hash_test_sim_dv' not declared in package 'sw/device/silicon_creator/rom/e2e/release' defined by /nightly/current_run/opentitan/sw/device/silicon_creator/rom/e2e/release/BUILD
ERROR: no such target '//sw/device/silicon_creator/rom/e2e/release:rom_e2e_self_hash_test_sim_dv': target 'rom_e2e_self_hash_test_sim_dv' not declared in package 'sw/device/silicon_creator/rom/e2e/release' defined by /nightly/current_run/opentitan/sw/device/silicon_creator/rom/e2e/release/BUILD
ERROR: Build did NOT complete successfully
_run_cmd -> had a non-zero return code of 1.
make: *** [/nightly/current_run/opentitan/hw/dv/tools/dvsim/sim.mk:58: sw_build] Error 1
chip_sw_pwrmgr_sleep_wake_5_bug 62900973615018267566427096221782855344265973127630727010399023238099489223061 None
---- STDERR ----
Another command (pid=926068) is running. Waiting for it to complete on the server (server_pid=260029)...
Another command (pid=926626) is running. Waiting for it to complete on the server (server_pid=260029)...
WARNING: Target pattern parsing failed.
ERROR: Skipping '//sw/device/tests:pwrmgr_sleep_wake_5_bug_test_sim_dv': no such target '//sw/device/tests:pwrmgr_sleep_wake_5_bug_test_sim_dv': target 'pwrmgr_sleep_wake_5_bug_test_sim_dv' not declared in package 'sw/device/tests' defined by /nightly/current_run/opentitan/sw/device/tests/BUILD
ERROR: no such target '//sw/device/tests:pwrmgr_sleep_wake_5_bug_test_sim_dv': target 'pwrmgr_sleep_wake_5_bug_test_sim_dv' not declared in package 'sw/device/tests' defined by /nightly/current_run/opentitan/sw/device/tests/BUILD
ERROR: Build did NOT complete successfully
_run_cmd -> had a non-zero return code of 1.
make: *** [/nightly/current_run/opentitan/hw/dv/tools/dvsim/sim.mk:58: sw_build] Error 1
rom_e2e_asm_init_test_unlocked0 65232607768626028060045271711013511406158123210520224311838193337432975234503 None
---- STDERR ----
Another command (pid=334712) is running. Waiting for it to complete on the server (server_pid=260029)...
WARNING: Target pattern parsing failed.
ERROR: Skipping '//sw/device/silicon_creator/rom/e2e:empty_test_slot_a_fake_ecdsa_prod_key_0_sim_dv': no such target '//sw/device/silicon_creator/rom/e2e:empty_test_slot_a_fake_ecdsa_prod_key_0_sim_dv': target 'empty_test_slot_a_fake_ecdsa_prod_key_0_sim_dv' not declared in package 'sw/device/silicon_creator/rom/e2e' defined by /nightly/current_run/opentitan/sw/device/silicon_creator/rom/e2e/BUILD
ERROR: no such target '//sw/device/silicon_creator/rom/e2e:empty_test_slot_a_fake_ecdsa_prod_key_0_sim_dv': target 'empty_test_slot_a_fake_ecdsa_prod_key_0_sim_dv' not declared in package 'sw/device/silicon_creator/rom/e2e' defined by /nightly/current_run/opentitan/sw/device/silicon_creator/rom/e2e/BUILD
ERROR: Build did NOT complete successfully
_run_cmd -> had a non-zero return code of 1.
make: *** [/nightly/current_run/opentitan/hw/dv/tools/dvsim/sim.mk:58: sw_build] Error 1
rom_e2e_asm_init_dev 74312728892433670220069114540969646640983193808740006634099731113934842644567 None
---- STDOUT ----
---- STDERR ----
WARNING: Target pattern parsing failed.
ERROR: Skipping '//sw/device/silicon_creator/rom/e2e:empty_test_slot_a_fake_ecdsa_prod_key_0_sim_dv': no such target '//sw/device/silicon_creator/rom/e2e:empty_test_slot_a_fake_ecdsa_prod_key_0_sim_dv': target 'empty_test_slot_a_fake_ecdsa_prod_key_0_sim_dv' not declared in package 'sw/device/silicon_creator/rom/e2e' defined by /nightly/current_run/opentitan/sw/device/silicon_creator/rom/e2e/BUILD
ERROR: no such target '//sw/device/silicon_creator/rom/e2e:empty_test_slot_a_fake_ecdsa_prod_key_0_sim_dv': target 'empty_test_slot_a_fake_ecdsa_prod_key_0_sim_dv' not declared in package 'sw/device/silicon_creator/rom/e2e' defined by /nightly/current_run/opentitan/sw/device/silicon_creator/rom/e2e/BUILD
ERROR: Build did NOT complete successfully
_run_cmd -> had a non-zero return code of 1.
make: *** [/nightly/current_run/opentitan/hw/dv/tools/dvsim/sim.mk:58: sw_build] Error 1
rom_e2e_asm_init_prod 88320996336087988121603027753647453779853744865207565312079060533413789285598 None
---- STDERR ----
Another command (pid=443141) is running. Waiting for it to complete on the server (server_pid=260029)...
WARNING: Target pattern parsing failed.
ERROR: Skipping '//sw/device/silicon_creator/rom/e2e:empty_test_slot_a_fake_ecdsa_prod_key_0_sim_dv': no such target '//sw/device/silicon_creator/rom/e2e:empty_test_slot_a_fake_ecdsa_prod_key_0_sim_dv': target 'empty_test_slot_a_fake_ecdsa_prod_key_0_sim_dv' not declared in package 'sw/device/silicon_creator/rom/e2e' defined by /nightly/current_run/opentitan/sw/device/silicon_creator/rom/e2e/BUILD
ERROR: no such target '//sw/device/silicon_creator/rom/e2e:empty_test_slot_a_fake_ecdsa_prod_key_0_sim_dv': target 'empty_test_slot_a_fake_ecdsa_prod_key_0_sim_dv' not declared in package 'sw/device/silicon_creator/rom/e2e' defined by /nightly/current_run/opentitan/sw/device/silicon_creator/rom/e2e/BUILD
ERROR: Build did NOT complete successfully
_run_cmd -> had a non-zero return code of 1.
make: *** [/nightly/current_run/opentitan/hw/dv/tools/dvsim/sim.mk:58: sw_build] Error 1
rom_e2e_asm_init_prod_end 58454192803447208158459327272915309524506115942961325498295772218396647053518 None
---- STDOUT ----
---- STDERR ----
WARNING: Target pattern parsing failed.
ERROR: Skipping '//sw/device/silicon_creator/rom/e2e:empty_test_slot_a_fake_ecdsa_prod_key_0_sim_dv': no such target '//sw/device/silicon_creator/rom/e2e:empty_test_slot_a_fake_ecdsa_prod_key_0_sim_dv': target 'empty_test_slot_a_fake_ecdsa_prod_key_0_sim_dv' not declared in package 'sw/device/silicon_creator/rom/e2e' defined by /nightly/current_run/opentitan/sw/device/silicon_creator/rom/e2e/BUILD
ERROR: no such target '//sw/device/silicon_creator/rom/e2e:empty_test_slot_a_fake_ecdsa_prod_key_0_sim_dv': target 'empty_test_slot_a_fake_ecdsa_prod_key_0_sim_dv' not declared in package 'sw/device/silicon_creator/rom/e2e' defined by /nightly/current_run/opentitan/sw/device/silicon_creator/rom/e2e/BUILD
ERROR: Build did NOT complete successfully
_run_cmd -> had a non-zero return code of 1.
make: *** [/nightly/current_run/opentitan/hw/dv/tools/dvsim/sim.mk:58: sw_build] Error 1
rom_e2e_asm_init_rma 61844458158845702652235726055632578553768173471894512795617038167337302716159 None
---- STDOUT ----
---- STDERR ----
WARNING: Target pattern parsing failed.
ERROR: Skipping '//sw/device/silicon_creator/rom/e2e:empty_test_slot_a_fake_ecdsa_prod_key_0_sim_dv': no such target '//sw/device/silicon_creator/rom/e2e:empty_test_slot_a_fake_ecdsa_prod_key_0_sim_dv': target 'empty_test_slot_a_fake_ecdsa_prod_key_0_sim_dv' not declared in package 'sw/device/silicon_creator/rom/e2e' defined by /nightly/current_run/opentitan/sw/device/silicon_creator/rom/e2e/BUILD
ERROR: no such target '//sw/device/silicon_creator/rom/e2e:empty_test_slot_a_fake_ecdsa_prod_key_0_sim_dv': target 'empty_test_slot_a_fake_ecdsa_prod_key_0_sim_dv' not declared in package 'sw/device/silicon_creator/rom/e2e' defined by /nightly/current_run/opentitan/sw/device/silicon_creator/rom/e2e/BUILD
ERROR: Build did NOT complete successfully
_run_cmd -> had a non-zero return code of 1.
make: *** [/nightly/current_run/opentitan/hw/dv/tools/dvsim/sim.mk:58: sw_build] Error 1
rom_volatile_raw_unlock 46476446947492065845151018039037416454037108761608122685763093066985790993070 None
---- STDERR ----
Another command (pid=356774) is running. Waiting for it to complete on the server (server_pid=260029)...
WARNING: Target pattern parsing failed.
ERROR: Skipping '//sw/device/silicon_creator/rom/e2e:empty_test_slot_a_fake_ecdsa_test_key_0_sim_dv': no such target '//sw/device/silicon_creator/rom/e2e:empty_test_slot_a_fake_ecdsa_test_key_0_sim_dv': target 'empty_test_slot_a_fake_ecdsa_test_key_0_sim_dv' not declared in package 'sw/device/silicon_creator/rom/e2e' defined by /nightly/current_run/opentitan/sw/device/silicon_creator/rom/e2e/BUILD
ERROR: no such target '//sw/device/silicon_creator/rom/e2e:empty_test_slot_a_fake_ecdsa_test_key_0_sim_dv': target 'empty_test_slot_a_fake_ecdsa_test_key_0_sim_dv' not declared in package 'sw/device/silicon_creator/rom/e2e' defined by /nightly/current_run/opentitan/sw/device/silicon_creator/rom/e2e/BUILD
ERROR: Build did NOT complete successfully
_run_cmd -> had a non-zero return code of 1.
make: *** [/nightly/current_run/opentitan/hw/dv/tools/dvsim/sim.mk:58: sw_build] Error 1
rom_raw_unlock 86044703696650080319626717892261811559645501135708699806459270317310038802953 None
---- STDERR ----
Another command (pid=343053) is running. Waiting for it to complete on the server (server_pid=260029)...
Another command (pid=345602) is running. Waiting for it to complete on the server (server_pid=260029)...
WARNING: Target pattern parsing failed.
ERROR: Skipping '//sw/device/silicon_creator/rom/e2e:empty_test_slot_a_fake_ecdsa_test_key_0_sim_dv': no such target '//sw/device/silicon_creator/rom/e2e:empty_test_slot_a_fake_ecdsa_test_key_0_sim_dv': target 'empty_test_slot_a_fake_ecdsa_test_key_0_sim_dv' not declared in package 'sw/device/silicon_creator/rom/e2e' defined by /nightly/current_run/opentitan/sw/device/silicon_creator/rom/e2e/BUILD
ERROR: no such target '//sw/device/silicon_creator/rom/e2e:empty_test_slot_a_fake_ecdsa_test_key_0_sim_dv': target 'empty_test_slot_a_fake_ecdsa_test_key_0_sim_dv' not declared in package 'sw/device/silicon_creator/rom/e2e' defined by /nightly/current_run/opentitan/sw/device/silicon_creator/rom/e2e/BUILD
ERROR: Build did NOT complete successfully
_run_cmd -> had a non-zero return code of 1.
make: *** [/nightly/current_run/opentitan/hw/dv/tools/dvsim/sim.mk:58: sw_build] Error 1
rom_e2e_self_hash 83485936937132280428190806931462497957891452447727717501448245076150024565420 None
Another command (pid=345109) is running. Waiting for it to complete on the server (server_pid=260029)...
Another command (pid=343053) is running. Waiting for it to complete on the server (server_pid=260029)...
Another command (pid=345602) is running. Waiting for it to complete on the server (server_pid=260029)...
WARNING: Target pattern parsing failed.
ERROR: Skipping '//sw/device/silicon_creator/rom/e2e/release:rom_e2e_self_hash_test_sim_dv': no such target '//sw/device/silicon_creator/rom/e2e/release:rom_e2e_self_hash_test_sim_dv': target 'rom_e2e_self_hash_test_sim_dv' not declared in package 'sw/device/silicon_creator/rom/e2e/release' defined by /nightly/current_run/opentitan/sw/device/silicon_creator/rom/e2e/release/BUILD
ERROR: no such target '//sw/device/silicon_creator/rom/e2e/release:rom_e2e_self_hash_test_sim_dv': target 'rom_e2e_self_hash_test_sim_dv' not declared in package 'sw/device/silicon_creator/rom/e2e/release' defined by /nightly/current_run/opentitan/sw/device/silicon_creator/rom/e2e/release/BUILD
ERROR: Build did NOT complete successfully
_run_cmd -> had a non-zero return code of 1.
make: *** [/nightly/current_run/opentitan/hw/dv/tools/dvsim/sim.mk:58: sw_build] Error 1
UVM_ERROR @ * us: (cip_base_scoreboard.sv:575) scoreboard [scoreboard] On interface chip_reg_block, item had unexpected d_error value(predicted *, but saw *). 27 test runs
chip_csr_mem_rw_with_rand_reset 32489063900385935815013697812777699334110717773979661925645943960155184338130 224
TL item was: req: (cip_tl_seq_item@31576) { a_addr: 'h106a8 a_data: 'he352064e a_mask: 'hf a_size: 'h2 a_param: 'h0 a_source: 'h10 a_opcode: 'h4 a_user: 'h1a21f d_param: 'h0 d_source: 'h10 d_data: 'h0 d_size: 'h2 d_opcode: 'h1 d_error: 'h0 d_sink: 'h0 d_user: 'hd2a a_valid_delay: 'h0 d_valid_delay: 'h0 a_valid_len: 'h0 d_valid_len: 'h0 req_abort_after_a_valid_len: 'h0 rsp_abort_after_d_valid_len: 'h0 req_completed: 'h0 rsp_completed: 'h0 tl_intg_err_type: TlIntgErrNone max_ecc_errors: 'h3 }
Reasons for predicted error: '{"Fetch from CSR"} .
UVM_INFO @ 2191.758014 us: (uvm_report_catcher.svh:705) [UVM/REPORT/CATCHER]
--- UVM Report catcher Summary ---
chip_tl_errors 99175792447567306103815558751553502823932240672945279391992017009915638058920 217
TL item was: req: (cip_tl_seq_item@32570) { a_addr: 'h10448 a_data: 'hd5b00f78 a_mask: 'hf a_size: 'h2 a_param: 'h0 a_source: 'h8 a_opcode: 'h4 a_user: 'h1a9f9 d_param: 'h0 d_source: 'h8 d_data: 'h0 d_size: 'h2 d_opcode: 'h1 d_error: 'h0 d_sink: 'h0 d_user: 'hd2a a_valid_delay: 'h0 d_valid_delay: 'h0 a_valid_len: 'h0 d_valid_len: 'h0 req_abort_after_a_valid_len: 'h0 rsp_abort_after_d_valid_len: 'h0 req_completed: 'h0 rsp_completed: 'h0 tl_intg_err_type: TlIntgErrNone max_ecc_errors: 'h3 }
Reasons for predicted error: '{"Fetch from CSR"} .
UVM_INFO @ 2404.853380 us: (uvm_report_catcher.svh:705) [UVM/REPORT/CATCHER]
--- UVM Report catcher Summary ---
chip_csr_mem_rw_with_rand_reset 34506699287433932918160197117523131462521914007361535308517424336561885088448 224
TL item was: req: (cip_tl_seq_item@32332) { a_addr: 'h10348 a_data: 'h3cd02ef2 a_mask: 'hf a_size: 'h2 a_param: 'h0 a_source: 'h34 a_opcode: 'h4 a_user: 'h1b6fc d_param: 'h0 d_source: 'h34 d_data: 'h13 d_size: 'h2 d_opcode: 'h1 d_error: 'h0 d_sink: 'h0 d_user: 'hd7d a_valid_delay: 'h0 d_valid_delay: 'h0 a_valid_len: 'h0 d_valid_len: 'h0 req_abort_after_a_valid_len: 'h0 rsp_abort_after_d_valid_len: 'h0 req_completed: 'h0 rsp_completed: 'h0 tl_intg_err_type: TlIntgErrNone max_ecc_errors: 'h3 }
Reasons for predicted error: '{"Fetch from CSR"} .
UVM_INFO @ 1633.612440 us: (uvm_report_catcher.svh:705) [UVM/REPORT/CATCHER]
--- UVM Report catcher Summary ---
chip_tl_errors 77986700917903334905256170040137836412104606777385727267808443885278244630416 218
TL item was: req: (cip_tl_seq_item@131254) { a_addr: 'h10508 a_data: 'hee074335 a_mask: 'hf a_size: 'h2 a_param: 'h0 a_source: 'h36 a_opcode: 'h4 a_user: 'h18645 d_param: 'h0 d_source: 'h36 d_data: 'h0 d_size: 'h2 d_opcode: 'h1 d_error: 'h0 d_sink: 'h0 d_user: 'hd2a a_valid_delay: 'h0 d_valid_delay: 'h0 a_valid_len: 'h0 d_valid_len: 'h0 req_abort_after_a_valid_len: 'h0 rsp_abort_after_d_valid_len: 'h0 req_completed: 'h0 rsp_completed: 'h0 tl_intg_err_type: TlIntgErrNone max_ecc_errors: 'h3 }
Reasons for predicted error: '{"Fetch from CSR"} .
UVM_INFO @ 2919.344082 us: (uvm_report_catcher.svh:705) [UVM/REPORT/CATCHER]
--- UVM Report catcher Summary ---
chip_tl_errors 80856763747074163292491881516498304781466380638950964892026285729259287386499 217
TL item was: req: (cip_tl_seq_item@33058) { a_addr: 'h10538 a_data: 'h45f10f21 a_mask: 'hf a_size: 'h2 a_param: 'h0 a_source: 'h20 a_opcode: 'h4 a_user: 'h1ba10 d_param: 'h0 d_source: 'h20 d_data: 'h0 d_size: 'h2 d_opcode: 'h1 d_error: 'h0 d_sink: 'h0 d_user: 'hd2a a_valid_delay: 'h0 d_valid_delay: 'h0 a_valid_len: 'h0 d_valid_len: 'h0 req_abort_after_a_valid_len: 'h0 rsp_abort_after_d_valid_len: 'h0 req_completed: 'h0 rsp_completed: 'h0 tl_intg_err_type: TlIntgErrNone max_ecc_errors: 'h3 }
Reasons for predicted error: '{"Fetch from CSR"} .
UVM_INFO @ 2122.489740 us: (uvm_report_catcher.svh:705) [UVM/REPORT/CATCHER]
--- UVM Report catcher Summary ---
chip_tl_errors 59367248424375570270600290546367783367138928316273003615153462880662072797464 217
TL item was: req: (cip_tl_seq_item@34874) { a_addr: 'h10628 a_data: 'hb126f0c a_mask: 'hf a_size: 'h2 a_param: 'h0 a_source: 'h3a a_opcode: 'h4 a_user: 'h1928f d_param: 'h0 d_source: 'h3a d_data: 'h0 d_size: 'h2 d_opcode: 'h1 d_error: 'h0 d_sink: 'h0 d_user: 'hd2a a_valid_delay: 'h0 d_valid_delay: 'h0 a_valid_len: 'h0 d_valid_len: 'h0 req_abort_after_a_valid_len: 'h0 rsp_abort_after_d_valid_len: 'h0 req_completed: 'h0 rsp_completed: 'h0 tl_intg_err_type: TlIntgErrNone max_ecc_errors: 'h3 }
Reasons for predicted error: '{"Fetch from CSR"} .
UVM_INFO @ 2697.200540 us: (uvm_report_catcher.svh:705) [UVM/REPORT/CATCHER]
--- UVM Report catcher Summary ---
chip_tl_errors 102360160652287718668717285782626383977912641388629341685073941325637834714132 217
TL item was: req: (cip_tl_seq_item@31536) { a_addr: 'h10560 a_data: 'h59c04618 a_mask: 'hf a_size: 'h2 a_param: 'h0 a_source: 'h1a a_opcode: 'h4 a_user: 'h1a2cd d_param: 'h0 d_source: 'h1a d_data: 'h0 d_size: 'h2 d_opcode: 'h1 d_error: 'h0 d_sink: 'h0 d_user: 'hd2a a_valid_delay: 'h0 d_valid_delay: 'h0 a_valid_len: 'h0 d_valid_len: 'h0 req_abort_after_a_valid_len: 'h0 rsp_abort_after_d_valid_len: 'h0 req_completed: 'h0 rsp_completed: 'h0 tl_intg_err_type: TlIntgErrNone max_ecc_errors: 'h3 }
Reasons for predicted error: '{"Fetch from CSR"} .
UVM_INFO @ 3023.791438 us: (uvm_report_catcher.svh:705) [UVM/REPORT/CATCHER]
--- UVM Report catcher Summary ---
chip_tl_errors 38281448338500102068046047213633776565435120683547645709735532488390634858567 217
TL item was: req: (cip_tl_seq_item@34728) { a_addr: 'h10720 a_data: 'h733845e5 a_mask: 'hf a_size: 'h2 a_param: 'h0 a_source: 'h3d a_opcode: 'h4 a_user: 'h18161 d_param: 'h0 d_source: 'h3d d_data: 'h0 d_size: 'h2 d_opcode: 'h1 d_error: 'h0 d_sink: 'h0 d_user: 'hd2a a_valid_delay: 'h0 d_valid_delay: 'h0 a_valid_len: 'h0 d_valid_len: 'h0 req_abort_after_a_valid_len: 'h0 rsp_abort_after_d_valid_len: 'h0 req_completed: 'h0 rsp_completed: 'h0 tl_intg_err_type: TlIntgErrNone max_ecc_errors: 'h3 }
Reasons for predicted error: '{"Fetch from CSR"} .
UVM_INFO @ 1983.408060 us: (uvm_report_catcher.svh:705) [UVM/REPORT/CATCHER]
--- UVM Report catcher Summary ---
chip_tl_errors 48933750576923343952679442383003469144757168269022720244643885660674303277369 217
TL item was: req: (cip_tl_seq_item@32326) { a_addr: 'h106a4 a_data: 'h8c7ae4bf a_mask: 'hf a_size: 'h2 a_param: 'h0 a_source: 'h17 a_opcode: 'h4 a_user: 'h1ba60 d_param: 'h0 d_source: 'h17 d_data: 'h0 d_size: 'h2 d_opcode: 'h1 d_error: 'h0 d_sink: 'h0 d_user: 'hd2a a_valid_delay: 'h0 d_valid_delay: 'h0 a_valid_len: 'h0 d_valid_len: 'h0 req_abort_after_a_valid_len: 'h0 rsp_abort_after_d_valid_len: 'h0 req_completed: 'h0 rsp_completed: 'h0 tl_intg_err_type: TlIntgErrNone max_ecc_errors: 'h3 }
Reasons for predicted error: '{"Fetch from CSR"} .
UVM_INFO @ 2489.782272 us: (uvm_report_catcher.svh:705) [UVM/REPORT/CATCHER]
--- UVM Report catcher Summary ---
chip_tl_errors 93084393620978716050403300724405348066347651913083499216730895102134929308024 218
TL item was: req: (cip_tl_seq_item@103506) { a_addr: 'h10594 a_data: 'h357b94d6 a_mask: 'hf a_size: 'h2 a_param: 'h0 a_source: 'h6 a_opcode: 'h4 a_user: 'h18a19 d_param: 'h0 d_source: 'h6 d_data: 'h0 d_size: 'h2 d_opcode: 'h1 d_error: 'h0 d_sink: 'h0 d_user: 'hd2a a_valid_delay: 'h0 d_valid_delay: 'h0 a_valid_len: 'h0 d_valid_len: 'h0 req_abort_after_a_valid_len: 'h0 rsp_abort_after_d_valid_len: 'h0 req_completed: 'h0 rsp_completed: 'h0 tl_intg_err_type: TlIntgErrNone max_ecc_errors: 'h3 }
Reasons for predicted error: '{"Fetch from CSR"} .
UVM_INFO @ 2809.282425 us: (uvm_report_catcher.svh:705) [UVM/REPORT/CATCHER]
--- UVM Report catcher Summary ---
chip_tl_errors 34436771975737714001676294486941157583725620740375474870538058097623637791646 217
TL item was: req: (cip_tl_seq_item@34804) { a_addr: 'h10500 a_data: 'hdab0b41a a_mask: 'hf a_size: 'h2 a_param: 'h0 a_source: 'h1e a_opcode: 'h4 a_user: 'h192fb d_param: 'h0 d_source: 'h1e d_data: 'h0 d_size: 'h2 d_opcode: 'h1 d_error: 'h0 d_sink: 'h0 d_user: 'hd2a a_valid_delay: 'h0 d_valid_delay: 'h0 a_valid_len: 'h0 d_valid_len: 'h0 req_abort_after_a_valid_len: 'h0 rsp_abort_after_d_valid_len: 'h0 req_completed: 'h0 rsp_completed: 'h0 tl_intg_err_type: TlIntgErrNone max_ecc_errors: 'h3 }
Reasons for predicted error: '{"Fetch from CSR"} .
UVM_INFO @ 2184.591728 us: (uvm_report_catcher.svh:705) [UVM/REPORT/CATCHER]
--- UVM Report catcher Summary ---
chip_tl_errors 7257382847092764597689174790649879993329492424715988329838377979528747436998 218
TL item was: req: (cip_tl_seq_item@188550) { a_addr: 'h1072c a_data: 'h7c555bec a_mask: 'hf a_size: 'h2 a_param: 'h0 a_source: 'h25 a_opcode: 'h4 a_user: 'h1997e d_param: 'h0 d_source: 'h25 d_data: 'h0 d_size: 'h2 d_opcode: 'h1 d_error: 'h0 d_sink: 'h0 d_user: 'hd2a a_valid_delay: 'h0 d_valid_delay: 'h0 a_valid_len: 'h0 d_valid_len: 'h0 req_abort_after_a_valid_len: 'h0 rsp_abort_after_d_valid_len: 'h0 req_completed: 'h0 rsp_completed: 'h0 tl_intg_err_type: TlIntgErrNone max_ecc_errors: 'h3 }
Reasons for predicted error: '{"Fetch from CSR"} .
UVM_INFO @ 2897.358690 us: (uvm_report_catcher.svh:705) [UVM/REPORT/CATCHER]
--- UVM Report catcher Summary ---
chip_tl_errors 5610558885585291228786315760436406540318591246852620273260669754156188273041 217
TL item was: req: (cip_tl_seq_item@31576) { a_addr: 'h107b8 a_data: 'hf68a82f7 a_mask: 'hf a_size: 'h2 a_param: 'h0 a_source: 'h16 a_opcode: 'h4 a_user: 'h181d8 d_param: 'h0 d_source: 'h16 d_data: 'h0 d_size: 'h2 d_opcode: 'h1 d_error: 'h0 d_sink: 'h0 d_user: 'hd2a a_valid_delay: 'h0 d_valid_delay: 'h0 a_valid_len: 'h0 d_valid_len: 'h0 req_abort_after_a_valid_len: 'h0 rsp_abort_after_d_valid_len: 'h0 req_completed: 'h0 rsp_completed: 'h0 tl_intg_err_type: TlIntgErrNone max_ecc_errors: 'h3 }
Reasons for predicted error: '{"Fetch from CSR"} .
UVM_INFO @ 2521.187970 us: (uvm_report_catcher.svh:705) [UVM/REPORT/CATCHER]
--- UVM Report catcher Summary ---
chip_tl_errors 81983595407034292573258510216539038067178731607716827620937279695188010611069 217
TL item was: req: (cip_tl_seq_item@39638) { a_addr: 'h106b4 a_data: 'h68dd8c67 a_mask: 'hf a_size: 'h2 a_param: 'h0 a_source: 'he a_opcode: 'h4 a_user: 'h19ebc d_param: 'h0 d_source: 'he d_data: 'h0 d_size: 'h2 d_opcode: 'h1 d_error: 'h0 d_sink: 'h0 d_user: 'hd2a a_valid_delay: 'h0 d_valid_delay: 'h0 a_valid_len: 'h0 d_valid_len: 'h0 req_abort_after_a_valid_len: 'h0 rsp_abort_after_d_valid_len: 'h0 req_completed: 'h0 rsp_completed: 'h0 tl_intg_err_type: TlIntgErrNone max_ecc_errors: 'h3 }
Reasons for predicted error: '{"Fetch from CSR"} .
UVM_INFO @ 2489.234062 us: (uvm_report_catcher.svh:705) [UVM/REPORT/CATCHER]
--- UVM Report catcher Summary ---
chip_tl_errors 4589526613711891947264023935390611761243682716734323413445257098990893736421 218
TL item was: req: (cip_tl_seq_item@95456) { a_addr: 'h10408 a_data: 'hd98ab257 a_mask: 'hf a_size: 'h2 a_param: 'h0 a_source: 'h2 a_opcode: 'h4 a_user: 'h18136 d_param: 'h0 d_source: 'h2 d_data: 'h0 d_size: 'h2 d_opcode: 'h1 d_error: 'h0 d_sink: 'h0 d_user: 'hd2a a_valid_delay: 'h0 d_valid_delay: 'h0 a_valid_len: 'h0 d_valid_len: 'h0 req_abort_after_a_valid_len: 'h0 rsp_abort_after_d_valid_len: 'h0 req_completed: 'h0 rsp_completed: 'h0 tl_intg_err_type: TlIntgErrNone max_ecc_errors: 'h3 }
Reasons for predicted error: '{"Fetch from CSR"} .
UVM_INFO @ 2826.803122 us: (uvm_report_catcher.svh:705) [UVM/REPORT/CATCHER]
--- UVM Report catcher Summary ---
chip_tl_errors 103683151259317954012422029793064387562159129885806630227866147447840041246858 217
TL item was: req: (cip_tl_seq_item@36576) { a_addr: 'h10668 a_data: 'hb72e0a9c a_mask: 'hf a_size: 'h2 a_param: 'h0 a_source: 'h10 a_opcode: 'h4 a_user: 'h1ba37 d_param: 'h0 d_source: 'h10 d_data: 'h0 d_size: 'h2 d_opcode: 'h1 d_error: 'h0 d_sink: 'h0 d_user: 'hd2a a_valid_delay: 'h0 d_valid_delay: 'h0 a_valid_len: 'h0 d_valid_len: 'h0 req_abort_after_a_valid_len: 'h0 rsp_abort_after_d_valid_len: 'h0 req_completed: 'h0 rsp_completed: 'h0 tl_intg_err_type: TlIntgErrNone max_ecc_errors: 'h3 }
Reasons for predicted error: '{"Fetch from CSR"} .
UVM_INFO @ 2644.927912 us: (uvm_report_catcher.svh:705) [UVM/REPORT/CATCHER]
--- UVM Report catcher Summary ---
chip_tl_errors 89481578489307912887388356586542122069795629030457275735077364011070364138375 217
TL item was: req: (cip_tl_seq_item@33996) { a_addr: 'h1041c a_data: 'hcecf7d53 a_mask: 'hf a_size: 'h2 a_param: 'h0 a_source: 'h21 a_opcode: 'h4 a_user: 'h1a91e d_param: 'h0 d_source: 'h21 d_data: 'h0 d_size: 'h2 d_opcode: 'h1 d_error: 'h0 d_sink: 'h0 d_user: 'hd2a a_valid_delay: 'h0 d_valid_delay: 'h0 a_valid_len: 'h0 d_valid_len: 'h0 req_abort_after_a_valid_len: 'h0 rsp_abort_after_d_valid_len: 'h0 req_completed: 'h0 rsp_completed: 'h0 tl_intg_err_type: TlIntgErrNone max_ecc_errors: 'h3 }
Reasons for predicted error: '{"Fetch from CSR"} .
UVM_INFO @ 2037.078820 us: (uvm_report_catcher.svh:705) [UVM/REPORT/CATCHER]
--- UVM Report catcher Summary ---
chip_tl_errors 16355785172046764953122255376017167639308846382180750473067388559802429378955 217
TL item was: req: (cip_tl_seq_item@32188) { a_addr: 'h107e0 a_data: 'h83143623 a_mask: 'hf a_size: 'h2 a_param: 'h0 a_source: 'h12 a_opcode: 'h4 a_user: 'h1996d d_param: 'h0 d_source: 'h12 d_data: 'h0 d_size: 'h2 d_opcode: 'h1 d_error: 'h0 d_sink: 'h0 d_user: 'hd2a a_valid_delay: 'h0 d_valid_delay: 'h0 a_valid_len: 'h0 d_valid_len: 'h0 req_abort_after_a_valid_len: 'h0 rsp_abort_after_d_valid_len: 'h0 req_completed: 'h0 rsp_completed: 'h0 tl_intg_err_type: TlIntgErrNone max_ecc_errors: 'h3 }
Reasons for predicted error: '{"Fetch from CSR"} .
UVM_INFO @ 2957.331593 us: (uvm_report_catcher.svh:705) [UVM/REPORT/CATCHER]
--- UVM Report catcher Summary ---
chip_tl_errors 104748259965302971475522160615745111376752986155139826648894992158210874404056 217
TL item was: req: (cip_tl_seq_item@34916) { a_addr: 'h10358 a_data: 'h5ec60dd3 a_mask: 'hf a_size: 'h2 a_param: 'h0 a_source: 'h2c a_opcode: 'h4 a_user: 'h19278 d_param: 'h0 d_source: 'h2c d_data: 'h7b302573 d_size: 'h2 d_opcode: 'h1 d_error: 'h0 d_sink: 'h0 d_user: 'hd1f a_valid_delay: 'h0 d_valid_delay: 'h0 a_valid_len: 'h0 d_valid_len: 'h0 req_abort_after_a_valid_len: 'h0 rsp_abort_after_d_valid_len: 'h0 req_completed: 'h0 rsp_completed: 'h0 tl_intg_err_type: TlIntgErrNone max_ecc_errors: 'h3 }
Reasons for predicted error: '{"Fetch from CSR"} .
UVM_INFO @ 2779.415996 us: (uvm_report_catcher.svh:705) [UVM/REPORT/CATCHER]
--- UVM Report catcher Summary ---
chip_tl_errors 13333137868053565372580082050577787255256023160398475261228752363286903047162 217
TL item was: req: (cip_tl_seq_item@32136) { a_addr: 'h107ec a_data: 'hbdd00a67 a_mask: 'hf a_size: 'h2 a_param: 'h0 a_source: 'h25 a_opcode: 'h4 a_user: 'h18154 d_param: 'h0 d_source: 'h25 d_data: 'h0 d_size: 'h2 d_opcode: 'h1 d_error: 'h0 d_sink: 'h0 d_user: 'hd2a a_valid_delay: 'h0 d_valid_delay: 'h0 a_valid_len: 'h0 d_valid_len: 'h0 req_abort_after_a_valid_len: 'h0 rsp_abort_after_d_valid_len: 'h0 req_completed: 'h0 rsp_completed: 'h0 tl_intg_err_type: TlIntgErrNone max_ecc_errors: 'h3 }
Reasons for predicted error: '{"Fetch from CSR"} .
UVM_INFO @ 2816.160593 us: (uvm_report_catcher.svh:705) [UVM/REPORT/CATCHER]
--- UVM Report catcher Summary ---
chip_tl_errors 15989448007264123865197011961266528579490491190291664599591370037074511029199 217
TL item was: req: (cip_tl_seq_item@34284) { a_addr: 'h107c0 a_data: 'h421748cf a_mask: 'hf a_size: 'h2 a_param: 'h0 a_source: 'h2 a_opcode: 'h4 a_user: 'h181c0 d_param: 'h0 d_source: 'h2 d_data: 'h0 d_size: 'h2 d_opcode: 'h1 d_error: 'h0 d_sink: 'h0 d_user: 'hd2a a_valid_delay: 'h0 d_valid_delay: 'h0 a_valid_len: 'h0 d_valid_len: 'h0 req_abort_after_a_valid_len: 'h0 rsp_abort_after_d_valid_len: 'h0 req_completed: 'h0 rsp_completed: 'h0 tl_intg_err_type: TlIntgErrNone max_ecc_errors: 'h3 }
Reasons for predicted error: '{"Fetch from CSR"} .
UVM_INFO @ 2251.701175 us: (uvm_report_catcher.svh:705) [UVM/REPORT/CATCHER]
--- UVM Report catcher Summary ---
chip_tl_errors 94352120656774528330500552750665216121877880153863446907606260881691254228986 217
TL item was: req: (cip_tl_seq_item@35406) { a_addr: 'h10548 a_data: 'hb84cf8f9 a_mask: 'hf a_size: 'h2 a_param: 'h0 a_source: 'h21 a_opcode: 'h4 a_user: 'h1aecc d_param: 'h0 d_source: 'h21 d_data: 'h0 d_size: 'h2 d_opcode: 'h1 d_error: 'h0 d_sink: 'h0 d_user: 'hd2a a_valid_delay: 'h0 d_valid_delay: 'h0 a_valid_len: 'h0 d_valid_len: 'h0 req_abort_after_a_valid_len: 'h0 rsp_abort_after_d_valid_len: 'h0 req_completed: 'h0 rsp_completed: 'h0 tl_intg_err_type: TlIntgErrNone max_ecc_errors: 'h3 }
Reasons for predicted error: '{"Fetch from CSR"} .
UVM_INFO @ 1730.963430 us: (uvm_report_catcher.svh:705) [UVM/REPORT/CATCHER]
--- UVM Report catcher Summary ---
chip_tl_errors 34205825504589168885235462919353489497896877047816150388723049420029095352737 217
TL item was: req: (cip_tl_seq_item@33696) { a_addr: 'h10540 a_data: 'h654b6543 a_mask: 'hf a_size: 'h2 a_param: 'h0 a_source: 'h31 a_opcode: 'h4 a_user: 'h1ba69 d_param: 'h0 d_source: 'h31 d_data: 'h0 d_size: 'h2 d_opcode: 'h1 d_error: 'h0 d_sink: 'h0 d_user: 'hd2a a_valid_delay: 'h0 d_valid_delay: 'h0 a_valid_len: 'h0 d_valid_len: 'h0 req_abort_after_a_valid_len: 'h0 rsp_abort_after_d_valid_len: 'h0 req_completed: 'h0 rsp_completed: 'h0 tl_intg_err_type: TlIntgErrNone max_ecc_errors: 'h3 }
Reasons for predicted error: '{"Fetch from CSR"} .
UVM_INFO @ 2227.189134 us: (uvm_report_catcher.svh:705) [UVM/REPORT/CATCHER]
--- UVM Report catcher Summary ---
chip_tl_errors 41027104378536790712514349761927106222417900877345314528149361188988588146563 217
TL item was: req: (cip_tl_seq_item@34382) { a_addr: 'h10748 a_data: 'h6fdfe936 a_mask: 'hf a_size: 'h2 a_param: 'h0 a_source: 'h26 a_opcode: 'h4 a_user: 'h1a5d7 d_param: 'h0 d_source: 'h26 d_data: 'h0 d_size: 'h2 d_opcode: 'h1 d_error: 'h0 d_sink: 'h0 d_user: 'hd2a a_valid_delay: 'h0 d_valid_delay: 'h0 a_valid_len: 'h0 d_valid_len: 'h0 req_abort_after_a_valid_len: 'h0 rsp_abort_after_d_valid_len: 'h0 req_completed: 'h0 rsp_completed: 'h0 tl_intg_err_type: TlIntgErrNone max_ecc_errors: 'h3 }
Reasons for predicted error: '{"Fetch from CSR"} .
UVM_INFO @ 2303.053140 us: (uvm_report_catcher.svh:705) [UVM/REPORT/CATCHER]
--- UVM Report catcher Summary ---
chip_tl_errors 27654924091380612970961054216018886033567343154810430668349950687369035916106 217
TL item was: req: (cip_tl_seq_item@32228) { a_addr: 'h10580 a_data: 'h2e043c0a a_mask: 'hf a_size: 'h2 a_param: 'h0 a_source: 'he a_opcode: 'h4 a_user: 'h1a230 d_param: 'h0 d_source: 'he d_data: 'h0 d_size: 'h2 d_opcode: 'h1 d_error: 'h0 d_sink: 'h0 d_user: 'hd2a a_valid_delay: 'h0 d_valid_delay: 'h0 a_valid_len: 'h0 d_valid_len: 'h0 req_abort_after_a_valid_len: 'h0 rsp_abort_after_d_valid_len: 'h0 req_completed: 'h0 rsp_completed: 'h0 tl_intg_err_type: TlIntgErrNone max_ecc_errors: 'h3 }
Reasons for predicted error: '{"Fetch from CSR"} .
UVM_INFO @ 2819.960676 us: (uvm_report_catcher.svh:705) [UVM/REPORT/CATCHER]
--- UVM Report catcher Summary ---
chip_tl_errors 107824608067412127086588040243398963662002233284231493340327294634755068659844 218
TL item was: req: (cip_tl_seq_item@190158) { a_addr: 'h1076c a_data: 'hbd5404a5 a_mask: 'hf a_size: 'h2 a_param: 'h0 a_source: 'h9 a_opcode: 'h4 a_user: 'h1b18d d_param: 'h0 d_source: 'h9 d_data: 'h0 d_size: 'h2 d_opcode: 'h1 d_error: 'h0 d_sink: 'h0 d_user: 'hd2a a_valid_delay: 'h0 d_valid_delay: 'h0 a_valid_len: 'h0 d_valid_len: 'h0 req_abort_after_a_valid_len: 'h0 rsp_abort_after_d_valid_len: 'h0 req_completed: 'h0 rsp_completed: 'h0 tl_intg_err_type: TlIntgErrNone max_ecc_errors: 'h3 }
Reasons for predicted error: '{"Fetch from CSR"} .
UVM_INFO @ 2921.695220 us: (uvm_report_catcher.svh:705) [UVM/REPORT/CATCHER]
--- UVM Report catcher Summary ---
chip_tl_errors 13298989545650737908564878932830648833049208452717032934791575931070426205084 217
TL item was: req: (cip_tl_seq_item@35572) { a_addr: 'h104b0 a_data: 'ha9abf085 a_mask: 'hf a_size: 'h2 a_param: 'h0 a_source: 'h3e a_opcode: 'h4 a_user: 'h19929 d_param: 'h0 d_source: 'h3e d_data: 'h0 d_size: 'h2 d_opcode: 'h1 d_error: 'h0 d_sink: 'h0 d_user: 'hd2a a_valid_delay: 'h0 d_valid_delay: 'h0 a_valid_len: 'h0 d_valid_len: 'h0 req_abort_after_a_valid_len: 'h0 rsp_abort_after_d_valid_len: 'h0 req_completed: 'h0 rsp_completed: 'h0 tl_intg_err_type: TlIntgErrNone max_ecc_errors: 'h3 }
Reasons for predicted error: '{"Fetch from CSR"} .
UVM_INFO @ 3065.432945 us: (uvm_report_catcher.svh:705) [UVM/REPORT/CATCHER]
--- UVM Report catcher Summary ---
Job timed out after * minutes 12 test runs
chip_sw_rv_timer_systick_test 105217479262441582231262581214532524507112627411244290692305533340809386094197 None
chip_sw_adc_ctrl_sleep_debug_cable_wakeup 42848299255942402502053021194286227021700719536332127730578709169190024316196 None
chip_sw_alert_handler_lpg_sleep_mode_pings 103679265583231099034385867852082455745380964429507085503853942871826622014182 None
ate_bootstrap_disjoint 105206819013653044236646370168729520694199251724841685784362323765594099029671 None
chip_sw_rv_timer_systick_test 62045239914769247575757282573565759430736661146511801945552400527492913973460 None
chip_sw_adc_ctrl_sleep_debug_cable_wakeup 49637054075083496716250785164049512333047415096524913802035355782700786370102 None
chip_sw_alert_handler_lpg_sleep_mode_pings 17896199638062760603434373298241007550752840695052849968637916468318009886033 None
ate_bootstrap_disjoint 21762623651167756984355837469362759934056318662839152689733473771854533580573 None
chip_sw_rv_timer_systick_test 104868010901566819142093310194751947914342278676276136667122284332197293621125 None
chip_sw_adc_ctrl_sleep_debug_cable_wakeup 100559537042382267643262586752900293337858695661297451476699472932327932199525 None
chip_sw_alert_handler_lpg_sleep_mode_pings 43337685543412469973969671020472128454847317351523419184662314169372612215023 None
ate_bootstrap_disjoint 21762864606540378145189989829465717133330155865726357790421272562563869389277 None
UVM_ERROR @ * us: (sw_logger_if.sv:526) [lc_walkthrough_test_sim_dv(sw/device/lib/testing/test_framework/ottf_alerts.c:172)] ERROR: Alert * is asserted but not expected 9 test runs
chip_sw_lc_walkthrough_dev 12182097327330937373212737578606654422475313281053195401669512763806279996368 369
UVM_INFO @ 8599.058120 us: (uvm_report_catcher.svh:705) [UVM/REPORT/CATCHER]
--- UVM Report catcher Summary ---
chip_sw_lc_walkthrough_prod 108515814840118319262315119738052656921312393132638105107565339394050935951282 369
UVM_INFO @ 9217.827779 us: (uvm_report_catcher.svh:705) [UVM/REPORT/CATCHER]
--- UVM Report catcher Summary ---
chip_sw_lc_walkthrough_rma 13317606314619105381365393898310062794566471735496639793386780265834668976197 341
UVM_INFO @ 6271.102752 us: (uvm_report_catcher.svh:705) [UVM/REPORT/CATCHER]
--- UVM Report catcher Summary ---
chip_sw_lc_walkthrough_dev 102648864754265732866758810420037278849913633026726118314313259386751788515729 369
UVM_INFO @ 12055.670726 us: (uvm_report_catcher.svh:705) [UVM/REPORT/CATCHER]
--- UVM Report catcher Summary ---
chip_sw_lc_walkthrough_prod 63658232899265014469445689855727287397036861582899942759707781428414788796686 369
UVM_INFO @ 11086.333606 us: (uvm_report_catcher.svh:705) [UVM/REPORT/CATCHER]
--- UVM Report catcher Summary ---
chip_sw_lc_walkthrough_rma 28530620095742986166260566872223744282462391236747132754486845485807241082613 341
UVM_INFO @ 7278.867493 us: (uvm_report_catcher.svh:705) [UVM/REPORT/CATCHER]
--- UVM Report catcher Summary ---
chip_sw_lc_walkthrough_dev 38981454192751016648324946988652657879478003521589173613174230278467136494444 369
UVM_INFO @ 10303.301112 us: (uvm_report_catcher.svh:705) [UVM/REPORT/CATCHER]
--- UVM Report catcher Summary ---
chip_sw_lc_walkthrough_prod 98314114080640729439320113581494375114299289393242163074077183486622973480513 369
UVM_INFO @ 10372.696614 us: (uvm_report_catcher.svh:705) [UVM/REPORT/CATCHER]
--- UVM Report catcher Summary ---
chip_sw_lc_walkthrough_rma 34725244406910581776248124531132916055108977547404150180017494282340942873227 341
UVM_INFO @ 5683.153164 us: (uvm_report_catcher.svh:705) [UVM/REPORT/CATCHER]
--- UVM Report catcher Summary ---
UVM_ERROR @ * us: (chip_sw_base_vseq.sv:322) virtual_sequencer [chip_sw_base_vseq] SW TEST TIMED OUT. STATE: SwTestStatusInTest, TIMEOUT = * ns 9 test runs
chip_sw_hmac_oneshot 38242779477541246735494690113571273517352012477640650012727405714021783180929 310
UVM_INFO @ 12018.711436 us: (uvm_report_catcher.svh:705) [UVM/REPORT/CATCHER]
--- UVM Report catcher Summary ---
chip_sw_hmac_multistream 51688502103415941128121171743345964006580983700161944724894964651078545761773 310
UVM_INFO @ 12026.853466 us: (uvm_report_catcher.svh:705) [UVM/REPORT/CATCHER]
--- UVM Report catcher Summary ---
chip_sw_keymgr_sideload_otbn 114973102716718062679637508129315246797094785023466201211314390346718148067281 336
UVM_INFO @ 20026.357722 us: (uvm_report_catcher.svh:705) [UVM/REPORT/CATCHER]
--- UVM Report catcher Summary ---
chip_sw_hmac_oneshot 37658434882976542954114485089570697321534650701474302407805109812588643846655 310
UVM_INFO @ 12018.438738 us: (uvm_report_catcher.svh:705) [UVM/REPORT/CATCHER]
--- UVM Report catcher Summary ---
chip_sw_hmac_multistream 57973297542044188523496438892999256457714252669484087566286758235073855287766 310
UVM_INFO @ 12026.961059 us: (uvm_report_catcher.svh:705) [UVM/REPORT/CATCHER]
--- UVM Report catcher Summary ---
chip_sw_keymgr_sideload_otbn 63134706958507466264458225491832323494946265371035791477119663227553820133566 336
UVM_INFO @ 20018.320329 us: (uvm_report_catcher.svh:705) [UVM/REPORT/CATCHER]
--- UVM Report catcher Summary ---
chip_sw_hmac_oneshot 35991803795093434007360182037859965175953189781121939659277710751566323876488 310
UVM_INFO @ 12026.991646 us: (uvm_report_catcher.svh:705) [UVM/REPORT/CATCHER]
--- UVM Report catcher Summary ---
chip_sw_hmac_multistream 114471208189983047133291344361405532032114865705451170714198410209162265573882 310
UVM_INFO @ 12018.431734 us: (uvm_report_catcher.svh:705) [UVM/REPORT/CATCHER]
--- UVM Report catcher Summary ---
chip_sw_keymgr_sideload_otbn 46420285607491377387613997942725938926901127515709763619187981312327271803221 336
UVM_INFO @ 20018.650938 us: (uvm_report_catcher.svh:705) [UVM/REPORT/CATCHER]
--- UVM Report catcher Summary ---
Offending '(rstreqs[*] && (reset_cause == HwReq))' 8 test runs
chip_sw_pwrmgr_random_sleep_all_reset_reqs 112807038436597362193739316610816833627183905081548050339476306059195856034279 315
UVM_ERROR @ 6080.914500 us: (pwrmgr_rstreqs_sva_if.sv:49) [ASSERT FAILED] HwResetOn_A
UVM_INFO @ 6080.914500 us: (uvm_report_catcher.svh:705) [UVM/REPORT/CATCHER]
--- UVM Report catcher Summary ---
chip_sw_pwrmgr_deep_sleep_all_reset_reqs 63900013633141764743289709846984949315996621680588066679074125411174063505601 327
UVM_ERROR @ 10270.265000 us: (pwrmgr_rstreqs_sva_if.sv:49) [ASSERT FAILED] HwResetOn_A
UVM_INFO @ 10270.265000 us: (uvm_report_catcher.svh:705) [UVM/REPORT/CATCHER]
--- UVM Report catcher Summary ---
chip_sw_pwrmgr_deep_sleep_por_reset 4948641944569649709916434961576685181252135075884144702372896171168657260927 325
UVM_ERROR @ 7843.206500 us: (pwrmgr_rstreqs_sva_if.sv:49) [ASSERT FAILED] HwResetOn_A
UVM_INFO @ 7843.206500 us: (uvm_report_catcher.svh:705) [UVM/REPORT/CATCHER]
--- UVM Report catcher Summary ---
chip_sw_aon_timer_wdog_bite_reset 3716864816075663766800117057823131841409732227719376097176312212506714695844 319
UVM_ERROR @ 7580.674500 us: (pwrmgr_rstreqs_sva_if.sv:49) [ASSERT FAILED] HwResetOn_A
UVM_INFO @ 7580.674500 us: (uvm_report_catcher.svh:705) [UVM/REPORT/CATCHER]
--- UVM Report catcher Summary ---
chip_sw_pwrmgr_deep_sleep_all_reset_reqs 54658332394089032848605850961402554345551859819701774848664965209837406275092 314
UVM_ERROR @ 5460.770000 us: (pwrmgr_rstreqs_sva_if.sv:49) [ASSERT FAILED] HwResetOn_A
UVM_INFO @ 5460.770000 us: (uvm_report_catcher.svh:705) [UVM/REPORT/CATCHER]
--- UVM Report catcher Summary ---
chip_sw_pwrmgr_deep_sleep_por_reset 107063214263629593488439744298907422386427565828424480961193316257802233108225 325
UVM_ERROR @ 8086.535500 us: (pwrmgr_rstreqs_sva_if.sv:49) [ASSERT FAILED] HwResetOn_A
UVM_INFO @ 8086.535500 us: (uvm_report_catcher.svh:705) [UVM/REPORT/CATCHER]
--- UVM Report catcher Summary ---
chip_sw_pwrmgr_random_sleep_power_glitch_reset 93402805778239941831758478397809532149099985302936743296994652234975329044578 340
UVM_ERROR @ 14094.789000 us: (pwrmgr_rstreqs_sva_if.sv:49) [ASSERT FAILED] HwResetOn_A
UVM_INFO @ 14094.789000 us: (uvm_report_catcher.svh:705) [UVM/REPORT/CATCHER]
--- UVM Report catcher Summary ---
chip_sw_aon_timer_wdog_bite_reset 25627716790208473063426705876876870959334994821304054793461387750784666295822 319
UVM_ERROR @ 7918.638000 us: (pwrmgr_rstreqs_sva_if.sv:49) [ASSERT FAILED] HwResetOn_A
UVM_INFO @ 7918.638000 us: (uvm_report_catcher.svh:705) [UVM/REPORT/CATCHER]
--- UVM Report catcher Summary ---
Error-[NOA] Null object access 8 test runs
chip_sw_rv_dm_ndm_reset_req_when_cpu_halted 25886578758560194447007005436490246813725824822778500146583511419959548991375 327
src/lowrisc_dv_jtag_dmi_agent_0/jtag_rv_debugger.sv, 1108
The object at dereference depth 1 is being used before it was
constructed/allocated.
Please make sure that the object is allocated before using it.
rom_e2e_jtag_debug_test_unlocked0 8060374114837104994235249118713482230017691896155808692377611762874711648453 319
src/lowrisc_dv_jtag_dmi_agent_0/jtag_rv_debugger.sv, 1078
The object at dereference depth 1 is being used before it was
constructed/allocated.
Please make sure that the object is allocated before using it.
rom_e2e_jtag_debug_dev 56338212023256556926826524396319506253342312239205553353696363461487961304192 319
src/lowrisc_dv_jtag_dmi_agent_0/jtag_rv_debugger.sv, 1078
The object at dereference depth 1 is being used before it was
constructed/allocated.
Please make sure that the object is allocated before using it.
rom_e2e_jtag_debug_rma 33009417758301328406979228634823960795654326214588696223753688589442943320159 352
src/lowrisc_dv_jtag_dmi_agent_0/jtag_rv_debugger.sv, 903
The object at dereference depth 1 is being used before it was
constructed/allocated.
Please make sure that the object is allocated before using it.
rom_e2e_jtag_inject_test_unlocked0 5647550465266245404833440704426519976649547256365605490209646218396391234072 305
src/lowrisc_dv_jtag_dmi_agent_0/jtag_rv_debugger.sv, 1078
The object at dereference depth 1 is being used before it was
constructed/allocated.
Please make sure that the object is allocated before using it.
rom_e2e_jtag_inject_rma 16237153120854044786571778238158898764682724134159264061023324923317047644562 303
src/lowrisc_dv_jtag_dmi_agent_0/jtag_rv_debugger.sv, 1108
The object at dereference depth 1 is being used before it was
constructed/allocated.
Please make sure that the object is allocated before using it.
chip_sw_rv_dm_ndm_reset_req_when_cpu_halted 84046361586416338504421068537084170486257766913094682018651674141872141591059 327
src/lowrisc_dv_jtag_dmi_agent_0/jtag_rv_debugger.sv, 1108
The object at dereference depth 1 is being used before it was
constructed/allocated.
Please make sure that the object is allocated before using it.
chip_sw_rv_dm_ndm_reset_req_when_cpu_halted 22186800692141851967752263337422494781367426837409449906702329930955154626551 327
src/lowrisc_dv_jtag_dmi_agent_0/jtag_rv_debugger.sv, 1108
The object at dereference depth 1 is being used before it was
constructed/allocated.
Please make sure that the object is allocated before using it.
UVM_FATAL @ * us: (mem_bkdr_util.sv:658) [mem_bkdr_util[FlashBank0Data]] file empty_test_slot_a_corrupted_sim_dv.fake_ecdsa_prod_key_*.signed.*.scr.vmem could not be opened for r mode 6 test runs
rom_e2e_sigverify_always_a_bad_b_bad_prod 51759119300384284820504194679713731412069731535054844837313827880102995344221 368
UVM_INFO @ 10.400001 us: (uvm_report_catcher.svh:705) [UVM/REPORT/CATCHER]
--- UVM Report catcher Summary ---
rom_e2e_sigverify_always_a_bad_b_bad_prod_end 32914783390976160527234054380203777618687747070530014130394871820813900010089 368
UVM_INFO @ 10.300001 us: (uvm_report_catcher.svh:705) [UVM/REPORT/CATCHER]
--- UVM Report catcher Summary ---
rom_e2e_sigverify_always_a_bad_b_bad_rma 43839703123205019044088408092626773851893690955241241989386002497686126170009 367
UVM_INFO @ 10.300001 us: (uvm_report_catcher.svh:705) [UVM/REPORT/CATCHER]
--- UVM Report catcher Summary ---
rom_e2e_sigverify_always_a_bad_b_nothing_prod 71870658632477665366177850011475936378437729558707062817265180084489540598245 328
UVM_INFO @ 10.240001 us: (uvm_report_catcher.svh:705) [UVM/REPORT/CATCHER]
--- UVM Report catcher Summary ---
rom_e2e_sigverify_always_a_bad_b_nothing_prod_end 29980585824304496385195341484078465775834452012194065209397390068943006276851 328
UVM_INFO @ 10.260001 us: (uvm_report_catcher.svh:705) [UVM/REPORT/CATCHER]
--- UVM Report catcher Summary ---
rom_e2e_sigverify_always_a_bad_b_nothing_rma 103660604161682968753663735533112119058903858512428687872293382647647659894926 326
UVM_INFO @ 10.220001 us: (uvm_report_catcher.svh:705) [UVM/REPORT/CATCHER]
--- UVM Report catcher Summary ---
Offending '(!$fell((pwrmgr_data_o.done == MuBi4True)))' 5 test runs
chip_sw_pwrmgr_sleep_power_glitch_reset 49965262426704702881819005883135758408660602407854892884365572707228538632815 313
UVM_ERROR @ 3199.804051 us: (rom_ctrl.sv:586) [ASSERT FAILED] PwrmgrDataChk_A
UVM_INFO @ 3199.804051 us: (uvm_report_catcher.svh:705) [UVM/REPORT/CATCHER]
--- UVM Report catcher Summary ---
chip_sw_pwrmgr_random_sleep_power_glitch_reset 48669887602021496977185396900267709840838466813389232566719122139797649481858 381
UVM_ERROR @ 19357.733076 us: (rom_ctrl.sv:586) [ASSERT FAILED] PwrmgrDataChk_A
UVM_INFO @ 19357.733076 us: (uvm_report_catcher.svh:705) [UVM/REPORT/CATCHER]
--- UVM Report catcher Summary ---
chip_sw_pwrmgr_sleep_power_glitch_reset 52101586214213980819023534685017297766722026991698697901046796211369410984712 313
UVM_ERROR @ 3705.430560 us: (rom_ctrl.sv:586) [ASSERT FAILED] PwrmgrDataChk_A
UVM_INFO @ 3705.430560 us: (uvm_report_catcher.svh:705) [UVM/REPORT/CATCHER]
--- UVM Report catcher Summary ---
chip_sw_pwrmgr_random_sleep_power_glitch_reset 80654209599968048410250333280054050994804489398224966810775946730086308916093 328
UVM_ERROR @ 6304.694456 us: (rom_ctrl.sv:586) [ASSERT FAILED] PwrmgrDataChk_A
UVM_INFO @ 6304.694456 us: (uvm_report_catcher.svh:705) [UVM/REPORT/CATCHER]
--- UVM Report catcher Summary ---
chip_sw_pwrmgr_sleep_power_glitch_reset 39569831883529220672696685611228553144229506389330849029519926012364916693333 313
UVM_ERROR @ 3030.007680 us: (rom_ctrl.sv:586) [ASSERT FAILED] PwrmgrDataChk_A
UVM_INFO @ 3030.007680 us: (uvm_report_catcher.svh:705) [UVM/REPORT/CATCHER]
--- UVM Report catcher Summary ---
Offending '(!$fell(lc_ctrl_pkg::lc_tx_test_true_strict(lc_init_done_o)))' 4 test runs
chip_sw_otp_ctrl_escalation 43294080529219171772316959668246414358683776117504905142473429740942043629349 316
UVM_ERROR @ 3205.463074 us: (lc_ctrl.sv:884) [ASSERT FAILED] LcInitDoneSticky_A
UVM_INFO @ 3205.463074 us: (uvm_report_catcher.svh:705) [UVM/REPORT/CATCHER]
--- UVM Report catcher Summary ---
chip_sw_csrng_fuse_en_sw_app_read_test 21267591772981914692076945997753075681012131852885012311684459216756113672667 317
UVM_ERROR @ 2852.202650 us: (lc_ctrl.sv:884) [ASSERT FAILED] LcInitDoneSticky_A
UVM_INFO @ 2852.202650 us: (uvm_report_catcher.svh:705) [UVM/REPORT/CATCHER]
--- UVM Report catcher Summary ---
chip_sw_csrng_fuse_en_sw_app_read_test 39441202099720528622817226629775640013458874834321847810052983330852884215129 312
UVM_ERROR @ 2983.763220 us: (lc_ctrl.sv:884) [ASSERT FAILED] LcInitDoneSticky_A
UVM_INFO @ 2983.763220 us: (uvm_report_catcher.svh:705) [UVM/REPORT/CATCHER]
--- UVM Report catcher Summary ---
chip_sw_all_escalation_resets 1454482372627476362704034982731204762969012292905353897242427370625044306574 317
UVM_ERROR @ 3566.205546 us: (lc_ctrl.sv:884) [ASSERT FAILED] LcInitDoneSticky_A
UVM_INFO @ 3566.205546 us: (uvm_report_catcher.svh:705) [UVM/REPORT/CATCHER]
--- UVM Report catcher Summary ---
UVM_FATAL @ * us: (sec_cm_pkg.sv:48) [sec_cm_pkg::find_sec_cm_if_proxy] no proxy with path *rstmgr_aon.u_d0_spi_host*.leaf_rst_path 3 test runs
chip_sw_rstmgr_rst_cnsty_escalation 54563110666600609659476555129688837675769576006040914432771640513058993013638 301
UVM_INFO @ 10.100001 us: (uvm_report_catcher.svh:705) [UVM/REPORT/CATCHER]
--- UVM Report catcher Summary ---
chip_sw_rstmgr_rst_cnsty_escalation 22653750450629282228620727963886711562673710964106503915141312926099069225806 301
UVM_INFO @ 10.300001 us: (uvm_report_catcher.svh:705) [UVM/REPORT/CATCHER]
--- UVM Report catcher Summary ---
chip_sw_rstmgr_rst_cnsty_escalation 30744867353030278717505504575017299440090391049940802735381132642116412152719 301
UVM_INFO @ 10.160001 us: (uvm_report_catcher.svh:705) [UVM/REPORT/CATCHER]
--- UVM Report catcher Summary ---
UVM_ERROR @ * us: (sw_logger_if.sv:526) [flash_ctrl_lc_rw_en_test_sim_dv(sw/device/lib/testing/test_framework/ottf_alerts.c:172)] ERROR: Alert * is asserted but not expected 3 test runs
chip_sw_flash_ctrl_lc_rw_en 41921122399211524229470133464034012338916932116742516736006372310755363995433 309
UVM_INFO @ 2738.582289 us: (uvm_report_catcher.svh:705) [UVM/REPORT/CATCHER]
--- UVM Report catcher Summary ---
chip_sw_flash_ctrl_lc_rw_en 21933763081862845899496630861705885930271236587299321371104289129846959262468 309
UVM_INFO @ 3146.299113 us: (uvm_report_catcher.svh:705) [UVM/REPORT/CATCHER]
--- UVM Report catcher Summary ---
chip_sw_flash_ctrl_lc_rw_en 31171642299629359234335892299677294986937083195089152299001427541310471541905 309
UVM_INFO @ 2764.748640 us: (uvm_report_catcher.svh:705) [UVM/REPORT/CATCHER]
--- UVM Report catcher Summary ---
UVM_ERROR @ * us: (sw_logger_if.sv:526) [otp_ctrl_lc_signals_test_sim_dv(sw/device/lib/testing/otp_ctrl_testutils.c:39)] Expected a DAI error for access to * 3 test runs
chip_sw_otp_ctrl_lc_signals_rma 47545349027542403191464173715014479097194558852807705507633580148654116671630 342
UVM_INFO @ 6524.964735 us: (uvm_report_catcher.svh:705) [UVM/REPORT/CATCHER]
--- UVM Report catcher Summary ---
chip_sw_otp_ctrl_lc_signals_rma 95408346340778300967609058537787177118994860720562280608244571623410243218108 342
UVM_INFO @ 7913.912216 us: (uvm_report_catcher.svh:705) [UVM/REPORT/CATCHER]
--- UVM Report catcher Summary ---
chip_sw_otp_ctrl_lc_signals_rma 76206719084871797863105131605924217185178263669389136123701668849285973064112 342
UVM_INFO @ 5606.630857 us: (uvm_report_catcher.svh:705) [UVM/REPORT/CATCHER]
--- UVM Report catcher Summary ---
Offending '((~rst_ni) === (~seed_en_q))' 3 test runs
chip_sw_pwrmgr_full_aon_reset 109943212771031350543701477014828995131611589556165158931834735930615204463425 324
UVM_ERROR @ 6711.642876 us: (otbn_rnd.sv:233) [ASSERT FAILED] UrndNoReseedOnReset_A
UVM_INFO @ 6711.642876 us: (uvm_report_catcher.svh:705) [UVM/REPORT/CATCHER]
--- UVM Report catcher Summary ---
chip_sw_pwrmgr_full_aon_reset 1700955429742711223425165439148819281782997663483015305933410127327161075985 322
UVM_ERROR @ 5250.703080 us: (otbn_rnd.sv:233) [ASSERT FAILED] UrndNoReseedOnReset_A
UVM_INFO @ 5250.703080 us: (uvm_report_catcher.svh:705) [UVM/REPORT/CATCHER]
--- UVM Report catcher Summary ---
chip_sw_pwrmgr_full_aon_reset 51245477177346241098431374968240773916217771559044499099273168433156479372899 303
UVM_ERROR @ 2335.580375 us: (otbn_rnd.sv:233) [ASSERT FAILED] UrndNoReseedOnReset_A
UVM_INFO @ 2335.580375 us: (uvm_report_catcher.svh:705) [UVM/REPORT/CATCHER]
--- UVM Report catcher Summary ---
UVM_ERROR @ * us: (sw_logger_if.sv:526) [clkmgr_jitter_frequency_test_sim_dv(sw/device/lib/testing/test_framework/ottf_alerts.c:172)] ERROR: Alert * is asserted but not expected 3 test runs
chip_sw_clkmgr_jitter_frequency 18231881153090362072509991783096503440598623328980553719965418973877472654381 343
UVM_INFO @ 4409.953928 us: (uvm_report_catcher.svh:705) [UVM/REPORT/CATCHER]
--- UVM Report catcher Summary ---
chip_sw_clkmgr_jitter_frequency 47926538154193828774281587026715604475711740772810286553967742931828218609622 343
UVM_INFO @ 3763.824533 us: (uvm_report_catcher.svh:705) [UVM/REPORT/CATCHER]
--- UVM Report catcher Summary ---
chip_sw_clkmgr_jitter_frequency 57000775412728905031260682248032725869389017199307829219768416633640407607074 343
UVM_INFO @ 3924.578068 us: (uvm_report_catcher.svh:705) [UVM/REPORT/CATCHER]
--- UVM Report catcher Summary ---
UVM_ERROR @ * us: (cip_base_vseq.sv:660) [chip_rv_dm_lc_disabled_vseq] Check failed masked_data == exp_data (* [*] vs * [*]) addr * read out mismatch 3 test runs
chip_rv_dm_lc_disabled 53679626410731280064173084603637012889578450715496169818719381343003982056774 235
UVM_INFO @ 5343.805681 us: (uvm_report_catcher.svh:705) [UVM/REPORT/CATCHER]
--- UVM Report catcher Summary ---
chip_rv_dm_lc_disabled 83538235957010318567855690496571578918789070393810518644040714937358580731389 235
UVM_INFO @ 5334.196133 us: (uvm_report_catcher.svh:705) [UVM/REPORT/CATCHER]
--- UVM Report catcher Summary ---
chip_rv_dm_lc_disabled 37690164553818460307650153834217757574344591621325060436121307018479589337159 225
UVM_INFO @ 3148.856451 us: (uvm_report_catcher.svh:705) [UVM/REPORT/CATCHER]
--- UVM Report catcher Summary ---
UVM_ERROR @ * us: (chip_sw_power_idle_load_vseq.sv:91) virtual_sequencer [chip_sw_power_idle_load_vseq] PWMCH* : pkt* Clock period is wrong. rcv : * exp : * 3 test runs
chip_sw_power_idle_load 42606401560782271902003448728865220222769854940692304526904037867841752179947 312
UVM_INFO @ 4067.144000 us: (uvm_report_catcher.svh:705) [UVM/REPORT/CATCHER]
--- UVM Report catcher Summary ---
chip_sw_power_idle_load 10625087349959342508092229747244799459419150563119746002478291029480458368457 314
UVM_INFO @ 3581.077000 us: (uvm_report_catcher.svh:705) [UVM/REPORT/CATCHER]
--- UVM Report catcher Summary ---
chip_sw_power_idle_load 45647228591594465703862730715856890348315432194267924998471788605876902509675 312
UVM_INFO @ 3231.825500 us: (uvm_report_catcher.svh:705) [UVM/REPORT/CATCHER]
--- UVM Report catcher Summary ---
UVM_ERROR @ * us: (chip_sw_power_sleep_load_vseq.sv:114) virtual_sequencer [chip_sw_power_sleep_load_vseq] PWMCH* : pkt* Clock period is wrong. rcv : * exp : * 3 test runs
chip_sw_power_sleep_load 33078057406196360691571986475996990399762753930140386534439422016718119773322 318
UVM_INFO @ 3432.865000 us: (uvm_report_catcher.svh:705) [UVM/REPORT/CATCHER]
--- UVM Report catcher Summary ---
chip_sw_power_sleep_load 83948351216806110610195323896910707083705749098457923974982269914204459058827 318
UVM_INFO @ 2926.734000 us: (uvm_report_catcher.svh:705) [UVM/REPORT/CATCHER]
--- UVM Report catcher Summary ---
chip_sw_power_sleep_load 25228849305209935279431570787250037282017334657456547641304831264671500643197 318
UVM_INFO @ 2945.390000 us: (uvm_report_catcher.svh:705) [UVM/REPORT/CATCHER]
--- UVM Report catcher Summary ---
UVM_ERROR @ * us: (sw_logger_if.sv:526) [ast_clk_rst_inputs_sim_dv(sw/device/lib/testing/autogen/isr_testutils.c:41)] CHECK-fail: Only adc_ctrl IRQ * expected to fire. Actual IRQ state = * 3 test runs
chip_sw_ast_clk_rst_inputs 24427479978474289547460943109215249299307651994871740369139799736568443968042 327
UVM_INFO @ 12128.951520 us: (uvm_report_catcher.svh:705) [UVM/REPORT/CATCHER]
--- UVM Report catcher Summary ---
chip_sw_ast_clk_rst_inputs 95117546398823139247166133315240853011889907124814503323136528408944406227268 327
UVM_INFO @ 10118.760839 us: (uvm_report_catcher.svh:705) [UVM/REPORT/CATCHER]
--- UVM Report catcher Summary ---
chip_sw_ast_clk_rst_inputs 7840262854589516610491472045304265318668610583495130182442594448830528485516 327
UVM_INFO @ 12409.673867 us: (uvm_report_catcher.svh:705) [UVM/REPORT/CATCHER]
--- UVM Report catcher Summary ---
UVM_FATAL @ * us: (csr_utils_pkg.sv:614) [csr_utils_pkg::csr_spinwait.isolation_fork] timeout chip_reg_block.spi_device.cmd_info_*.opcode (addr=*, Comparison=CompareOpEq, exp_data=*, call_count=1) 3 test runs
ate_bootstrap_flash_erase 41657311130452330729802161411235865948919959991020260578931469762782676303854 272
UVM_INFO @ 10010.240001 us: (uvm_report_catcher.svh:705) [UVM/REPORT/CATCHER]
--- UVM Report catcher Summary ---
ate_bootstrap_flash_erase 61664113813660965759643790793298740525401472990414243664948909694687805945720 272
UVM_INFO @ 10010.100001 us: (uvm_report_catcher.svh:705) [UVM/REPORT/CATCHER]
--- UVM Report catcher Summary ---
ate_bootstrap_flash_erase 86954354100303541724038534781382399949474130956732156086892425570853034915151 272
UVM_INFO @ 10010.260001 us: (uvm_report_catcher.svh:705) [UVM/REPORT/CATCHER]
--- UVM Report catcher Summary ---
UVM_FATAL @ * us: (mem_bkdr_util.sv:658) [mem_bkdr_util[FlashBank0Data]] file empty_test_slot_b_corrupted_sim_dv.fake_ecdsa_prod_key_*.signed.*.scr.vmem could not be opened for r mode 3 test runs
rom_e2e_sigverify_always_a_nothing_b_bad_prod 23252308595510982865833884288489922613669082546040972619298502977622939336143 326
UVM_INFO @ 10.140001 us: (uvm_report_catcher.svh:705) [UVM/REPORT/CATCHER]
--- UVM Report catcher Summary ---
rom_e2e_sigverify_always_a_nothing_b_bad_prod_end 60182959430876077910422799047025025593321779559213567741969522799165035509413 328
UVM_INFO @ 10.140001 us: (uvm_report_catcher.svh:705) [UVM/REPORT/CATCHER]
--- UVM Report catcher Summary ---
rom_e2e_sigverify_always_a_nothing_b_bad_rma 102492180266854739011870796859411272678987303288630963092753748554910953554969 328
UVM_INFO @ 10.280001 us: (uvm_report_catcher.svh:705) [UVM/REPORT/CATCHER]
--- UVM Report catcher Summary ---
Offending '$stable(key_data_i)' 3 test runs
rom_keymgr_functest 20658870114262834960694614879364210579586566649192369363701065774188746605995 327
UVM_ERROR @ 4982.295925 us: (kmac_core.sv:464) [ASSERT FAILED] KeyDataStableWhenValid_M
UVM_INFO @ 4982.295925 us: (uvm_report_catcher.svh:705) [UVM/REPORT/CATCHER]
--- UVM Report catcher Summary ---
rom_keymgr_functest 95026270375790079241430873623371108777474118734818607934599244656678695095089 327
UVM_ERROR @ 5590.205334 us: (kmac_core.sv:464) [ASSERT FAILED] KeyDataStableWhenValid_M
UVM_INFO @ 5590.205334 us: (uvm_report_catcher.svh:705) [UVM/REPORT/CATCHER]
--- UVM Report catcher Summary ---
rom_keymgr_functest 111064061336935902667968032450618695961050152113013731494063681383942357875604 327
UVM_ERROR @ 5137.274885 us: (kmac_core.sv:464) [ASSERT FAILED] KeyDataStableWhenValid_M
UVM_INFO @ 5137.274885 us: (uvm_report_catcher.svh:705) [UVM/REPORT/CATCHER]
--- UVM Report catcher Summary ---
UVM_ERROR @ * us: (sw_logger_if.sv:526) [spi_passthrough_test_sim_dv(sw/device/tests/sim_dv/spi_passthrough_test.c:382)] CHECK-fail: irq == kDtSpiDeviceIrqUploadCmdfifoNotEmpty 2 test runs
chip_sw_spi_device_pass_through_collision 81554994409923148060102669190552460204292393600714538065922647260700150314522 327
UVM_INFO @ 3418.762074 us: (uvm_report_catcher.svh:705) [UVM/REPORT/CATCHER]
--- UVM Report catcher Summary ---
chip_sw_spi_device_pass_through_collision 62570529489013877208905839285133833417397172286244482555433887265125422487426 327
UVM_INFO @ 3343.792856 us: (uvm_report_catcher.svh:705) [UVM/REPORT/CATCHER]
--- UVM Report catcher Summary ---
UVM_FATAL @ * us: (mem_bkdr_util.sv:658) [mem_bkdr_util[FlashBank0Data]] file empty_test_slot_a_corrupted_sim_dv.fake_ecdsa_test_key_*.signed.*.scr.vmem could not be opened for r mode 2 test runs
rom_e2e_sigverify_always_a_bad_b_bad_test_unlocked0 66186810448407997514668318605562726162216606031789253462558714457775639344778 365
UVM_INFO @ 10.320001 us: (uvm_report_catcher.svh:705) [UVM/REPORT/CATCHER]
--- UVM Report catcher Summary ---
rom_e2e_sigverify_always_a_bad_b_nothing_test_unlocked0 47422022867322995216429375234521336243233047369252988919733526033784486617112 325
UVM_INFO @ 10.340001 us: (uvm_report_catcher.svh:705) [UVM/REPORT/CATCHER]
--- UVM Report catcher Summary ---
UVM_FATAL @ * us: (mem_bkdr_util.sv:658) [mem_bkdr_util[FlashBank0Data]] file empty_test_slot_a_corrupted_sim_dv.fake_ecdsa_dev_key_*.signed.*.scr.vmem could not be opened for r mode 2 test runs
rom_e2e_sigverify_always_a_bad_b_bad_dev 79675474607096077988960089033865892722730176959665705199883743477009837614401 366
UVM_INFO @ 10.260001 us: (uvm_report_catcher.svh:705) [UVM/REPORT/CATCHER]
--- UVM Report catcher Summary ---
rom_e2e_sigverify_always_a_bad_b_nothing_dev 21574172927925892395311254276721609318385938372520122785497889775823171924307 328
UVM_INFO @ 10.180001 us: (uvm_report_catcher.svh:705) [UVM/REPORT/CATCHER]
--- UVM Report catcher Summary ---
UVM_ERROR @ * us: (sw_logger_if.sv:526) [rom_e2e_keymgr_init_otp_meas_sim_dv(sw/device/silicon_creator/rom/e2e/keymgr/rom_e2e_keymgr_init_test.c:38)] DIF-fail: dif_otp_ctrl_get_digest( &otp_ctrl, kDifOtpCtrlPartitionCreatorSwCfg, &creator_digest) returns * 2 test runs
rom_e2e_keymgr_init_rom_ext_meas 12766871215813624941653595729015099240160867501604654864159501785618426380976 319
UVM_INFO @ 17442.891587 us: (uvm_report_catcher.svh:705) [UVM/REPORT/CATCHER]
--- UVM Report catcher Summary ---
rom_e2e_keymgr_init_rom_ext_meas 56160483685388431175619542317500519934106169201714808075487362971613405448527 319
UVM_INFO @ 16476.611088 us: (uvm_report_catcher.svh:705) [UVM/REPORT/CATCHER]
--- UVM Report catcher Summary ---
UVM_ERROR @ * us: (sw_logger_if.sv:526) [all_escalation_resets_test_sim_dv(w/device/tests/sim_dv/all_escalation_resets_test.c:635)] CHECK-fail: Unexpected mtval: expected *, got * 2 test runs
chip_sw_all_escalation_resets 54442618758190441542002078357717189711698836748306913219312891855801920343362 317
UVM_INFO @ 3661.827900 us: (uvm_report_catcher.svh:705) [UVM/REPORT/CATCHER]
--- UVM Report catcher Summary ---
chip_sw_all_escalation_resets 71555814534249582998048380639835423251958356690120976804750509337407163552893 317
UVM_INFO @ 3054.216180 us: (uvm_report_catcher.svh:705) [UVM/REPORT/CATCHER]
--- UVM Report catcher Summary ---
UVM_FATAL @ * us: (mem_bkdr_util.sv:658) [mem_bkdr_util[Otp]] file otp_img_test_unlocked0_manuf_empty.*.vmem could not be opened for r mode 1 test run
chip_sw_otp_ctrl_rot_auth_config 56612089255827585270654568865530265805384719619263548168461755206893044725644 282
UVM_INFO @ 0.000000 us: (uvm_report_catcher.svh:705) [UVM/REPORT/CATCHER]
--- UVM Report catcher Summary ---
UVM_ERROR @ * us: (sw_logger_if.sv:526) [alert_test_sim_dv(hw/top_earlgrey/sw/autogen/tests/alert_test.c:352)] CHECK-fail: Expect alert *! 1 test run
chip_sw_alert_test 97249716775129085088476072813091045234712931100501232710676342952458171167440 307
UVM_INFO @ 2646.935960 us: (uvm_report_catcher.svh:705) [UVM/REPORT/CATCHER]
--- UVM Report catcher Summary ---
UVM_FATAL @ * us: (mem_bkdr_util.sv:658) [mem_bkdr_util[FlashBank0Data]] file empty_test_slot_b_corrupted_sim_dv.fake_ecdsa_test_key_*.signed.*.scr.vmem could not be opened for r mode 1 test run
rom_e2e_sigverify_always_a_nothing_b_bad_test_unlocked0 11402932421313647806716117252128665298075430970423702541734126042655520687012 325
UVM_INFO @ 10.320001 us: (uvm_report_catcher.svh:705) [UVM/REPORT/CATCHER]
--- UVM Report catcher Summary ---
UVM_FATAL @ * us: (mem_bkdr_util.sv:658) [mem_bkdr_util[FlashBank0Data]] file empty_test_slot_b_corrupted_sim_dv.fake_ecdsa_dev_key_*.signed.*.scr.vmem could not be opened for r mode 1 test run
rom_e2e_sigverify_always_a_nothing_b_bad_dev 26732609366609596809118166343848879707498832497011803391837358139183944808858 326
UVM_INFO @ 10.100001 us: (uvm_report_catcher.svh:705) [UVM/REPORT/CATCHER]
--- UVM Report catcher Summary ---
UVM_ERROR @ * us: (chip_sw_spi_passthrough_collision_vseq.sv:183) virtual_sequencer [chip_sw_spi_passthrough_collision_vseq] Compare mismatch 1 test run
chip_sw_spi_device_pass_through_collision 63376938256285733882786469804109887597198204691326787735117216437980077481643 329
host_rsp:
-------------------------------------------------------------------------
Name Type Size Value
-------------------------------------------------------------------------
UVM_FATAL @ * us: (chip_sw_base_vseq.sv:864) virtual_sequencer [chip_sw_lc_walkthrough_testunlocks_vseq] max attempt reached to get lc status LcExtClockSwitched! 1 test run
chip_sw_lc_walkthrough_testunlocks 91809218931107948408003713904526796487061140759026257981337374925647921585830 445
UVM_INFO @ 42691.801089 us: (uvm_report_catcher.svh:705) [UVM/REPORT/CATCHER]
--- UVM Report catcher Summary ---
UVM_ERROR @ * us: (sw_logger_if.sv:526) [alert_test_sim_dv(hw/top_earlgrey/sw/autogen/tests/alert_test.c:382)] CHECK-fail: Expect alert *! 1 test run
chip_sw_alert_test 3308893305494687649346471556550864380559576070842661235580505507219294643118 307
UVM_INFO @ 3065.649288 us: (uvm_report_catcher.svh:705) [UVM/REPORT/CATCHER]
--- UVM Report catcher Summary ---
UVM_FATAL @ * us: (chip_sw_base_vseq.sv:945) [chip_sw_lc_volatile_raw_unlock_vseq] Check failed (!(transition_ctrl & (* << *))) VOLATILE_RAW_UNLOCK is not expected to be supported by this top-level. Check the SecVolatileRawUnlockEn parameter configuration. 1 test run
chip_sw_lc_ctrl_volatile_raw_unlock 78892471472225179296841529706026836240060565363370843531065175924829626202456 307
UVM_INFO @ 2328.093568 us: (uvm_report_catcher.svh:705) [UVM/REPORT/CATCHER]
--- UVM Report catcher Summary ---
Offending '(pend_req[h2d.a_source].pend == *)' 1 test run
chip_sw_pwrmgr_random_sleep_all_reset_reqs 5657271219987324442159992809692923735800363761438209628807807368319485836173 374
UVM_ERROR @ 12764.027472 us: (tlul_assert.sv:314) [ASSERT FAILED] pendingReqPerSrc_M
UVM_INFO @ 12764.027472 us: (uvm_report_catcher.svh:705) [UVM/REPORT/CATCHER]
--- UVM Report catcher Summary ---
UVM_ERROR @ * us: (sw_logger_if.sv:526) [alert_test_sim_dv(hw/top_earlgrey/sw/autogen/tests/alert_test.c:307)] CHECK-fail: Expect alert *! 1 test run
chip_sw_alert_test 89085632925393586629930472933169867352809752523654948186871526883040075487562 307
UVM_INFO @ 3772.053100 us: (uvm_report_catcher.svh:705) [UVM/REPORT/CATCHER]
--- UVM Report catcher Summary ---
UVM_ERROR @ * us: (sw_logger_if.sv:526) [rom_e2e_keymgr_init_otp_invalid_meas_sim_dv(sw/device/silicon_creator/rom/e2e/keymgr/rom_e2e_keymgr_init_test.c:38)] DIF-fail: dif_otp_ctrl_get_digest( &otp_ctrl, kDifOtpCtrlPartitionCreatorSwCfg, &creator_digest) returns * 1 test run
rom_e2e_keymgr_init_rom_ext_invalid_meas 65398114308470555358821882398965371525562684129426129394601787174095448504529 319
UVM_INFO @ 16203.519520 us: (uvm_report_catcher.svh:705) [UVM/REPORT/CATCHER]
--- UVM Report catcher Summary ---
Offending '(reset_cause == HwReq)' 1 test run
chip_sw_sensor_ctrl_alert 81078025577755860140306431191214629939797748909440267384234527420814909897464 331
UVM_ERROR @ 5017.926564 us: (pwrmgr_rstreqs_sva_if.sv:98) [ASSERT FAILED] SwResetSetCause_A
UVM_INFO @ 5017.926564 us: (uvm_report_catcher.svh:705) [UVM/REPORT/CATCHER]
--- UVM Report catcher Summary ---
UVM_FATAL @ * us: (chip_sw_base_vseq.sv:864) virtual_sequencer [chip_sw_lc_ctrl_transition_vseq] max attempt reached to get lc status LcExtClockSwitched! 1 test run
chip_sw_lc_ctrl_transition 30482664819390849863208610405269334499849428754051708772981363768473602185254 305
UVM_INFO @ 26049.110715 us: (uvm_report_catcher.svh:705) [UVM/REPORT/CATCHER]
--- UVM Report catcher Summary ---
UVM_ERROR @ * us: (cip_base_vseq.sv:923) virtual_sequencer [chip_sw_all_escalation_resets_vseq] Alert usbdev_fatal_fault fired unexpectedly. 1 test run
chip_sw_all_escalation_resets 100555005340084659969321989841666326018912071568493642306754902463208548026372 316
UVM_INFO @ 3607.971654 us: (uvm_report_catcher.svh:705) [UVM/REPORT/CATCHER]
--- UVM Report catcher Summary ---