Simulation Results: aes/masked

 
20/06/2026 02:47:04 DVSim: v1.49.0 sha: c0022c1 json Branch: master Tool: xcelium [unknown]
Coverage statistics
  • Total
  • 97.37 %
  • code
  • 96.59 %
  • assert
  • 98.38 %
  • func
  • 97.13 %
  • block
  • 96.91 %
  • line
  • 97.79 %
  • branch
  • 92.71 %
  • toggle
  • 98.08 %
  • FSM
  • 97.78 %
Validation stages
V1
100.00%
V2
97.25%
V2S
93.37%
V3
0.00%
Testpoint Test Max Runtime Sim Time Pass Total %
wake_up 1 1 100.00
aes_wake_up 3.000s 94.447us 1 1 100.00
smoke 10 10 100.00
aes_smoke 7.000s 710.310us 10 10 100.00
csr_hw_reset 1 1 100.00
aes_csr_hw_reset 18.000s 67.394us 1 1 100.00
csr_rw 5 5 100.00
aes_csr_rw 2.000s 118.745us 5 5 100.00
csr_bit_bash 1 1 100.00
aes_csr_bit_bash 27.000s 246.671us 1 1 100.00
csr_aliasing 1 1 100.00
aes_csr_aliasing 24.000s 191.946us 1 1 100.00
csr_mem_rw_with_rand_reset 5 5 100.00
aes_csr_mem_rw_with_rand_reset 2.000s 65.769us 5 5 100.00
regwen_csr_and_corresponding_lockable_csr 6 6 100.00
aes_csr_rw 2.000s 118.745us 5 5 100.00
aes_csr_aliasing 24.000s 191.946us 1 1 100.00
Testpoint Test Max Runtime Sim Time Pass Total %
algorithm 70 70 100.00
aes_smoke 7.000s 710.310us 10 10 100.00
aes_config_error 33.000s 797.262us 50 50 100.00
aes_stress 11.000s 1581.704us 10 10 100.00
key_length 70 70 100.00
aes_smoke 7.000s 710.310us 10 10 100.00
aes_config_error 33.000s 797.262us 50 50 100.00
aes_stress 11.000s 1581.704us 10 10 100.00
back2back 35 35 100.00
aes_stress 11.000s 1581.704us 10 10 100.00
aes_b2b 51.000s 1126.689us 25 25 100.00
backpressure 10 10 100.00
aes_stress 11.000s 1581.704us 10 10 100.00
multi_message 95 95 100.00
aes_smoke 7.000s 710.310us 10 10 100.00
aes_config_error 33.000s 797.262us 50 50 100.00
aes_stress 11.000s 1581.704us 10 10 100.00
aes_alert_reset 34.000s 202.392us 25 25 100.00
failure_test 85 85 100.00
aes_man_cfg_err 4.000s 117.095us 10 10 100.00
aes_config_error 33.000s 797.262us 50 50 100.00
aes_alert_reset 34.000s 202.392us 25 25 100.00
trigger_clear_test 10 10 100.00
aes_clear 31.000s 83.347us 10 10 100.00
nist_test_vectors 1 1 100.00
aes_nist_vectors 11.000s 625.376us 1 1 100.00
reset_recovery 25 25 100.00
aes_alert_reset 34.000s 202.392us 25 25 100.00
stress 10 10 100.00
aes_stress 11.000s 1581.704us 10 10 100.00
sideload 20 20 100.00
aes_stress 11.000s 1581.704us 10 10 100.00
aes_sideload 24.000s 1540.207us 10 10 100.00
deinitialization 10 10 100.00
aes_deinit 18.000s 1488.296us 10 10 100.00
stress_all 4 10 40.00
aes_stress_all 123.000s 6884.402us 4 10 40.00
alert_test 10 10 100.00
aes_alert_test 31.000s 60.092us 10 10 100.00
tl_d_oob_addr_access 25 25 100.00
aes_tl_errors 4.000s 162.106us 25 25 100.00
tl_d_illegal_access 25 25 100.00
aes_tl_errors 4.000s 162.106us 25 25 100.00
tl_d_outstanding_access 12 12 100.00
aes_csr_hw_reset 18.000s 67.394us 1 1 100.00
aes_csr_rw 2.000s 118.745us 5 5 100.00
aes_csr_aliasing 24.000s 191.946us 1 1 100.00
aes_same_csr_outstanding 3.000s 186.893us 5 5 100.00
tl_d_partial_access 12 12 100.00
aes_csr_hw_reset 18.000s 67.394us 1 1 100.00
aes_csr_rw 2.000s 118.745us 5 5 100.00
aes_csr_aliasing 24.000s 191.946us 1 1 100.00
aes_same_csr_outstanding 3.000s 186.893us 5 5 100.00
Testpoint Test Max Runtime Sim Time Pass Total %
reseeding 6 10 60.00
aes_reseed 10.000s 853.971us 6 10 60.00
fault_inject 610 660 92.42
aes_fi 104.000s 5248.139us 0 10 0.00
aes_control_fi 61.000s 0.000us 274 300 91.33
aes_cipher_fi 60.000s 10002.592us 336 350 96.00
shadow_reg_update_error 20 20 100.00
aes_shadow_reg_errors 3.000s 367.343us 20 20 100.00
shadow_reg_read_clear_staged_value 20 20 100.00
aes_shadow_reg_errors 3.000s 367.343us 20 20 100.00
shadow_reg_storage_error 20 20 100.00
aes_shadow_reg_errors 3.000s 367.343us 20 20 100.00
shadowed_reset_glitch 20 20 100.00
aes_shadow_reg_errors 3.000s 367.343us 20 20 100.00
shadow_reg_update_error_with_csr_rw 20 20 100.00
aes_shadow_reg_errors_with_csr_rw 5.000s 1311.229us 20 20 100.00
tl_intg_err 30 30 100.00
aes_sec_cm 10.000s 1427.495us 5 5 100.00
aes_tl_intg_err 4.000s 364.657us 25 25 100.00
sec_cm_bus_integrity 25 25 100.00
aes_tl_intg_err 4.000s 364.657us 25 25 100.00
sec_cm_lc_escalate_en_intersig_mubi 25 25 100.00
aes_alert_reset 34.000s 202.392us 25 25 100.00
sec_cm_main_config_shadow 20 20 100.00
aes_shadow_reg_errors 3.000s 367.343us 20 20 100.00
sec_cm_gcm_config_shadow 20 20 100.00
aes_shadow_reg_errors 3.000s 367.343us 20 20 100.00
sec_cm_main_config_sparse 134 145 92.41
aes_smoke 7.000s 710.310us 10 10 100.00
aes_stress 11.000s 1581.704us 10 10 100.00
aes_alert_reset 34.000s 202.392us 25 25 100.00
aes_core_fi 61.000s 10020.297us 89 100 89.00
sec_cm_gcm_config_sparse 149 160 93.12
aes_config_error 33.000s 797.262us 50 50 100.00
aes_stress 11.000s 1581.704us 10 10 100.00
aes_core_fi 61.000s 10020.297us 89 100 89.00
sec_cm_aux_config_shadow 20 20 100.00
aes_shadow_reg_errors 3.000s 367.343us 20 20 100.00
sec_cm_aux_config_regwen 20 20 100.00
aes_readability 3.000s 99.824us 10 10 100.00
aes_stress 11.000s 1581.704us 10 10 100.00
sec_cm_key_sideload 20 20 100.00
aes_stress 11.000s 1581.704us 10 10 100.00
aes_sideload 24.000s 1540.207us 10 10 100.00
sec_cm_key_sw_unreadable 10 10 100.00
aes_readability 3.000s 99.824us 10 10 100.00
sec_cm_data_reg_sw_unreadable 10 10 100.00
aes_readability 3.000s 99.824us 10 10 100.00
sec_cm_key_sec_wipe 10 10 100.00
aes_readability 3.000s 99.824us 10 10 100.00
sec_cm_iv_config_sec_wipe 10 10 100.00
aes_readability 3.000s 99.824us 10 10 100.00
sec_cm_data_reg_sec_wipe 10 10 100.00
aes_readability 3.000s 99.824us 10 10 100.00
sec_cm_data_reg_key_sca 10 10 100.00
aes_stress 11.000s 1581.704us 10 10 100.00
sec_cm_key_masking 10 10 100.00
aes_stress 11.000s 1581.704us 10 10 100.00
sec_cm_main_fsm_sparse 0 10 0.00
aes_fi 104.000s 5248.139us 0 10 0.00
sec_cm_main_fsm_redun 635 685 92.70
aes_fi 104.000s 5248.139us 0 10 0.00
aes_control_fi 61.000s 0.000us 274 300 91.33
aes_cipher_fi 60.000s 10002.592us 336 350 96.00
aes_ctr_fi 6.000s 814.639us 25 25 100.00
sec_cm_cipher_fsm_sparse 0 10 0.00
aes_fi 104.000s 5248.139us 0 10 0.00
sec_cm_cipher_fsm_redun 610 660 92.42
aes_fi 104.000s 5248.139us 0 10 0.00
aes_control_fi 61.000s 0.000us 274 300 91.33
aes_cipher_fi 60.000s 10002.592us 336 350 96.00
sec_cm_cipher_ctr_redun 336 350 96.00
aes_cipher_fi 60.000s 10002.592us 336 350 96.00
sec_cm_ctr_fsm_sparse 0 10 0.00
aes_fi 104.000s 5248.139us 0 10 0.00
sec_cm_ctr_fsm_redun 299 335 89.25
aes_fi 104.000s 5248.139us 0 10 0.00
aes_control_fi 61.000s 0.000us 274 300 91.33
aes_ctr_fi 6.000s 814.639us 25 25 100.00
sec_cm_ghash_fsm_sparse 0 10 0.00
aes_fi 104.000s 5248.139us 0 10 0.00
sec_cm_ctrl_sparse 635 685 92.70
aes_fi 104.000s 5248.139us 0 10 0.00
aes_control_fi 61.000s 0.000us 274 300 91.33
aes_cipher_fi 60.000s 10002.592us 336 350 96.00
aes_ctr_fi 6.000s 814.639us 25 25 100.00
sec_cm_main_fsm_global_esc 25 25 100.00
aes_alert_reset 34.000s 202.392us 25 25 100.00
sec_cm_main_fsm_local_esc 635 685 92.70
aes_fi 104.000s 5248.139us 0 10 0.00
aes_control_fi 61.000s 0.000us 274 300 91.33
aes_cipher_fi 60.000s 10002.592us 336 350 96.00
aes_ctr_fi 6.000s 814.639us 25 25 100.00
sec_cm_cipher_fsm_local_esc 635 685 92.70
aes_fi 104.000s 5248.139us 0 10 0.00
aes_control_fi 61.000s 0.000us 274 300 91.33
aes_cipher_fi 60.000s 10002.592us 336 350 96.00
aes_ctr_fi 6.000s 814.639us 25 25 100.00
sec_cm_ctr_fsm_local_esc 299 335 89.25
aes_fi 104.000s 5248.139us 0 10 0.00
aes_control_fi 61.000s 0.000us 274 300 91.33
aes_ctr_fi 6.000s 814.639us 25 25 100.00
sec_cm_ghash_fsm_local_esc 0 10 0.00
aes_fi 104.000s 5248.139us 0 10 0.00
sec_cm_data_reg_local_esc 610 660 92.42
aes_fi 104.000s 5248.139us 0 10 0.00
aes_control_fi 61.000s 0.000us 274 300 91.33
aes_cipher_fi 60.000s 10002.592us 336 350 96.00
Testpoint Test Max Runtime Sim Time Pass Total %
stress_all_with_rand_reset 0 10 0.00
aes_stress_all_with_rand_reset 33.000s 1820.240us 0 10 0.00

Error Messages

   Test seed line log context
UVM_FATAL (aes_control_fi_vseq.sv:62) [aes_control_fi_vseq] wait timeout occurred! 15 test runs
aes_control_fi 42540150378720487334600453401534815648202250249548490768553673907252108632830 150
UVM_INFO @ 10007513667 ps: (uvm_report_catcher.svh:705) [UVM/REPORT/CATCHER]
--- UVM Report catcher Summary ---
aes_control_fi 71721084280096116471839368024454014869679035105364509395804684058638420191078 155
UVM_INFO @ 10039196965 ps: (uvm_report_catcher.svh:705) [UVM/REPORT/CATCHER]
--- UVM Report catcher Summary ---
aes_control_fi 12968449953588399662136675108549289832610993889676781818408433362656904578803 148
UVM_INFO @ 10010920835 ps: (uvm_report_catcher.svh:705) [UVM/REPORT/CATCHER]
--- UVM Report catcher Summary ---
aes_control_fi 59912409789180987783838751508898164938666477938598405405219041661519455664705 147
UVM_INFO @ 10011987889 ps: (uvm_report_catcher.svh:705) [UVM/REPORT/CATCHER]
--- UVM Report catcher Summary ---
aes_control_fi 87277072862598852686272175094387517492230975968962666877131592635400106311870 148
UVM_INFO @ 10147274220 ps: (uvm_report_catcher.svh:705) [UVM/REPORT/CATCHER]
--- UVM Report catcher Summary ---
aes_control_fi 113005196563452650995992795421785455062387818083870641932765512332301735468208 148
UVM_INFO @ 10047304112 ps: (uvm_report_catcher.svh:705) [UVM/REPORT/CATCHER]
--- UVM Report catcher Summary ---
aes_control_fi 74716067933493742431451613331293999754355175361788701604556201827569373242381 145
UVM_INFO @ 10023738661 ps: (uvm_report_catcher.svh:705) [UVM/REPORT/CATCHER]
--- UVM Report catcher Summary ---
aes_control_fi 60017787392576131771443167566733952527510951357045975321701160321334396393820 144
UVM_INFO @ 10015919461 ps: (uvm_report_catcher.svh:705) [UVM/REPORT/CATCHER]
--- UVM Report catcher Summary ---
aes_control_fi 27291667348857669068371821437534621063951019050729696783741616771883985486975 145
UVM_INFO @ 10005941487 ps: (uvm_report_catcher.svh:705) [UVM/REPORT/CATCHER]
--- UVM Report catcher Summary ---
aes_control_fi 112999149206529329941754941644393473317671022532087858284425653152004972987137 140
UVM_INFO @ 10009680006 ps: (uvm_report_catcher.svh:705) [UVM/REPORT/CATCHER]
--- UVM Report catcher Summary ---
aes_control_fi 100643080637595188107987206944579663083956509897332815672447917771853070206978 147
UVM_INFO @ 10013378517 ps: (uvm_report_catcher.svh:705) [UVM/REPORT/CATCHER]
--- UVM Report catcher Summary ---
aes_control_fi 42544166827567577520019134770693145907273518161903772032349384894032387423586 141
UVM_INFO @ 10022550076 ps: (uvm_report_catcher.svh:705) [UVM/REPORT/CATCHER]
--- UVM Report catcher Summary ---
aes_control_fi 109927530187490366652268942644640391915239839009902115942874163550347422143476 151
UVM_INFO @ 10038679778 ps: (uvm_report_catcher.svh:705) [UVM/REPORT/CATCHER]
--- UVM Report catcher Summary ---
aes_control_fi 89894489739283189291838048579538622810725175165061925655251696841070641950316 138
UVM_INFO @ 10004927991 ps: (uvm_report_catcher.svh:705) [UVM/REPORT/CATCHER]
--- UVM Report catcher Summary ---
aes_control_fi 70347823533522542988737862867947258058126134423987966702038915163080072934487 153
UVM_INFO @ 10181168364 ps: (uvm_report_catcher.svh:705) [UVM/REPORT/CATCHER]
--- UVM Report catcher Summary ---
UVM_FATAL (aes_cipher_fi_vseq.sv:62) [aes_cipher_fi_vseq] wait timeout occurred! 13 test runs
aes_cipher_fi 103048078824890139987390017835950219924632184402989052277837022187897330105854 141
UVM_INFO @ 10002591820 ps: (uvm_report_catcher.svh:705) [UVM/REPORT/CATCHER]
--- UVM Report catcher Summary ---
aes_cipher_fi 72708757120503589874638355640201624675224682872549538536535552598819443416055 148
UVM_INFO @ 10003728373 ps: (uvm_report_catcher.svh:705) [UVM/REPORT/CATCHER]
--- UVM Report catcher Summary ---
aes_cipher_fi 37627223650655276792328854665510934183448265996266465736703137836693685119253 150
UVM_INFO @ 10014235552 ps: (uvm_report_catcher.svh:705) [UVM/REPORT/CATCHER]
--- UVM Report catcher Summary ---
aes_cipher_fi 115550680183504954630297837152381316027710962985154337131132174187824562382573 139
UVM_INFO @ 10038175851 ps: (uvm_report_catcher.svh:705) [UVM/REPORT/CATCHER]
--- UVM Report catcher Summary ---
aes_cipher_fi 38605279243615508752111746013959723792405785943701594070724766201037990223051 148
UVM_INFO @ 10010761387 ps: (uvm_report_catcher.svh:705) [UVM/REPORT/CATCHER]
--- UVM Report catcher Summary ---
aes_cipher_fi 106578754870410881905323653034661496149745501218133130084272653728215380263774 143
UVM_INFO @ 10040653603 ps: (uvm_report_catcher.svh:705) [UVM/REPORT/CATCHER]
--- UVM Report catcher Summary ---
aes_cipher_fi 94021642250841890620884117674996259815160004420712467672304679536561159731265 146
UVM_INFO @ 10008221805 ps: (uvm_report_catcher.svh:705) [UVM/REPORT/CATCHER]
--- UVM Report catcher Summary ---
aes_cipher_fi 44270194783414544212977971222188745558913196716185707824242679237939981294950 152
UVM_INFO @ 10017844893 ps: (uvm_report_catcher.svh:705) [UVM/REPORT/CATCHER]
--- UVM Report catcher Summary ---
aes_cipher_fi 20797291085740735530822197298470610092751371491722453120070822498565762925766 145
UVM_INFO @ 10008504406 ps: (uvm_report_catcher.svh:705) [UVM/REPORT/CATCHER]
--- UVM Report catcher Summary ---
aes_cipher_fi 40039633095584418021999864022165487838761997050875773901235143711295413607800 143
UVM_INFO @ 10007669149 ps: (uvm_report_catcher.svh:705) [UVM/REPORT/CATCHER]
--- UVM Report catcher Summary ---
aes_cipher_fi 59301849177751278240340811100196245145535454717106981542025574038311478554610 148
UVM_INFO @ 10080730007 ps: (uvm_report_catcher.svh:705) [UVM/REPORT/CATCHER]
--- UVM Report catcher Summary ---
aes_cipher_fi 4904854994120368723884545267837662988516658210842469019141239319770755638987 147
UVM_INFO @ 10005604341 ps: (uvm_report_catcher.svh:705) [UVM/REPORT/CATCHER]
--- UVM Report catcher Summary ---
aes_cipher_fi 105136825917030828551904726332319236014595491431650415168619401557778283994587 138
UVM_INFO @ 10007099913 ps: (uvm_report_catcher.svh:705) [UVM/REPORT/CATCHER]
--- UVM Report catcher Summary ---
UVM_ERROR (uvm_sequencer_base.svh:757) sequencer [SEQREQZMB] The task responsible for requesting a wait_for_grant on sequencer 'sequencer' for sequence 'parent_sequence' has been killed, to avoid a deadlock the sequence will be removed from the arbitration queues 12 test runs
aes_reseed 30085458590770893332023320762643986981489561277553515574445845800384515741408 19802
UVM_INFO @ 853971414 ps: (uvm_report_catcher.svh:705) [UVM/REPORT/CATCHER]
--- UVM Report catcher Summary ---
aes_stress_all_with_rand_reset 107661201653565350473222798872032605460110926481712571747899705765903169216145 181
UVM_INFO @ 199570922 ps: (uvm_report_catcher.svh:705) [UVM/REPORT/CATCHER]
--- UVM Report catcher Summary ---
aes_stress_all 112292759190772696595720070847224255891121407607074353510317611012785052906706 87865
UVM_INFO @ 362732970 ps: (uvm_report_catcher.svh:705) [UVM/REPORT/CATCHER]
--- UVM Report catcher Summary ---
aes_stress_all_with_rand_reset 69989875398153290580991801653973156064003646400804753289043615728608737050068 257
UVM_INFO @ 821601562 ps: (uvm_report_catcher.svh:705) [UVM/REPORT/CATCHER]
--- UVM Report catcher Summary ---
aes_stress_all 113357983537713777544622275911943774361932173439415192800314054557332974315548 43499
UVM_INFO @ 254097643 ps: (uvm_report_catcher.svh:705) [UVM/REPORT/CATCHER]
--- UVM Report catcher Summary ---
aes_stress_all_with_rand_reset 24266727609112098189895019514053621131256374726661455083990615195308321893718 188
UVM_INFO @ 146849781 ps: (uvm_report_catcher.svh:705) [UVM/REPORT/CATCHER]
--- UVM Report catcher Summary ---
aes_reseed 92537404848331055036584586389739391194925523091492133756321825026291234178134 3472
UVM_INFO @ 87685407 ps: (uvm_report_catcher.svh:705) [UVM/REPORT/CATCHER]
--- UVM Report catcher Summary ---
aes_stress_all 14439987907517822958010000119662362412846389743360848686311891849319734123573 8946
UVM_INFO @ 70772187 ps: (uvm_report_catcher.svh:705) [UVM/REPORT/CATCHER]
--- UVM Report catcher Summary ---
aes_stress_all 65793290938732578119290911970166447305860063094735278675725455001670818513364 433783
UVM_INFO @ 6884401729 ps: (uvm_report_catcher.svh:705) [UVM/REPORT/CATCHER]
--- UVM Report catcher Summary ---
aes_reseed 92831535086264966485230290707666809403353782622437764648250626894595793568876 4494
UVM_INFO @ 56759493 ps: (uvm_report_catcher.svh:705) [UVM/REPORT/CATCHER]
--- UVM Report catcher Summary ---
aes_reseed 108448938144064892929710125869738271078915665503706618145889670285020927418419 14303
UVM_INFO @ 313892438 ps: (uvm_report_catcher.svh:705) [UVM/REPORT/CATCHER]
--- UVM Report catcher Summary ---
aes_stress_all_with_rand_reset 9618267865410574484951372197822594699038939210571618971719662726811830774943 367
UVM_INFO @ 164463455 ps: (uvm_report_catcher.svh:705) [UVM/REPORT/CATCHER]
--- UVM Report catcher Summary ---
Job timed out after * minutes 12 test runs
aes_control_fi 69125386572326633099301224680866399311772512271940467313553806952371115436502 None
aes_control_fi 51634085147603141787514739113279740530226281284800947919234361978104266336719 None
aes_control_fi 38061109886172981589949023567245550108889186903257715874450167381891345262879 None
aes_control_fi 4723700710493382922093514651207886224598477854930128715511863247489862494203 None
aes_cipher_fi 65288913968117711773001625209322927070878161434711908281425306803701314053730 None
aes_control_fi 88626022235322439557509993676858515191695525256172487820306973422207490279387 None
aes_control_fi 65543627303874646140485652832528462539962717842458011779201554456386286822205 None
aes_control_fi 34142251682490036401603567339329909881432469274889986017830547659163135521906 None
aes_control_fi 94956105238890109350395180915685867324935184412411975521394772048693948016559 None
aes_control_fi 52446191418811959463922019747486212482790946195655327750942276516395315303366 None
aes_control_fi 60354045790096500225354838967965566942064123404896510213326674306952017006158 None
aes_control_fi 24553657901098819866305369386527201736452445778520088977399594168738748705473 None
UVM_FATAL (aes_scoreboard.sv:926) scoreboard [scoreboard] 11 test runs
aes_fi 50966065571180776898596337843569074772806196996380209318181045376963518589910 5421
----| NO FAILURES BUT NUMBER OF EXPECTED MESSAGES DOES NOT MATCH ACTUAL
----| Expected: 3
----| Seen: 2
----| Expected corrupted: 0
aes_fi 49712004583923918313677930193067004575455659208906737205664900682537171136023 11945
----| NO FAILURES BUT NUMBER OF EXPECTED MESSAGES DOES NOT MATCH ACTUAL
----| Expected: 3
----| Seen: 2
----| Expected corrupted: 0
aes_fi 10052242376251589242838117996643362900842685304380632196463687724087891398346 8130
----| NO FAILURES BUT NUMBER OF EXPECTED MESSAGES DOES NOT MATCH ACTUAL
----| Expected: 5
----| Seen: 4
----| Expected corrupted: 0
aes_fi 18282810908125308675451603509637135370353580819412506328667950205285451383421 3221
----| NO FAILURES BUT NUMBER OF EXPECTED MESSAGES DOES NOT MATCH ACTUAL
----| Expected: 3
----| Seen: 2
----| Expected corrupted: 0
aes_fi 109309777899368316353514167990780274385487959556399094399200644503043561167686 12109
----| NO FAILURES BUT NUMBER OF EXPECTED MESSAGES DOES NOT MATCH ACTUAL
----| Expected: 6
----| Seen: 5
----| Expected corrupted: 0
aes_fi 51374451234221427755113129922567332332887078029862448498134169654163277999098 11756
----| NO FAILURES BUT NUMBER OF EXPECTED MESSAGES DOES NOT MATCH ACTUAL
----| Expected: 3
----| Seen: 2
----| Expected corrupted: 0
aes_fi 50664583789343574597864112480508795308141283680051046081439103756093082909463 16175
----| NO FAILURES BUT NUMBER OF EXPECTED MESSAGES DOES NOT MATCH ACTUAL
----| Expected: 5
----| Seen: 3
----| Expected corrupted: 0
aes_fi 115618247471989097650632853604474285827413548304987751772534455448829868087740 472716
----| NO FAILURES BUT NUMBER OF EXPECTED MESSAGES DOES NOT MATCH ACTUAL
----| Expected: 4
----| Seen: 3
----| Expected corrupted: 0
aes_stress_all 20847356688093760004518023499925289061773802862227392974146275466986029287265 9538
----| NO FAILURES BUT NUMBER OF EXPECTED MESSAGES DOES NOT MATCH ACTUAL
----| Expected: 2
----| Seen: 1
----| Expected corrupted: 0
aes_fi 11190035663918979768653986819501004452279615788090538484744582345362688438172 13361
----| NO FAILURES BUT NUMBER OF EXPECTED MESSAGES DOES NOT MATCH ACTUAL
----| Expected: 4
----| Seen: 3
----| Expected corrupted: 0
aes_fi 4401547866647526404709500092888620448322400421319362516725348101305970100442 22598
----| NO FAILURES BUT NUMBER OF EXPECTED MESSAGES DOES NOT MATCH ACTUAL
----| Expected: 6
----| Seen: 5
----| Expected corrupted: 0
UVM_FATAL (aes_core_fi_vseq.sv:70) [aes_core_fi_vseq] wait timeout occurred! 10 test runs
aes_core_fi 103613457532113778197921670332700982822456204764549733665654488353445057588458 142
UVM_INFO @ 10013570401 ps: (uvm_report_catcher.svh:705) [UVM/REPORT/CATCHER]
--- UVM Report catcher Summary ---
aes_core_fi 53641775610437770336601302540545373264646812902673070954897557907616121571172 138
UVM_INFO @ 10017405117 ps: (uvm_report_catcher.svh:705) [UVM/REPORT/CATCHER]
--- UVM Report catcher Summary ---
aes_core_fi 26186003099471354497729467864307520898027679086393104367948038529815533774732 148
UVM_INFO @ 10017753742 ps: (uvm_report_catcher.svh:705) [UVM/REPORT/CATCHER]
--- UVM Report catcher Summary ---
aes_core_fi 42155591448171064355904857449010061043139856913001760401768268050636629415538 142
UVM_INFO @ 10032113527 ps: (uvm_report_catcher.svh:705) [UVM/REPORT/CATCHER]
--- UVM Report catcher Summary ---
aes_core_fi 23059117877575651129805271948130995892545526414316011566961788653979292658692 141
UVM_INFO @ 10020297254 ps: (uvm_report_catcher.svh:705) [UVM/REPORT/CATCHER]
--- UVM Report catcher Summary ---
aes_core_fi 15762673130268146491623861549356099490535363152311562817662156608321000034572 138
UVM_INFO @ 10007144456 ps: (uvm_report_catcher.svh:705) [UVM/REPORT/CATCHER]
--- UVM Report catcher Summary ---
aes_core_fi 26871389838787823989149834084310812031187632366662165111599176422033916343847 148
UVM_INFO @ 10004328701 ps: (uvm_report_catcher.svh:705) [UVM/REPORT/CATCHER]
--- UVM Report catcher Summary ---
aes_core_fi 40979001521278520165538825875004765769494592306976364660957349291369131943473 147
UVM_INFO @ 10014348741 ps: (uvm_report_catcher.svh:705) [UVM/REPORT/CATCHER]
--- UVM Report catcher Summary ---
aes_core_fi 104803621014310023281744994468648096735574786979609194296358706387099497589730 149
UVM_INFO @ 10005546146 ps: (uvm_report_catcher.svh:705) [UVM/REPORT/CATCHER]
--- UVM Report catcher Summary ---
aes_core_fi 111545988821371020703367868515263832923858091599762256174902918960112724818987 145
UVM_INFO @ 10031864599 ps: (uvm_report_catcher.svh:705) [UVM/REPORT/CATCHER]
--- UVM Report catcher Summary ---
UVM_FATAL (cip_base_vseq.sv:1220) [aes_common_vseq] Check failed (vseq_done) 5 test runs
aes_stress_all_with_rand_reset 113410179853016611861484396172638128530227231460030785540999684601318800956211 136
UVM_INFO @ 58244511 ps: (uvm_report_catcher.svh:705) [UVM/REPORT/CATCHER]
--- UVM Report catcher Summary ---
aes_stress_all_with_rand_reset 105945132887131190458648772505165827913074315032967981973286593927441082905398 731
UVM_INFO @ 1820239859 ps: (uvm_report_catcher.svh:705) [UVM/REPORT/CATCHER]
--- UVM Report catcher Summary ---
aes_stress_all_with_rand_reset 30546330969222055615798702914831868641743752763142036491508516338251233686322 168
UVM_INFO @ 12359044 ps: (uvm_report_catcher.svh:705) [UVM/REPORT/CATCHER]
--- UVM Report catcher Summary ---
aes_stress_all_with_rand_reset 106216852341407942905306137082901325702715756875235858324047252289538828147531 550
UVM_INFO @ 9434050917 ps: (uvm_report_catcher.svh:705) [UVM/REPORT/CATCHER]
--- UVM Report catcher Summary ---
aes_stress_all_with_rand_reset 82282007885208255070516992883065398178483423567544965995768278608084066457220 136
UVM_INFO @ 13934418 ps: (uvm_report_catcher.svh:705) [UVM/REPORT/CATCHER]
--- UVM Report catcher Summary ---
UVM_FATAL (aes_scoreboard.sv:785) scoreboard [scoreboard] # * 1 test run
aes_stress_all 104341134066332637486433461433780574837374518025729064940321486579778489549468 40204
TEST FAILED MESSAGES DID NOT MATCH
0 69 49 49 0
1 00 11 11 0
UVM_FATAL (aes_base_vseq.sv:1082) virtual_sequencer [aes_stress_vseq] 1 test run
aes_stress_all_with_rand_reset 96323587015109332026232491806748938729862765935543246152180602343161742960363 166
Was able to clear FATAL ALERT without reset
---| Idle: 0
---| Stall: 0
UVM_FATAL (aes_core_fi_vseq.sv:93) [aes_core_fi_vseq] wait timeout occurred! 1 test run
aes_core_fi 66581249854534969091200122412006189760955330756949306686566015738138835141641 139
UVM_INFO @ 10043175027 ps: (uvm_report_catcher.svh:705) [UVM/REPORT/CATCHER]
--- UVM Report catcher Summary ---