Simulation Results: chip

 
20/06/2026 02:47:04 DVSim: v1.49.0 sha: c0022c1 json Branch: master Tool: vcs [unknown]
Coverage statistics
  • Total
  • 94.38 %
  • code
  • 85.80 %
  • assert
  • 97.99 %
  • func
  • 99.35 %
  • line
  • 94.85 %
  • branch
  • 94.74 %
  • cond
  • 93.28 %
  • toggle
  • 88.97 %
  • FSM
  • 57.14 %
Validation stages
V1
98.44%
V2
86.05%
V2S
100.00%
V3
84.28%
unmapped
54.84%
Testpoint Test Max Runtime Sim Time Pass Total %
chip_sw_example_tests 12 12 100.00
chip_sw_example_flash 225.310s 3276.153us 3 3 100.00
chip_sw_example_rom 136.790s 2565.794us 3 3 100.00
chip_sw_example_manufacturer 236.460s 3107.784us 3 3 100.00
chip_sw_example_concurrency 252.720s 2792.364us 3 3 100.00
csr_hw_reset 1 1 100.00
chip_csr_hw_reset 182.360s 4074.611us 1 1 100.00
csr_rw 5 5 100.00
chip_csr_rw 545.550s 5759.007us 5 5 100.00
csr_bit_bash 1 1 100.00
chip_csr_bit_bash 724.590s 7944.620us 1 1 100.00
csr_aliasing 1 1 100.00
chip_csr_aliasing 4638.680s 32734.081us 1 1 100.00
csr_mem_rw_with_rand_reset 3 5 60.00
chip_csr_mem_rw_with_rand_reset 914.960s 11197.140us 3 5 60.00
regwen_csr_and_corresponding_lockable_csr 6 6 100.00
chip_csr_aliasing 4638.680s 32734.081us 1 1 100.00
chip_csr_rw 545.550s 5759.007us 5 5 100.00
xbar_smoke 50 50 100.00
xbar_smoke 10.760s 231.239us 50 50 100.00
chip_sw_gpio_out 3 3 100.00
chip_sw_gpio 389.210s 4574.691us 3 3 100.00
chip_sw_gpio_in 3 3 100.00
chip_sw_gpio 389.210s 4574.691us 3 3 100.00
chip_sw_gpio_irq 3 3 100.00
chip_sw_gpio 389.210s 4574.691us 3 3 100.00
chip_sw_uart_tx_rx 5 5 100.00
chip_sw_uart_tx_rx 515.190s 4935.464us 5 5 100.00
chip_sw_uart_rx_overflow 20 20 100.00
chip_sw_uart_tx_rx 515.190s 4935.464us 5 5 100.00
chip_sw_uart_tx_rx_idx1 506.930s 4293.082us 5 5 100.00
chip_sw_uart_tx_rx_idx2 493.090s 5005.914us 5 5 100.00
chip_sw_uart_tx_rx_idx3 574.060s 4735.304us 5 5 100.00
chip_sw_uart_baud_rate 20 20 100.00
chip_sw_uart_rand_baudrate 2339.460s 13199.926us 20 20 100.00
chip_sw_uart_tx_rx_alt_clk_freq 10 10 100.00
chip_sw_uart_tx_rx_alt_clk_freq 2249.980s 13059.885us 5 5 100.00
chip_sw_uart_tx_rx_alt_clk_freq_low_speed 1422.110s 13868.731us 5 5 100.00
Testpoint Test Max Runtime Sim Time Pass Total %
chip_pin_mux 10 10 100.00
chip_padctrl_attributes 320.730s 5414.922us 10 10 100.00
chip_padctrl_attributes 10 10 100.00
chip_padctrl_attributes 320.730s 5414.922us 10 10 100.00
chip_sw_sleep_pin_mio_dio_val 2 3 66.67
chip_sw_sleep_pin_mio_dio_val 278.690s 3605.117us 2 3 66.67
chip_sw_sleep_pin_wake 3 3 100.00
chip_sw_sleep_pin_wake 323.010s 5735.832us 3 3 100.00
chip_sw_sleep_pin_retention 3 3 100.00
chip_sw_sleep_pin_retention 311.060s 4293.320us 3 3 100.00
chip_sw_tap_strap_sampling 20 20 100.00
chip_tap_straps_dev 1259.300s 13347.983us 5 5 100.00
chip_tap_straps_testunlock0 803.850s 10004.784us 5 5 100.00
chip_tap_straps_rma 525.740s 6750.178us 5 5 100.00
chip_tap_straps_prod 1344.330s 17037.440us 5 5 100.00
chip_sw_sleep_pwm_pulses 3 3 100.00
chip_sw_sleep_pwm_pulses 1230.400s 9551.773us 3 3 100.00
chip_sw_data_integrity 6 6 100.00
chip_sw_data_integrity_escalation 631.320s 6428.551us 6 6 100.00
chip_sw_instruction_integrity 6 6 100.00
chip_sw_data_integrity_escalation 631.320s 6428.551us 6 6 100.00
chip_sw_ast_clk_outputs 3 3 100.00
chip_sw_ast_clk_outputs 745.180s 8594.011us 3 3 100.00
chip_sw_ast_clk_rst_inputs 0 3 0.00
chip_sw_ast_clk_rst_inputs 2138.690s 15208.493us 0 3 0.00
chip_sw_ast_sys_clk_jitter 30 30 100.00
chip_sw_flash_ctrl_ops_jitter_en 509.950s 4050.318us 3 3 100.00
chip_sw_flash_ctrl_access_jitter_en 808.180s 6200.527us 3 3 100.00
chip_sw_otbn_ecdsa_op_irq_jitter_en 4771.040s 19294.267us 3 3 100.00
chip_sw_aes_enc_jitter_en 269.080s 3298.183us 3 3 100.00
chip_sw_edn_entropy_reqs_jitter 1031.250s 7833.236us 3 3 100.00
chip_sw_hmac_enc_jitter_en 225.440s 3623.338us 3 3 100.00
chip_sw_keymgr_key_derivation_jitter_en 1569.520s 9834.653us 3 3 100.00
chip_sw_kmac_mode_kmac_jitter_en 267.420s 3234.782us 3 3 100.00
chip_sw_sram_ctrl_scrambled_access_jitter_en 589.420s 5054.804us 3 3 100.00
chip_sw_clkmgr_jitter 205.220s 2973.275us 3 3 100.00
chip_sw_ast_usb_clk_calib 1 1 100.00
chip_sw_usb_ast_clk_calib 228.490s 3442.338us 1 1 100.00
chip_sw_sensor_ctrl_ast_alerts 6 8 75.00
chip_sw_sensor_ctrl_alert 873.530s 8899.889us 3 5 60.00
chip_sw_pwrmgr_sleep_sensor_ctrl_alert_wakeup 307.140s 4575.074us 3 3 100.00
chip_sw_sensor_ctrl_ast_status 3 3 100.00
chip_sw_sensor_ctrl_status 214.790s 2448.985us 3 3 100.00
chip_sw_pwrmgr_sleep_sensor_ctrl_alert_wakeup 3 3 100.00
chip_sw_pwrmgr_sleep_sensor_ctrl_alert_wakeup 307.140s 4575.074us 3 3 100.00
chip_sw_smoketest 51 51 100.00
chip_sw_flash_scrambling_smoketest 225.660s 2791.623us 3 3 100.00
chip_sw_aes_smoketest 313.120s 3266.062us 3 3 100.00
chip_sw_aon_timer_smoketest 306.820s 3697.976us 3 3 100.00
chip_sw_clkmgr_smoketest 215.080s 2848.749us 3 3 100.00
chip_sw_csrng_smoketest 231.290s 3196.989us 3 3 100.00
chip_sw_entropy_src_smoketest 1220.620s 6986.679us 3 3 100.00
chip_sw_gpio_smoketest 227.450s 3168.074us 3 3 100.00
chip_sw_hmac_smoketest 322.200s 3893.703us 3 3 100.00
chip_sw_kmac_smoketest 273.450s 3421.305us 3 3 100.00
chip_sw_otbn_smoketest 1329.450s 8293.923us 3 3 100.00
chip_sw_pwrmgr_smoketest 398.110s 6008.598us 3 3 100.00
chip_sw_pwrmgr_usbdev_smoketest 439.390s 5592.963us 3 3 100.00
chip_sw_rv_plic_smoketest 243.950s 2597.892us 3 3 100.00
chip_sw_rv_timer_smoketest 260.810s 3271.167us 3 3 100.00
chip_sw_rstmgr_smoketest 174.230s 3095.405us 3 3 100.00
chip_sw_sram_ctrl_smoketest 259.720s 2715.387us 3 3 100.00
chip_sw_uart_smoketest 259.460s 3115.292us 3 3 100.00
chip_sw_otp_smoketest 3 3 100.00
chip_sw_otp_ctrl_smoketest 241.490s 3013.112us 3 3 100.00
chip_sw_rom_functests 0 3 0.00
rom_keymgr_functest 482.130s 4790.925us 0 3 0.00
chip_sw_boot 3 3 100.00
chip_sw_uart_tx_rx_bootstrap 12834.260s 63658.116us 3 3 100.00
chip_sw_secure_boot 3 3 100.00
rom_e2e_smoke 3906.900s 17268.086us 3 3 100.00
chip_sw_rom_raw_unlock 0 3 0.00
rom_raw_unlock 98.940s 0.000us 0 3 0.00
chip_sw_power_idle_load 0 3 0.00
chip_sw_power_idle_load 281.360s 3101.409us 0 3 0.00
chip_sw_power_sleep_load 0 3 0.00
chip_sw_power_sleep_load 245.380s 4127.009us 0 3 0.00
chip_sw_exit_test_unlocked_bootstrap 3 3 100.00
chip_sw_exit_test_unlocked_bootstrap 11125.950s 54206.414us 3 3 100.00
chip_sw_inject_scramble_seed 3 3 100.00
chip_sw_inject_scramble_seed 11154.250s 58778.243us 3 3 100.00
tl_d_oob_addr_access 4 30 13.33
chip_tl_errors 494.230s 5892.950us 4 30 13.33
tl_d_illegal_access 4 30 13.33
chip_tl_errors 494.230s 5892.950us 4 30 13.33
tl_d_outstanding_access 12 12 100.00
chip_csr_aliasing 4638.680s 32734.081us 1 1 100.00
chip_same_csr_outstanding 4047.490s 30091.416us 5 5 100.00
chip_csr_hw_reset 182.360s 4074.611us 1 1 100.00
chip_csr_rw 545.550s 5759.007us 5 5 100.00
tl_d_partial_access 12 12 100.00
chip_csr_aliasing 4638.680s 32734.081us 1 1 100.00
chip_same_csr_outstanding 4047.490s 30091.416us 5 5 100.00
chip_csr_hw_reset 182.360s 4074.611us 1 1 100.00
chip_csr_rw 545.550s 5759.007us 5 5 100.00
xbar_base_random_sequence 50 50 100.00
xbar_random 77.760s 2035.315us 50 50 100.00
xbar_random_delay 300 300 100.00
xbar_smoke_zero_delays 7.170s 50.272us 50 50 100.00
xbar_smoke_large_delays 106.190s 10613.604us 50 50 100.00
xbar_smoke_slow_rsp 85.750s 6574.493us 50 50 100.00
xbar_random_zero_delays 52.150s 558.497us 50 50 100.00
xbar_random_large_delays 449.650s 57616.547us 50 50 100.00
xbar_random_slow_rsp 405.870s 36478.587us 50 50 100.00
xbar_unmapped_address 100 100 100.00
xbar_unmapped_addr 54.950s 1500.131us 50 50 100.00
xbar_error_and_unmapped_addr 51.900s 1481.822us 50 50 100.00
xbar_error_cases 100 100 100.00
xbar_error_random 81.750s 2195.394us 50 50 100.00
xbar_error_and_unmapped_addr 51.900s 1481.822us 50 50 100.00
xbar_all_access_same_device 100 100 100.00
xbar_access_same_device 122.430s 3571.759us 50 50 100.00
xbar_access_same_device_slow_rsp 913.410s 86036.512us 50 50 100.00
xbar_all_hosts_use_same_source_id 50 50 100.00
xbar_same_source 68.850s 2132.419us 50 50 100.00
xbar_stress_all 100 100 100.00
xbar_stress_all 469.750s 16512.610us 50 50 100.00
xbar_stress_all_with_error 547.650s 16442.548us 50 50 100.00
xbar_stress_with_reset 100 100 100.00
xbar_stress_all_with_rand_reset 770.600s 18523.985us 50 50 100.00
xbar_stress_all_with_reset_error 802.620s 11723.342us 50 50 100.00
rom_e2e_smoke 3 3 100.00
rom_e2e_smoke 3906.900s 17268.086us 3 3 100.00
rom_e2e_shutdown_output 3 3 100.00
rom_e2e_shutdown_output 3764.800s 31662.708us 3 3 100.00
rom_e2e_shutdown_exception_c 3 3 100.00
rom_e2e_shutdown_exception_c 3794.180s 14749.025us 3 3 100.00
rom_e2e_boot_policy_valid 0 15 0.00
rom_e2e_boot_policy_valid_a_good_b_good_test_unlocked0 22.191s 0.000us 0 1 0.00
rom_e2e_boot_policy_valid_a_good_b_good_dev 11.294s 0.000us 0 1 0.00
rom_e2e_boot_policy_valid_a_good_b_good_prod 11.925s 0.000us 0 1 0.00
rom_e2e_boot_policy_valid_a_good_b_good_prod_end 12.052s 0.000us 0 1 0.00
rom_e2e_boot_policy_valid_a_good_b_good_rma 11.618s 0.000us 0 1 0.00
rom_e2e_boot_policy_valid_a_good_b_bad_test_unlocked0 121.650s 0.000us 0 1 0.00
rom_e2e_boot_policy_valid_a_good_b_bad_dev 11.522s 0.000us 0 1 0.00
rom_e2e_boot_policy_valid_a_good_b_bad_prod 11.195s 0.000us 0 1 0.00
rom_e2e_boot_policy_valid_a_good_b_bad_prod_end 10.646s 0.000us 0 1 0.00
rom_e2e_boot_policy_valid_a_good_b_bad_rma 11.711s 0.000us 0 1 0.00
rom_e2e_boot_policy_valid_a_bad_b_good_test_unlocked0 133.854s 0.000us 0 1 0.00
rom_e2e_boot_policy_valid_a_bad_b_good_dev 12.086s 0.000us 0 1 0.00
rom_e2e_boot_policy_valid_a_bad_b_good_prod 12.110s 0.000us 0 1 0.00
rom_e2e_boot_policy_valid_a_bad_b_good_prod_end 11.796s 0.000us 0 1 0.00
rom_e2e_boot_policy_valid_a_bad_b_good_rma 12.170s 0.000us 0 1 0.00
rom_e2e_sigverify_always 0 15 0.00
rom_e2e_sigverify_always_a_bad_b_bad_test_unlocked0 30.790s 10.220us 0 1 0.00
rom_e2e_sigverify_always_a_bad_b_bad_dev 30.110s 10.360us 0 1 0.00
rom_e2e_sigverify_always_a_bad_b_bad_prod 20.240s 10.240us 0 1 0.00
rom_e2e_sigverify_always_a_bad_b_bad_prod_end 26.160s 10.220us 0 1 0.00
rom_e2e_sigverify_always_a_bad_b_bad_rma 27.140s 10.200us 0 1 0.00
rom_e2e_sigverify_always_a_bad_b_nothing_test_unlocked0 33.350s 10.100us 0 1 0.00
rom_e2e_sigverify_always_a_bad_b_nothing_dev 25.750s 10.100us 0 1 0.00
rom_e2e_sigverify_always_a_bad_b_nothing_prod 28.340s 10.380us 0 1 0.00
rom_e2e_sigverify_always_a_bad_b_nothing_prod_end 25.430s 10.200us 0 1 0.00
rom_e2e_sigverify_always_a_bad_b_nothing_rma 28.910s 10.140us 0 1 0.00
rom_e2e_sigverify_always_a_nothing_b_bad_test_unlocked0 24.690s 10.340us 0 1 0.00
rom_e2e_sigverify_always_a_nothing_b_bad_dev 32.660s 10.280us 0 1 0.00
rom_e2e_sigverify_always_a_nothing_b_bad_prod 21.760s 10.120us 0 1 0.00
rom_e2e_sigverify_always_a_nothing_b_bad_prod_end 23.850s 10.280us 0 1 0.00
rom_e2e_sigverify_always_a_nothing_b_bad_rma 29.630s 10.280us 0 1 0.00
rom_e2e_asm_init 0 15 0.00
rom_e2e_asm_init_test_unlocked0 52.834s 0.000us 0 3 0.00
rom_e2e_asm_init_dev 12.364s 0.000us 0 3 0.00
rom_e2e_asm_init_prod 11.802s 0.000us 0 3 0.00
rom_e2e_asm_init_prod_end 12.009s 0.000us 0 3 0.00
rom_e2e_asm_init_rma 11.873s 0.000us 0 3 0.00
rom_e2e_keymgr_init 7 9 77.78
rom_e2e_keymgr_init_rom_ext_meas 7585.870s 29608.068us 2 3 66.67
rom_e2e_keymgr_init_rom_ext_no_meas 7660.410s 30057.054us 2 3 66.67
rom_e2e_keymgr_init_rom_ext_invalid_meas 8019.040s 29114.508us 3 3 100.00
rom_e2e_static_critical 3 3 100.00
rom_e2e_static_critical 4368.410s 16522.321us 3 3 100.00
chip_sw_adc_ctrl_debug_cable_irq 0 3 0.00
chip_sw_adc_ctrl_sleep_debug_cable_wakeup 3600.176s 0.000us 0 3 0.00
chip_sw_adc_ctrl_sleep_debug_cable_wakeup 0 3 0.00
chip_sw_adc_ctrl_sleep_debug_cable_wakeup 3600.176s 0.000us 0 3 0.00
chip_sw_aes_enc 6 6 100.00
chip_sw_aes_enc 280.030s 3268.145us 3 3 100.00
chip_sw_aes_enc_jitter_en 269.080s 3298.183us 3 3 100.00
chip_sw_aes_entropy 3 3 100.00
chip_sw_aes_entropy 232.690s 3122.807us 3 3 100.00
chip_sw_aes_idle 3 3 100.00
chip_sw_aes_idle 222.240s 3323.412us 3 3 100.00
chip_sw_aes_sideload 3 3 100.00
chip_sw_keymgr_sideload_aes 1870.540s 10127.918us 3 3 100.00
chip_sw_alert_handler_alerts 0 3 0.00
chip_sw_alert_test 282.610s 3275.932us 0 3 0.00
chip_sw_alert_handler_escalations 3 3 100.00
chip_sw_alert_handler_escalation 534.980s 5336.382us 3 3 100.00
chip_sw_all_escalation_resets 91 100 91.00
chip_sw_all_escalation_resets 632.650s 6182.028us 91 100 91.00
chip_sw_alert_handler_irqs 9 9 100.00
chip_plic_all_irqs_0 707.420s 5056.810us 3 3 100.00
chip_plic_all_irqs_10 438.050s 3660.250us 3 3 100.00
chip_plic_all_irqs_20 522.970s 3973.002us 3 3 100.00
chip_sw_alert_handler_entropy 3 3 100.00
chip_sw_alert_handler_entropy 258.160s 3009.056us 3 3 100.00
chip_sw_alert_handler_crashdump 3 3 100.00
chip_sw_rstmgr_alert_info 1407.220s 13305.457us 3 3 100.00
chip_sw_alert_handler_ping_timeout 3 3 100.00
chip_sw_alert_handler_ping_timeout 528.470s 6097.805us 3 3 100.00
chip_sw_alert_handler_lpg_sleep_mode_alerts 0 90 0.00
chip_sw_alert_handler_lpg_sleep_mode_alerts 269.870s 3501.420us 0 90 0.00
chip_sw_alert_handler_lpg_sleep_mode_pings 0 3 0.00
chip_sw_alert_handler_lpg_sleep_mode_pings 14400.168s 0.000us 0 3 0.00
chip_sw_alert_handler_lpg_clock_off 3 3 100.00
chip_sw_alert_handler_lpg_clkoff 1515.680s 8737.092us 3 3 100.00
chip_sw_alert_handler_lpg_reset_toggle 3 3 100.00
chip_sw_alert_handler_lpg_reset_toggle 1800.020s 9506.979us 3 3 100.00
chip_sw_alert_handler_ping_ok 3 3 100.00
chip_sw_alert_handler_ping_ok 1087.470s 8355.571us 3 3 100.00
chip_sw_alert_handler_reverse_ping_in_deep_sleep 3 3 100.00
chip_sw_alert_handler_reverse_ping_in_deep_sleep 13044.820s 255027.299us 3 3 100.00
chip_sw_aon_timer_wakeup_irq 3 3 100.00
chip_sw_aon_timer_irq 377.080s 4522.513us 3 3 100.00
chip_sw_aon_timer_sleep_wakeup 3 3 100.00
chip_sw_pwrmgr_smoketest 398.110s 6008.598us 3 3 100.00
chip_sw_aon_timer_wdog_bark_irq 3 3 100.00
chip_sw_aon_timer_irq 377.080s 4522.513us 3 3 100.00
chip_sw_aon_timer_wdog_bite_reset 1 3 33.33
chip_sw_aon_timer_wdog_bite_reset 574.540s 7732.633us 1 3 33.33
chip_sw_aon_timer_sleep_wdog_bite_reset 1 3 33.33
chip_sw_aon_timer_wdog_bite_reset 574.540s 7732.633us 1 3 33.33
chip_sw_aon_timer_sleep_wdog_sleep_pause 5 5 100.00
chip_sw_aon_timer_sleep_wdog_sleep_pause 511.790s 7757.503us 5 5 100.00
chip_sw_aon_timer_wdog_lc_escalate 3 3 100.00
chip_sw_aon_timer_wdog_lc_escalate 604.500s 5223.958us 3 3 100.00
chip_sw_clkmgr_idle_trans 12 12 100.00
chip_sw_otbn_randomness 792.490s 6118.587us 3 3 100.00
chip_sw_aes_idle 222.240s 3323.412us 3 3 100.00
chip_sw_hmac_enc_idle 225.260s 3596.899us 3 3 100.00
chip_sw_kmac_idle 235.860s 2913.335us 3 3 100.00
chip_sw_clkmgr_off_trans 12 12 100.00
chip_sw_clkmgr_off_aes_trans 442.630s 4770.086us 3 3 100.00
chip_sw_clkmgr_off_hmac_trans 472.280s 5244.509us 3 3 100.00
chip_sw_clkmgr_off_kmac_trans 446.400s 5344.190us 3 3 100.00
chip_sw_clkmgr_off_otbn_trans 378.420s 3677.752us 3 3 100.00
chip_sw_clkmgr_off_peri 3 3 100.00
chip_sw_clkmgr_off_peri 1097.850s 12095.101us 3 3 100.00
chip_sw_clkmgr_div 21 21 100.00
chip_sw_clkmgr_external_clk_src_for_sw_fast_test_unlocked0 542.550s 4394.926us 3 3 100.00
chip_sw_clkmgr_external_clk_src_for_sw_slow_test_unlocked0 588.150s 5706.954us 3 3 100.00
chip_sw_clkmgr_external_clk_src_for_sw_fast_dev 545.500s 4342.875us 3 3 100.00
chip_sw_clkmgr_external_clk_src_for_sw_slow_dev 542.290s 5169.530us 3 3 100.00
chip_sw_clkmgr_external_clk_src_for_sw_fast_rma 510.470s 4671.473us 3 3 100.00
chip_sw_clkmgr_external_clk_src_for_sw_slow_rma 532.100s 5093.183us 3 3 100.00
chip_sw_ast_clk_outputs 745.180s 8594.011us 3 3 100.00
chip_sw_clkmgr_external_clk_src_for_lc 3 3 100.00
chip_sw_clkmgr_external_clk_src_for_lc 496.830s 7374.004us 3 3 100.00
chip_sw_clkmgr_external_clk_src_for_sw 6 6 100.00
chip_sw_clkmgr_external_clk_src_for_sw_fast_dev 545.500s 4342.875us 3 3 100.00
chip_sw_clkmgr_external_clk_src_for_sw_slow_dev 542.290s 5169.530us 3 3 100.00
chip_sw_clkmgr_jitter 30 30 100.00
chip_sw_flash_ctrl_ops_jitter_en 509.950s 4050.318us 3 3 100.00
chip_sw_flash_ctrl_access_jitter_en 808.180s 6200.527us 3 3 100.00
chip_sw_otbn_ecdsa_op_irq_jitter_en 4771.040s 19294.267us 3 3 100.00
chip_sw_aes_enc_jitter_en 269.080s 3298.183us 3 3 100.00
chip_sw_edn_entropy_reqs_jitter 1031.250s 7833.236us 3 3 100.00
chip_sw_hmac_enc_jitter_en 225.440s 3623.338us 3 3 100.00
chip_sw_keymgr_key_derivation_jitter_en 1569.520s 9834.653us 3 3 100.00
chip_sw_kmac_mode_kmac_jitter_en 267.420s 3234.782us 3 3 100.00
chip_sw_sram_ctrl_scrambled_access_jitter_en 589.420s 5054.804us 3 3 100.00
chip_sw_clkmgr_jitter 205.220s 2973.275us 3 3 100.00
chip_sw_clkmgr_extended_range 33 33 100.00
chip_sw_clkmgr_jitter_reduced_freq 195.410s 2864.261us 3 3 100.00
chip_sw_flash_ctrl_ops_jitter_en_reduced_freq 476.320s 4624.888us 3 3 100.00
chip_sw_flash_ctrl_access_jitter_en_reduced_freq 800.380s 7801.877us 3 3 100.00
chip_sw_otbn_ecdsa_op_irq_jitter_en_reduced_freq 4925.570s 25245.220us 3 3 100.00
chip_sw_aes_enc_jitter_en_reduced_freq 267.680s 3919.236us 3 3 100.00
chip_sw_hmac_enc_jitter_en_reduced_freq 231.880s 3464.867us 3 3 100.00
chip_sw_keymgr_key_derivation_jitter_en_reduced_freq 1214.990s 10024.582us 3 3 100.00
chip_sw_kmac_mode_kmac_jitter_en_reduced_freq 237.040s 3243.020us 3 3 100.00
chip_sw_sram_ctrl_scrambled_access_jitter_en_reduced_freq 538.000s 5845.176us 3 3 100.00
chip_sw_flash_init_reduced_freq 1513.140s 18204.608us 3 3 100.00
chip_sw_csrng_edn_concurrency_reduced_freq 13080.710s 85729.909us 3 3 100.00
chip_sw_clkmgr_deep_sleep_frequency 3 3 100.00
chip_sw_ast_clk_outputs 745.180s 8594.011us 3 3 100.00
chip_sw_clkmgr_sleep_frequency 3 3 100.00
chip_sw_clkmgr_sleep_frequency 523.130s 4629.529us 3 3 100.00
chip_sw_clkmgr_reset_frequency 3 3 100.00
chip_sw_clkmgr_reset_frequency 373.150s 3991.425us 3 3 100.00
chip_sw_clkmgr_escalation_reset 91 100 91.00
chip_sw_all_escalation_resets 632.650s 6182.028us 91 100 91.00
chip_sw_clkmgr_alert_handler_clock_enables 3 3 100.00
chip_sw_alert_handler_lpg_clkoff 1515.680s 8737.092us 3 3 100.00
chip_sw_csrng_edn_cmd 3 3 100.00
chip_sw_entropy_src_csrng 3280.350s 23921.749us 3 3 100.00
chip_sw_csrng_fuse_en_sw_app_read 2 3 66.67
chip_sw_csrng_fuse_en_sw_app_read_test 347.430s 4598.300us 2 3 66.67
chip_sw_csrng_lc_hw_debug_en 3 3 100.00
chip_sw_csrng_lc_hw_debug_en_test 574.970s 7780.338us 3 3 100.00
chip_sw_csrng_known_answer_tests 3 3 100.00
chip_sw_csrng_kat_test 234.610s 2990.624us 3 3 100.00
chip_sw_edn_entropy_reqs 16 16 100.00
chip_sw_csrng_edn_concurrency 8510.140s 33719.771us 10 10 100.00
chip_sw_entropy_src_ast_rng_req 215.670s 2929.161us 3 3 100.00
chip_sw_edn_entropy_reqs 981.200s 6690.263us 3 3 100.00
chip_sw_entropy_src_ast_rng_req 3 3 100.00
chip_sw_entropy_src_ast_rng_req 215.670s 2929.161us 3 3 100.00
chip_sw_entropy_src_csrng 3 3 100.00
chip_sw_entropy_src_csrng 3280.350s 23921.749us 3 3 100.00
chip_sw_entropy_src_known_answer_tests 3 3 100.00
chip_sw_entropy_src_kat_test 217.870s 3394.831us 3 3 100.00
chip_sw_flash_init 3 3 100.00
chip_sw_flash_init 2049.380s 25954.905us 3 3 100.00
chip_sw_flash_host_access 6 6 100.00
chip_sw_flash_ctrl_access 768.140s 5906.014us 3 3 100.00
chip_sw_flash_ctrl_access_jitter_en 808.180s 6200.527us 3 3 100.00
chip_sw_flash_ctrl_ops 6 6 100.00
chip_sw_flash_ctrl_ops 463.520s 3781.010us 3 3 100.00
chip_sw_flash_ctrl_ops_jitter_en 509.950s 4050.318us 3 3 100.00
chip_sw_flash_rma_unlocked 3 3 100.00
chip_sw_flash_rma_unlocked 4861.890s 44392.023us 3 3 100.00
chip_sw_flash_scramble 3 3 100.00
chip_sw_flash_init 2049.380s 25954.905us 3 3 100.00
chip_sw_flash_idle_low_power 3 3 100.00
chip_sw_flash_ctrl_idle_low_power 357.020s 4311.106us 3 3 100.00
chip_sw_flash_keymgr_seeds 3 3 100.00
chip_sw_keymgr_key_derivation 1930.250s 11746.322us 3 3 100.00
chip_sw_flash_lc_creator_seed_sw_rw_en 0 3 0.00
chip_sw_flash_ctrl_lc_rw_en 234.650s 2504.530us 0 3 0.00
chip_sw_flash_creator_seed_wipe_on_rma 3 3 100.00
chip_sw_flash_rma_unlocked 4861.890s 44392.023us 3 3 100.00
chip_sw_flash_lc_owner_seed_sw_rw_en 0 3 0.00
chip_sw_flash_ctrl_lc_rw_en 234.650s 2504.530us 0 3 0.00
chip_sw_flash_lc_iso_part_sw_rd_en 0 3 0.00
chip_sw_flash_ctrl_lc_rw_en 234.650s 2504.530us 0 3 0.00
chip_sw_flash_lc_iso_part_sw_wr_en 0 3 0.00
chip_sw_flash_ctrl_lc_rw_en 234.650s 2504.530us 0 3 0.00
chip_sw_flash_lc_seed_hw_rd_en 0 3 0.00
chip_sw_flash_ctrl_lc_rw_en 234.650s 2504.530us 0 3 0.00
chip_sw_flash_lc_escalate_en 91 100 91.00
chip_sw_all_escalation_resets 632.650s 6182.028us 91 100 91.00
chip_sw_flash_prim_tl_access 3 3 100.00
chip_prim_tl_access 473.620s 13180.549us 3 3 100.00
chip_sw_flash_ctrl_clock_freqs 3 3 100.00
chip_sw_flash_ctrl_clock_freqs 734.810s 4851.832us 3 3 100.00
chip_sw_flash_ctrl_escalation_reset 3 3 100.00
chip_sw_flash_crash_alert 523.520s 4914.501us 3 3 100.00
chip_sw_flash_ctrl_write_clear 3 3 100.00
chip_sw_flash_crash_alert 523.520s 4914.501us 3 3 100.00
chip_sw_hmac_enc 6 6 100.00
chip_sw_hmac_enc 221.280s 3194.728us 3 3 100.00
chip_sw_hmac_enc_jitter_en 225.440s 3623.338us 3 3 100.00
chip_sw_hmac_idle 3 3 100.00
chip_sw_hmac_enc_idle 225.260s 3596.899us 3 3 100.00
chip_sw_hmac_all_configurations 0 3 0.00
chip_sw_hmac_oneshot 2085.650s 12018.523us 0 3 0.00
chip_sw_hmac_multistream_mode 0 3 0.00
chip_sw_hmac_multistream 2268.350s 12018.440us 0 3 0.00
chip_sw_i2c_host_tx_rx 9 9 100.00
chip_sw_i2c_host_tx_rx 635.760s 5238.993us 3 3 100.00
chip_sw_i2c_host_tx_rx_idx1 456.370s 4189.014us 3 3 100.00
chip_sw_i2c_host_tx_rx_idx2 531.190s 4934.051us 3 3 100.00
chip_sw_i2c_device_tx_rx 3 3 100.00
chip_sw_i2c_device_tx_rx 429.010s 4721.790us 3 3 100.00
chip_sw_keymgr_key_derivation 6 6 100.00
chip_sw_keymgr_key_derivation 1930.250s 11746.322us 3 3 100.00
chip_sw_keymgr_key_derivation_jitter_en 1569.520s 9834.653us 3 3 100.00
chip_sw_keymgr_sideload_kmac 3 3 100.00
chip_sw_keymgr_sideload_kmac 1943.850s 11966.022us 3 3 100.00
chip_sw_keymgr_sideload_aes 3 3 100.00
chip_sw_keymgr_sideload_aes 1870.540s 10127.918us 3 3 100.00
chip_sw_keymgr_sideload_otbn 0 3 0.00
chip_sw_keymgr_sideload_otbn 6708.680s 20026.716us 0 3 0.00
chip_sw_kmac_enc 9 9 100.00
chip_sw_kmac_mode_cshake 260.790s 3657.585us 3 3 100.00
chip_sw_kmac_mode_kmac 301.990s 3050.310us 3 3 100.00
chip_sw_kmac_mode_kmac_jitter_en 267.420s 3234.782us 3 3 100.00
chip_sw_kmac_app_keymgr 3 3 100.00
chip_sw_keymgr_key_derivation 1930.250s 11746.322us 3 3 100.00
chip_sw_kmac_app_lc 14 15 93.33
chip_sw_lc_ctrl_transition 1635.090s 30882.368us 14 15 93.33
chip_sw_kmac_app_rom 3 3 100.00
chip_sw_kmac_app_rom 226.780s 3470.011us 3 3 100.00
chip_sw_kmac_entropy 3 3 100.00
chip_sw_kmac_entropy 1945.480s 10677.354us 3 3 100.00
chip_sw_kmac_idle 3 3 100.00
chip_sw_kmac_idle 235.860s 2913.335us 3 3 100.00
chip_sw_lc_ctrl_alert_handler_escalation 3 3 100.00
chip_sw_alert_handler_escalation 534.980s 5336.382us 3 3 100.00
chip_sw_lc_ctrl_jtag_access 15 15 100.00
chip_tap_straps_dev 1259.300s 13347.983us 5 5 100.00
chip_tap_straps_rma 525.740s 6750.178us 5 5 100.00
chip_tap_straps_prod 1344.330s 17037.440us 5 5 100.00
chip_sw_lc_ctrl_otp_hw_cfg0 3 3 100.00
chip_sw_lc_ctrl_otp_hw_cfg0 209.930s 3578.427us 3 3 100.00
chip_sw_lc_ctrl_init 14 15 93.33
chip_sw_lc_ctrl_transition 1635.090s 30882.368us 14 15 93.33
chip_sw_lc_ctrl_transitions 14 15 93.33
chip_sw_lc_ctrl_transition 1635.090s 30882.368us 14 15 93.33
chip_sw_lc_ctrl_kmac_req 14 15 93.33
chip_sw_lc_ctrl_transition 1635.090s 30882.368us 14 15 93.33
chip_sw_lc_ctrl_key_div 3 3 100.00
chip_sw_keymgr_key_derivation_prod 1517.150s 11234.112us 3 3 100.00
chip_sw_lc_ctrl_broadcast 76 84 90.48
chip_sw_flash_ctrl_lc_rw_en 234.650s 2504.530us 0 3 0.00
chip_sw_flash_rma_unlocked 4861.890s 44392.023us 3 3 100.00
chip_sw_otp_ctrl_lc_signals_test_unlocked0 275.390s 2999.668us 3 3 100.00
chip_sw_otp_ctrl_lc_signals_dev 812.730s 6717.927us 3 3 100.00
chip_sw_otp_ctrl_lc_signals_prod 820.030s 8021.205us 3 3 100.00
chip_sw_otp_ctrl_lc_signals_rma 752.980s 6774.567us 0 3 0.00
chip_sw_lc_ctrl_transition 1635.090s 30882.368us 14 15 93.33
chip_sw_keymgr_key_derivation 1930.250s 11746.322us 3 3 100.00
chip_sw_rom_ctrl_integrity_check 555.870s 8751.069us 3 3 100.00
chip_sw_sram_ctrl_execution_main 813.700s 9408.769us 3 3 100.00
chip_prim_tl_access 473.620s 13180.549us 3 3 100.00
chip_sw_clkmgr_external_clk_src_for_lc 496.830s 7374.004us 3 3 100.00
chip_sw_clkmgr_external_clk_src_for_sw_fast_test_unlocked0 542.550s 4394.926us 3 3 100.00
chip_sw_clkmgr_external_clk_src_for_sw_slow_test_unlocked0 588.150s 5706.954us 3 3 100.00
chip_sw_clkmgr_external_clk_src_for_sw_fast_dev 545.500s 4342.875us 3 3 100.00
chip_sw_clkmgr_external_clk_src_for_sw_slow_dev 542.290s 5169.530us 3 3 100.00
chip_sw_clkmgr_external_clk_src_for_sw_fast_rma 510.470s 4671.473us 3 3 100.00
chip_sw_clkmgr_external_clk_src_for_sw_slow_rma 532.100s 5093.183us 3 3 100.00
chip_tap_straps_dev 1259.300s 13347.983us 5 5 100.00
chip_tap_straps_rma 525.740s 6750.178us 5 5 100.00
chip_tap_straps_prod 1344.330s 17037.440us 5 5 100.00
chip_rv_dm_lc_disabled 643.940s 15240.168us 2 3 66.67
chip_lc_scrap 6 6 100.00
chip_sw_lc_ctrl_rma_to_scrap 217.530s 3524.402us 1 1 100.00
chip_sw_lc_ctrl_raw_to_scrap 96.530s 3629.663us 1 1 100.00
chip_sw_lc_ctrl_test_locked0_to_scrap 105.130s 2534.168us 1 1 100.00
chip_sw_lc_ctrl_rand_to_scrap 118.260s 3965.708us 3 3 100.00
chip_lc_test_locked 4 6 66.67
chip_sw_lc_walkthrough_testunlocks 2129.430s 32221.137us 2 3 66.67
chip_rv_dm_lc_disabled 643.940s 15240.168us 2 3 66.67
chip_sw_lc_walkthrough 4 15 26.67
chip_sw_lc_walkthrough_dev 1337.840s 26181.248us 0 3 0.00
chip_sw_lc_walkthrough_prod 869.720s 9500.408us 0 3 0.00
chip_sw_lc_walkthrough_prodend 894.670s 26432.622us 2 3 66.67
chip_sw_lc_walkthrough_rma 582.440s 6355.112us 0 3 0.00
chip_sw_lc_walkthrough_testunlocks 2129.430s 32221.137us 2 3 66.67
chip_sw_lc_ctrl_volatile_raw_unlock 6 9 66.67
chip_sw_lc_ctrl_volatile_raw_unlock 122.580s 2478.323us 3 3 100.00
chip_sw_lc_ctrl_volatile_raw_unlock_ext_clk_48mhz 100.360s 2114.098us 3 3 100.00
rom_volatile_raw_unlock 85.845s 0.000us 0 3 0.00
chip_sw_otbn_op 6 6 100.00
chip_sw_otbn_ecdsa_op_irq 4650.950s 16986.157us 3 3 100.00
chip_sw_otbn_ecdsa_op_irq_jitter_en 4771.040s 19294.267us 3 3 100.00
chip_sw_otbn_rnd_entropy 3 3 100.00
chip_sw_otbn_randomness 792.490s 6118.587us 3 3 100.00
chip_sw_otbn_urnd_entropy 3 3 100.00
chip_sw_otbn_randomness 792.490s 6118.587us 3 3 100.00
chip_sw_otbn_idle 3 3 100.00
chip_sw_otbn_randomness 792.490s 6118.587us 3 3 100.00
chip_sw_otbn_mem_scramble 3 3 100.00
chip_sw_otbn_mem_scramble 417.670s 3487.301us 3 3 100.00
chip_otp_ctrl_init 14 15 93.33
chip_sw_lc_ctrl_transition 1635.090s 30882.368us 14 15 93.33
chip_sw_otp_ctrl_keys 15 15 100.00
chip_sw_flash_init 2049.380s 25954.905us 3 3 100.00
chip_sw_otbn_mem_scramble 417.670s 3487.301us 3 3 100.00
chip_sw_keymgr_key_derivation 1930.250s 11746.322us 3 3 100.00
chip_sw_sram_ctrl_scrambled_access 543.200s 5795.945us 3 3 100.00
chip_sw_rv_core_ibex_icache_invalidate 202.160s 3221.315us 3 3 100.00
chip_sw_otp_ctrl_entropy 15 15 100.00
chip_sw_flash_init 2049.380s 25954.905us 3 3 100.00
chip_sw_otbn_mem_scramble 417.670s 3487.301us 3 3 100.00
chip_sw_keymgr_key_derivation 1930.250s 11746.322us 3 3 100.00
chip_sw_sram_ctrl_scrambled_access 543.200s 5795.945us 3 3 100.00
chip_sw_rv_core_ibex_icache_invalidate 202.160s 3221.315us 3 3 100.00
chip_sw_otp_ctrl_program 14 15 93.33
chip_sw_lc_ctrl_transition 1635.090s 30882.368us 14 15 93.33
chip_sw_otp_ctrl_program_error 3 3 100.00
chip_sw_lc_ctrl_program_error 499.190s 5816.157us 3 3 100.00
chip_sw_otp_ctrl_hw_cfg0 3 3 100.00
chip_sw_lc_ctrl_otp_hw_cfg0 209.930s 3578.427us 3 3 100.00
chip_sw_otp_ctrl_lc_signals 26 30 86.67
chip_sw_otp_ctrl_lc_signals_test_unlocked0 275.390s 2999.668us 3 3 100.00
chip_sw_otp_ctrl_lc_signals_dev 812.730s 6717.927us 3 3 100.00
chip_sw_otp_ctrl_lc_signals_prod 820.030s 8021.205us 3 3 100.00
chip_sw_otp_ctrl_lc_signals_rma 752.980s 6774.567us 0 3 0.00
chip_sw_lc_ctrl_transition 1635.090s 30882.368us 14 15 93.33
chip_prim_tl_access 473.620s 13180.549us 3 3 100.00
chip_sw_otp_prim_tl_access 3 3 100.00
chip_prim_tl_access 473.620s 13180.549us 3 3 100.00
chip_sw_otp_ctrl_dai_lock 1 1 100.00
chip_sw_otp_ctrl_dai_lock 1121.060s 7320.315us 1 1 100.00
chip_sw_pwrmgr_external_full_reset 0 3 0.00
chip_sw_pwrmgr_full_aon_reset 256.750s 5650.190us 0 3 0.00
chip_sw_pwrmgr_random_sleep_all_wake_ups 3 3 100.00
chip_sw_pwrmgr_random_sleep_all_wake_ups 1532.870s 26795.775us 3 3 100.00
chip_sw_pwrmgr_normal_sleep_all_wake_ups 3 3 100.00
chip_sw_pwrmgr_normal_sleep_all_wake_ups 356.720s 7399.878us 3 3 100.00
chip_sw_pwrmgr_deep_sleep_por_reset 1 3 33.33
chip_sw_pwrmgr_deep_sleep_por_reset 522.680s 8067.088us 1 3 33.33
chip_sw_pwrmgr_normal_sleep_por_reset 3 3 100.00
chip_sw_pwrmgr_normal_sleep_por_reset 552.330s 7644.997us 3 3 100.00
chip_sw_pwrmgr_deep_sleep_all_wake_ups 3 3 100.00
chip_sw_pwrmgr_deep_sleep_all_wake_ups 1480.160s 25412.176us 3 3 100.00
chip_sw_pwrmgr_deep_sleep_all_reset_reqs 4 6 66.67
chip_sw_pwrmgr_deep_sleep_all_reset_reqs 1172.020s 14462.858us 3 3 100.00
chip_sw_aon_timer_wdog_bite_reset 574.540s 7732.633us 1 3 33.33
chip_sw_pwrmgr_normal_sleep_all_reset_reqs 3 3 100.00
chip_sw_pwrmgr_normal_sleep_all_reset_reqs 1025.300s 12483.381us 3 3 100.00
chip_sw_pwrmgr_wdog_reset 3 3 100.00
chip_sw_pwrmgr_wdog_reset 530.910s 5442.120us 3 3 100.00
chip_sw_pwrmgr_aon_power_glitch_reset 0 3 0.00
chip_sw_pwrmgr_full_aon_reset 256.750s 5650.190us 0 3 0.00
chip_sw_pwrmgr_main_power_glitch_reset 3 3 100.00
chip_sw_pwrmgr_main_power_glitch_reset 403.100s 4641.034us 3 3 100.00
chip_sw_pwrmgr_random_sleep_power_glitch_reset 0 3 0.00
chip_sw_pwrmgr_random_sleep_power_glitch_reset 1881.600s 20406.491us 0 3 0.00
chip_sw_pwrmgr_deep_sleep_power_glitch_reset 3 3 100.00
chip_sw_pwrmgr_deep_sleep_power_glitch_reset 419.300s 7897.273us 3 3 100.00
chip_sw_pwrmgr_sleep_power_glitch_reset 0 3 0.00
chip_sw_pwrmgr_sleep_power_glitch_reset 200.380s 3795.950us 0 3 0.00
chip_sw_pwrmgr_random_sleep_all_reset_reqs 2 3 66.67
chip_sw_pwrmgr_random_sleep_all_reset_reqs 2601.560s 25583.979us 2 3 66.67
chip_sw_pwrmgr_sysrst_ctrl_reset 6 6 100.00
chip_sw_pwrmgr_sysrst_ctrl_reset 986.430s 8176.439us 3 3 100.00
chip_sw_pwrmgr_all_reset_reqs 1359.030s 12978.095us 3 3 100.00
chip_sw_pwrmgr_b2b_sleep_reset_req 3 3 100.00
chip_sw_pwrmgr_b2b_sleep_reset_req 2627.560s 28987.913us 3 3 100.00
chip_sw_pwrmgr_sleep_disabled 3 3 100.00
chip_sw_pwrmgr_sleep_disabled 261.520s 3382.276us 3 3 100.00
chip_sw_pwrmgr_escalation_reset 91 100 91.00
chip_sw_all_escalation_resets 632.650s 6182.028us 91 100 91.00
chip_sw_rom_access 3 3 100.00
chip_sw_rom_ctrl_integrity_check 555.870s 8751.069us 3 3 100.00
chip_sw_rom_ctrl_integrity_check 3 3 100.00
chip_sw_rom_ctrl_integrity_check 555.870s 8751.069us 3 3 100.00
chip_sw_rstmgr_non_sys_reset_info 11 12 91.67
chip_sw_pwrmgr_all_reset_reqs 1359.030s 12978.095us 3 3 100.00
chip_sw_pwrmgr_random_sleep_all_reset_reqs 2601.560s 25583.979us 2 3 66.67
chip_sw_pwrmgr_wdog_reset 530.910s 5442.120us 3 3 100.00
chip_sw_pwrmgr_smoketest 398.110s 6008.598us 3 3 100.00
chip_sw_rstmgr_sys_reset_info 3 3 100.00
chip_rv_dm_ndm_reset_req 353.520s 4916.684us 3 3 100.00
chip_sw_rstmgr_cpu_info 3 3 100.00
chip_sw_rstmgr_cpu_info 610.780s 7565.081us 3 3 100.00
chip_sw_rstmgr_sw_req_reset 3 3 100.00
chip_sw_rstmgr_sw_req 451.590s 5602.105us 3 3 100.00
chip_sw_rstmgr_alert_info 3 3 100.00
chip_sw_rstmgr_alert_info 1407.220s 13305.457us 3 3 100.00
chip_sw_rstmgr_sw_rst 3 3 100.00
chip_sw_rstmgr_sw_rst 225.900s 2997.217us 3 3 100.00
chip_sw_rstmgr_escalation_reset 91 100 91.00
chip_sw_all_escalation_resets 632.650s 6182.028us 91 100 91.00
chip_sw_rstmgr_alert_handler_reset_enables 3 3 100.00
chip_sw_alert_handler_lpg_reset_toggle 1800.020s 9506.979us 3 3 100.00
chip_sw_nmi_irq 3 3 100.00
chip_sw_rv_core_ibex_nmi_irq 614.410s 5671.589us 3 3 100.00
chip_sw_rv_core_ibex_rnd 3 3 100.00
chip_sw_rv_core_ibex_rnd 639.300s 4882.621us 3 3 100.00
chip_sw_rv_core_ibex_address_translation 3 3 100.00
chip_sw_rv_core_ibex_address_translation 298.950s 3695.396us 3 3 100.00
chip_sw_rv_core_ibex_icache_scrambled_access 3 3 100.00
chip_sw_rv_core_ibex_icache_invalidate 202.160s 3221.315us 3 3 100.00
chip_sw_rv_core_ibex_fault_dump 3 3 100.00
chip_sw_rstmgr_cpu_info 610.780s 7565.081us 3 3 100.00
chip_sw_rv_core_ibex_double_fault 3 3 100.00
chip_sw_rstmgr_cpu_info 610.780s 7565.081us 3 3 100.00
chip_sw_rv_core_ibex_mcounteren_writable 3 3 100.00
chip_sw_rv_core_ibex_mcounteren_writable 266.630s 2796.968us 3 3 100.00
chip_jtag_csr_rw 3 3 100.00
chip_jtag_csr_rw 1584.860s 18267.865us 3 3 100.00
chip_jtag_mem_access 3 3 100.00
chip_jtag_mem_access 1273.410s 14131.002us 3 3 100.00
chip_rv_dm_ndm_reset_req 3 3 100.00
chip_rv_dm_ndm_reset_req 353.520s 4916.684us 3 3 100.00
chip_sw_rv_dm_ndm_reset_req_when_cpu_halted 0 3 0.00
chip_sw_rv_dm_ndm_reset_req_when_cpu_halted 244.320s 3315.218us 0 3 0.00
chip_rv_dm_access_after_wakeup 3 3 100.00
chip_sw_rv_dm_access_after_wakeup 453.030s 7114.372us 3 3 100.00
chip_sw_rv_dm_jtag_tap_sel 5 5 100.00
chip_tap_straps_rma 525.740s 6750.178us 5 5 100.00
chip_rv_dm_lc_disabled 2 3 66.67
chip_rv_dm_lc_disabled 643.940s 15240.168us 2 3 66.67
chip_sw_plic_all_irqs 9 9 100.00
chip_plic_all_irqs_0 707.420s 5056.810us 3 3 100.00
chip_plic_all_irqs_10 438.050s 3660.250us 3 3 100.00
chip_plic_all_irqs_20 522.970s 3973.002us 3 3 100.00
chip_sw_plic_sw_irq 3 3 100.00
chip_sw_plic_sw_irq 229.860s 3104.846us 3 3 100.00
chip_sw_timer 3 3 100.00
chip_sw_rv_timer_irq 230.550s 3460.486us 3 3 100.00
chip_sw_spi_device_flash_mode 3 3 100.00
rom_e2e_smoke 3906.900s 17268.086us 3 3 100.00
chip_sw_spi_device_pass_through 3 3 100.00
chip_sw_spi_device_pass_through 475.020s 5285.591us 3 3 100.00
chip_sw_spi_device_pass_through_collision 0 3 0.00
chip_sw_spi_device_pass_through_collision 309.570s 3441.864us 0 3 0.00
chip_sw_spi_device_tpm 3 3 100.00
chip_sw_spi_device_tpm 296.450s 3761.821us 3 3 100.00
chip_sw_spi_host_tx_rx 3 3 100.00
chip_sw_spi_host_tx_rx 270.830s 3049.411us 3 3 100.00
chip_sw_sram_scrambled_access 6 6 100.00
chip_sw_sram_ctrl_scrambled_access 543.200s 5795.945us 3 3 100.00
chip_sw_sram_ctrl_scrambled_access_jitter_en 589.420s 5054.804us 3 3 100.00
chip_sw_sleep_sram_ret_contents 6 6 100.00
chip_sw_sleep_sram_ret_contents_no_scramble 722.910s 10078.461us 3 3 100.00
chip_sw_sleep_sram_ret_contents_scramble 549.270s 9405.235us 3 3 100.00
chip_sw_sram_execution 3 3 100.00
chip_sw_sram_ctrl_execution_main 813.700s 9408.769us 3 3 100.00
chip_sw_sram_lc_escalation 97 106 91.51
chip_sw_all_escalation_resets 632.650s 6182.028us 91 100 91.00
chip_sw_data_integrity_escalation 631.320s 6428.551us 6 6 100.00
chip_sw_sysrst_ctrl_reset 6 6 100.00
chip_sw_pwrmgr_sysrst_ctrl_reset 986.430s 8176.439us 3 3 100.00
chip_sw_sysrst_ctrl_reset 1329.080s 24318.182us 3 3 100.00
chip_sw_sysrst_ctrl_inputs 3 3 100.00
chip_sw_sysrst_ctrl_inputs 228.380s 2766.758us 3 3 100.00
chip_sw_sysrst_ctrl_outputs 3 3 100.00
chip_sw_sysrst_ctrl_outputs 303.220s 4089.672us 3 3 100.00
chip_sw_sysrst_ctrl_in_irq 3 3 100.00
chip_sw_sysrst_ctrl_in_irq 456.120s 4631.605us 3 3 100.00
chip_sw_sysrst_ctrl_sleep_wakeup 3 3 100.00
chip_sw_sysrst_ctrl_reset 1329.080s 24318.182us 3 3 100.00
chip_sw_sysrst_ctrl_sleep_reset 3 3 100.00
chip_sw_sysrst_ctrl_reset 1329.080s 24318.182us 3 3 100.00
chip_sw_sysrst_ctrl_ec_rst_l 3 3 100.00
chip_sw_sysrst_ctrl_ec_rst_l 3191.160s 20029.528us 3 3 100.00
chip_sw_sysrst_ctrl_flash_wp_l 3 3 100.00
chip_sw_sysrst_ctrl_ec_rst_l 3191.160s 20029.528us 3 3 100.00
chip_sw_sysrst_ctrl_ulp_z3_wakeup 3 6 50.00
chip_sw_sysrst_ctrl_ulp_z3_wakeup 469.900s 6668.025us 3 3 100.00
chip_sw_adc_ctrl_sleep_debug_cable_wakeup 3600.176s 0.000us 0 3 0.00
chip_sw_usbdev_vbus 1 1 100.00
chip_sw_usbdev_vbus 208.630s 3186.615us 1 1 100.00
chip_sw_usbdev_pullup 1 1 100.00
chip_sw_usbdev_pullup 222.470s 2815.015us 1 1 100.00
chip_sw_usbdev_aon_pullup 1 1 100.00
chip_sw_usbdev_aon_pullup 410.700s 4273.973us 1 1 100.00
chip_sw_usbdev_setup_rx 1 1 100.00
chip_sw_usbdev_setuprx 479.370s 4421.583us 1 1 100.00
chip_sw_usbdev_config_host 1 1 100.00
chip_sw_usbdev_config_host 1281.310s 7806.139us 1 1 100.00
chip_sw_usbdev_pincfg 1 1 100.00
chip_sw_usbdev_pincfg 6787.050s 31846.066us 1 1 100.00
chip_sw_usbdev_tx_rx 1 1 100.00
chip_sw_usbdev_dpi 2248.100s 12638.184us 1 1 100.00
chip_sw_usbdev_toggle_restore 1 1 100.00
chip_sw_usbdev_toggle_restore 198.450s 2712.278us 1 1 100.00
Testpoint Test Max Runtime Sim Time Pass Total %
chip_sw_aes_masking_off 3 3 100.00
chip_sw_aes_masking_off 242.130s 3348.082us 3 3 100.00
chip_sw_rv_core_ibex_lockstep_glitch 3 3 100.00
chip_sw_rv_core_ibex_lockstep_glitch 144.770s 3025.506us 3 3 100.00
Testpoint Test Max Runtime Sim Time Pass Total %
chip_sw_coremark 1 1 100.00
chip_sw_coremark 16459.640s 71526.515us 1 1 100.00
chip_sw_power_max_load 3 3 100.00
chip_sw_power_virus 1485.620s 6511.014us 3 3 100.00
rom_e2e_debug 0 3 0.00
rom_e2e_jtag_debug_test_unlocked0 649.450s 7045.539us 0 1 0.00
rom_e2e_jtag_debug_dev 349.700s 4891.810us 0 1 0.00
rom_e2e_jtag_debug_rma 293.420s 4332.715us 0 1 0.00
rom_e2e_jtag_inject 0 3 0.00
rom_e2e_jtag_inject_test_unlocked0 101.220s 2885.287us 0 1 0.00
rom_e2e_jtag_inject_dev 119.590s 2534.086us 0 1 0.00
rom_e2e_jtag_inject_rma 121.800s 2532.809us 0 1 0.00
rom_e2e_self_hash 0 3 0.00
rom_e2e_self_hash 43.818s 0.000us 0 3 0.00
chip_sw_clkmgr_jitter_cycle_measurements 0 3 0.00
chip_sw_clkmgr_jitter_frequency 412.470s 4077.654us 0 3 0.00
chip_sw_edn_boot_mode 3 3 100.00
chip_sw_edn_boot_mode 442.340s 3027.078us 3 3 100.00
chip_sw_edn_auto_mode 3 3 100.00
chip_sw_edn_auto_mode 744.550s 4500.450us 3 3 100.00
chip_sw_edn_sw_mode 3 3 100.00
chip_sw_edn_sw_mode 1859.960s 10836.821us 3 3 100.00
chip_sw_edn_kat 3 3 100.00
chip_sw_edn_kat 300.700s 2239.854us 3 3 100.00
chip_sw_flash_memory_protection 3 3 100.00
chip_sw_flash_ctrl_mem_protection 813.250s 5564.788us 3 3 100.00
chip_sw_otp_ctrl_vendor_test_csr_access 3 3 100.00
chip_sw_otp_ctrl_vendor_test_csr_access 228.800s 3161.203us 3 3 100.00
chip_sw_otp_ctrl_escalation 0 1 0.00
chip_sw_otp_ctrl_escalation 200.230s 3237.804us 0 1 0.00
chip_sw_sensor_ctrl_deep_sleep_wake_up 3 3 100.00
chip_sw_pwrmgr_sensor_ctrl_deep_sleep_wake_up 358.610s 7138.636us 3 3 100.00
chip_sw_pwrmgr_usb_clk_disabled_when_active 3 3 100.00
chip_sw_pwrmgr_usb_clk_disabled_when_active 455.070s 4766.375us 3 3 100.00
chip_sw_all_resets 3 3 100.00
chip_sw_pwrmgr_all_reset_reqs 1359.030s 12978.095us 3 3 100.00
chip_rv_dm_perform_debug 0 3 0.00
rom_e2e_jtag_debug_test_unlocked0 649.450s 7045.539us 0 1 0.00
rom_e2e_jtag_debug_dev 349.700s 4891.810us 0 1 0.00
rom_e2e_jtag_debug_rma 293.420s 4332.715us 0 1 0.00
chip_sw_rv_dm_access_after_hw_reset 3 3 100.00
chip_sw_rv_dm_access_after_escalation_reset 503.470s 4906.795us 3 3 100.00
chip_sw_plic_alerts 91 100 91.00
chip_sw_all_escalation_resets 632.650s 6182.028us 91 100 91.00
tick_configuration 0 3 0.00
chip_sw_rv_timer_systick_test 7200.179s 0.000us 0 3 0.00
counter_wrap 0 3 0.00
chip_sw_rv_timer_systick_test 7200.179s 0.000us 0 3 0.00
chip_sw_spi_device_output_when_disabled_or_sleeping 3 3 100.00
chip_sw_spi_device_pinmux_sleep_retention 241.660s 3794.340us 3 3 100.00
chip_sw_uart_watermarks 5 5 100.00
chip_sw_uart_tx_rx 515.190s 4935.464us 5 5 100.00
chip_sw_usbdev_stream 1 1 100.00
chip_sw_usbdev_stream 4187.520s 18713.304us 1 1 100.00
Testpoint Test Max Runtime Sim Time Pass Total %
Unmapped 17 31 54.84
chip_sival_flash_info_access 289.070s 3906.184us 3 3 100.00
chip_sw_rstmgr_rst_cnsty_escalation 32.550s 10.160us 0 3 0.00
chip_sw_otp_ctrl_rot_auth_config 5.610s 0.000us 0 1 0.00
chip_sw_otp_ctrl_ecc_error_vendor_test 242.600s 2797.848us 3 3 100.00
chip_sw_otp_ctrl_descrambling 297.320s 3858.079us 3 3 100.00
chip_sw_pwrmgr_lowpower_cancel 329.080s 4009.547us 2 3 66.67
chip_sw_pwrmgr_sleep_wake_5_bug 13.586s 0.000us 0 3 0.00
chip_sw_flash_ctrl_write_clear 273.860s 2973.929us 3 3 100.00
ate_bootstrap_flash_erase 941.820s 10010.160us 0 3 0.00
ate_bootstrap_one_frame 9433.900s 44947.363us 3 3 100.00
ate_bootstrap_disjoint 10800.173s 0.000us 0 3 0.00

Error Messages

   Test seed line log context
UVM_ERROR @ * us: (sw_logger_if.sv:526) [alert_handler_lpg_sleep_mode_alerts_test_sim_dv(sw/device/lib/testing/ret_sram_testutils.c:67)] CHECK-fail: testing_utilities != ((void*)0) 90 test runs
chip_sw_alert_handler_lpg_sleep_mode_alerts 44461968212694421102467237526518764200993864832561479824606589534289498562773 308
UVM_INFO @ 2783.440590 us: (uvm_report_catcher.svh:705) [UVM/REPORT/CATCHER]
--- UVM Report catcher Summary ---
chip_sw_alert_handler_lpg_sleep_mode_alerts 73214024967292210290805510675238735871802407623446400181718274240217393052910 308
UVM_INFO @ 2442.268912 us: (uvm_report_catcher.svh:705) [UVM/REPORT/CATCHER]
--- UVM Report catcher Summary ---
chip_sw_alert_handler_lpg_sleep_mode_alerts 5543734638447876031725609896286018096923641427803607344249707241216114245410 308
UVM_INFO @ 2711.612383 us: (uvm_report_catcher.svh:705) [UVM/REPORT/CATCHER]
--- UVM Report catcher Summary ---
chip_sw_alert_handler_lpg_sleep_mode_alerts 97907797463428558359770783872910745171502027193087472443107563715302890052701 308
UVM_INFO @ 2801.970872 us: (uvm_report_catcher.svh:705) [UVM/REPORT/CATCHER]
--- UVM Report catcher Summary ---
chip_sw_alert_handler_lpg_sleep_mode_alerts 2585898039308435575822953791692292694911448354354558445836654106396815076995 308
UVM_INFO @ 2560.330957 us: (uvm_report_catcher.svh:705) [UVM/REPORT/CATCHER]
--- UVM Report catcher Summary ---
chip_sw_alert_handler_lpg_sleep_mode_alerts 57971903703463948097092295452861006467392668656873087767832555076224961954396 308
UVM_INFO @ 2535.312414 us: (uvm_report_catcher.svh:705) [UVM/REPORT/CATCHER]
--- UVM Report catcher Summary ---
chip_sw_alert_handler_lpg_sleep_mode_alerts 92269591975814382565002756632904250820935226402053264214402595224356480518185 308
UVM_INFO @ 3033.935300 us: (uvm_report_catcher.svh:705) [UVM/REPORT/CATCHER]
--- UVM Report catcher Summary ---
chip_sw_alert_handler_lpg_sleep_mode_alerts 30441479077933846327940360534691190764056690885247589963272051557794056335634 308
UVM_INFO @ 2989.368578 us: (uvm_report_catcher.svh:705) [UVM/REPORT/CATCHER]
--- UVM Report catcher Summary ---
chip_sw_alert_handler_lpg_sleep_mode_alerts 60830893159794180293522947435149480513044151961370848959388736085333537098363 308
UVM_INFO @ 2973.710310 us: (uvm_report_catcher.svh:705) [UVM/REPORT/CATCHER]
--- UVM Report catcher Summary ---
chip_sw_alert_handler_lpg_sleep_mode_alerts 102209251044523153808558589718441523294247915811664158422135615760851536372671 308
UVM_INFO @ 3124.359610 us: (uvm_report_catcher.svh:705) [UVM/REPORT/CATCHER]
--- UVM Report catcher Summary ---
chip_sw_alert_handler_lpg_sleep_mode_alerts 2564763443331941307809146370602544409036561194730165740053365801146616960362 308
UVM_INFO @ 2448.626272 us: (uvm_report_catcher.svh:705) [UVM/REPORT/CATCHER]
--- UVM Report catcher Summary ---
chip_sw_alert_handler_lpg_sleep_mode_alerts 14056846193386703992267257591754851599056960834883978568746341200752390443255 308
UVM_INFO @ 3498.592186 us: (uvm_report_catcher.svh:705) [UVM/REPORT/CATCHER]
--- UVM Report catcher Summary ---
chip_sw_alert_handler_lpg_sleep_mode_alerts 7176776673381258279985601965373024990122991066590276032080024763861508863852 308
UVM_INFO @ 2366.410046 us: (uvm_report_catcher.svh:705) [UVM/REPORT/CATCHER]
--- UVM Report catcher Summary ---
chip_sw_alert_handler_lpg_sleep_mode_alerts 19658208887217768200973196496067630032928146534850194164490686538999784505698 308
UVM_INFO @ 3027.235000 us: (uvm_report_catcher.svh:705) [UVM/REPORT/CATCHER]
--- UVM Report catcher Summary ---
chip_sw_alert_handler_lpg_sleep_mode_alerts 55109249060259340425460200916633365878031303779351126209853623743855581810763 308
UVM_INFO @ 3158.477699 us: (uvm_report_catcher.svh:705) [UVM/REPORT/CATCHER]
--- UVM Report catcher Summary ---
chip_sw_alert_handler_lpg_sleep_mode_alerts 11091346442370137199793760818444333722509649677339723575232759446187536945951 308
UVM_INFO @ 3025.022034 us: (uvm_report_catcher.svh:705) [UVM/REPORT/CATCHER]
--- UVM Report catcher Summary ---
chip_sw_alert_handler_lpg_sleep_mode_alerts 85885883222603505694258398618042433855452671370015977764941200559786611081172 308
UVM_INFO @ 3717.334531 us: (uvm_report_catcher.svh:705) [UVM/REPORT/CATCHER]
--- UVM Report catcher Summary ---
chip_sw_alert_handler_lpg_sleep_mode_alerts 59866081606442980184809743035894855150612428300427493313650742170549158657338 308
UVM_INFO @ 2732.975190 us: (uvm_report_catcher.svh:705) [UVM/REPORT/CATCHER]
--- UVM Report catcher Summary ---
chip_sw_alert_handler_lpg_sleep_mode_alerts 55066220019273142291026738861170301271081612628057691368613063411382141171683 308
UVM_INFO @ 2708.677708 us: (uvm_report_catcher.svh:705) [UVM/REPORT/CATCHER]
--- UVM Report catcher Summary ---
chip_sw_alert_handler_lpg_sleep_mode_alerts 24456902424334696542895011123401153369743342636174043565502107221150013721495 308
UVM_INFO @ 2526.802968 us: (uvm_report_catcher.svh:705) [UVM/REPORT/CATCHER]
--- UVM Report catcher Summary ---
chip_sw_alert_handler_lpg_sleep_mode_alerts 57317264435218156925736715769536005153263648619096361934665809353850404359923 308
UVM_INFO @ 3010.282844 us: (uvm_report_catcher.svh:705) [UVM/REPORT/CATCHER]
--- UVM Report catcher Summary ---
chip_sw_alert_handler_lpg_sleep_mode_alerts 12580877665031058099184304885210047542585523084109894374172879761654315726451 308
UVM_INFO @ 2380.800946 us: (uvm_report_catcher.svh:705) [UVM/REPORT/CATCHER]
--- UVM Report catcher Summary ---
chip_sw_alert_handler_lpg_sleep_mode_alerts 94933308533238895612954295355491950336799468990111260669966027435791587508930 308
UVM_INFO @ 3091.417600 us: (uvm_report_catcher.svh:705) [UVM/REPORT/CATCHER]
--- UVM Report catcher Summary ---
chip_sw_alert_handler_lpg_sleep_mode_alerts 90341532929397715461388808698927113017992236881964757064490930924635123283478 308
UVM_INFO @ 2627.209726 us: (uvm_report_catcher.svh:705) [UVM/REPORT/CATCHER]
--- UVM Report catcher Summary ---
chip_sw_alert_handler_lpg_sleep_mode_alerts 45354149646450576628878791394201904005295184326514351508790516772890812305389 308
UVM_INFO @ 3140.960272 us: (uvm_report_catcher.svh:705) [UVM/REPORT/CATCHER]
--- UVM Report catcher Summary ---
chip_sw_alert_handler_lpg_sleep_mode_alerts 105205522457969754290603095957632967045163652272467458480934357989566004577736 308
UVM_INFO @ 3242.348345 us: (uvm_report_catcher.svh:705) [UVM/REPORT/CATCHER]
--- UVM Report catcher Summary ---
chip_sw_alert_handler_lpg_sleep_mode_alerts 47357894536025413275539681418103980419460606595979718815787398515251612250665 308
UVM_INFO @ 3283.080912 us: (uvm_report_catcher.svh:705) [UVM/REPORT/CATCHER]
--- UVM Report catcher Summary ---
chip_sw_alert_handler_lpg_sleep_mode_alerts 3587256004654526420182832611243994123052416002561962779529951322193742813576 308
UVM_INFO @ 2785.640200 us: (uvm_report_catcher.svh:705) [UVM/REPORT/CATCHER]
--- UVM Report catcher Summary ---
chip_sw_alert_handler_lpg_sleep_mode_alerts 113007054543633339363488208870880602987177611447809641997338619668699359844186 308
UVM_INFO @ 3022.225902 us: (uvm_report_catcher.svh:705) [UVM/REPORT/CATCHER]
--- UVM Report catcher Summary ---
chip_sw_alert_handler_lpg_sleep_mode_alerts 49528052037026867900076513637409150837302903950545625645489215103408322015668 308
UVM_INFO @ 3293.190334 us: (uvm_report_catcher.svh:705) [UVM/REPORT/CATCHER]
--- UVM Report catcher Summary ---
chip_sw_alert_handler_lpg_sleep_mode_alerts 82528689493767545480171819068375015683094066008878319141975138803962975281108 308
UVM_INFO @ 2905.178687 us: (uvm_report_catcher.svh:705) [UVM/REPORT/CATCHER]
--- UVM Report catcher Summary ---
chip_sw_alert_handler_lpg_sleep_mode_alerts 115168974553490310194500532421099512768661974864415958093631553532488504541917 308
UVM_INFO @ 3263.346198 us: (uvm_report_catcher.svh:705) [UVM/REPORT/CATCHER]
--- UVM Report catcher Summary ---
chip_sw_alert_handler_lpg_sleep_mode_alerts 56298175438495709724198042582063043904546818562668460269004147876215058623469 308
UVM_INFO @ 3311.329220 us: (uvm_report_catcher.svh:705) [UVM/REPORT/CATCHER]
--- UVM Report catcher Summary ---
chip_sw_alert_handler_lpg_sleep_mode_alerts 42481279286091707362337659380688602743516319870677580062786846276613552467853 308
UVM_INFO @ 2615.790852 us: (uvm_report_catcher.svh:705) [UVM/REPORT/CATCHER]
--- UVM Report catcher Summary ---
chip_sw_alert_handler_lpg_sleep_mode_alerts 86652525947054255798702186260909875524998436313891215887492092783585047603115 308
UVM_INFO @ 2892.459294 us: (uvm_report_catcher.svh:705) [UVM/REPORT/CATCHER]
--- UVM Report catcher Summary ---
chip_sw_alert_handler_lpg_sleep_mode_alerts 66036909587238380354245761934616815115119807370995342815281441107314924967555 308
UVM_INFO @ 2798.282979 us: (uvm_report_catcher.svh:705) [UVM/REPORT/CATCHER]
--- UVM Report catcher Summary ---
chip_sw_alert_handler_lpg_sleep_mode_alerts 100611131680019302290099183907259280102805539166735226296885238186823888261225 308
UVM_INFO @ 3520.459652 us: (uvm_report_catcher.svh:705) [UVM/REPORT/CATCHER]
--- UVM Report catcher Summary ---
chip_sw_alert_handler_lpg_sleep_mode_alerts 55650720139105945941625199633627129102616963026483233578958696735773709899997 308
UVM_INFO @ 3349.755204 us: (uvm_report_catcher.svh:705) [UVM/REPORT/CATCHER]
--- UVM Report catcher Summary ---
chip_sw_alert_handler_lpg_sleep_mode_alerts 35100902433858394692166732271334800924103505479276428155718514350060218069536 308
UVM_INFO @ 2550.498854 us: (uvm_report_catcher.svh:705) [UVM/REPORT/CATCHER]
--- UVM Report catcher Summary ---
chip_sw_alert_handler_lpg_sleep_mode_alerts 3943792514490292127367317760583453352062451349699599263078571678929770534279 308
UVM_INFO @ 2756.708414 us: (uvm_report_catcher.svh:705) [UVM/REPORT/CATCHER]
--- UVM Report catcher Summary ---
chip_sw_alert_handler_lpg_sleep_mode_alerts 88793932744596152940988644934574928068822444956414197717010137217243907685478 308
UVM_INFO @ 2883.906536 us: (uvm_report_catcher.svh:705) [UVM/REPORT/CATCHER]
--- UVM Report catcher Summary ---
chip_sw_alert_handler_lpg_sleep_mode_alerts 46157751608549968423074133708787718494082527729917404155498090765716213904251 308
UVM_INFO @ 2731.343264 us: (uvm_report_catcher.svh:705) [UVM/REPORT/CATCHER]
--- UVM Report catcher Summary ---
chip_sw_alert_handler_lpg_sleep_mode_alerts 82682966514631253669919024275843274263380358937650728847262356484430799329801 308
UVM_INFO @ 3346.618440 us: (uvm_report_catcher.svh:705) [UVM/REPORT/CATCHER]
--- UVM Report catcher Summary ---
chip_sw_alert_handler_lpg_sleep_mode_alerts 29406786889940654622062859605347805941231541953573957042809318368375846942174 308
UVM_INFO @ 2579.960971 us: (uvm_report_catcher.svh:705) [UVM/REPORT/CATCHER]
--- UVM Report catcher Summary ---
chip_sw_alert_handler_lpg_sleep_mode_alerts 77029193519954782116915505361238733531622146139599705038156514596702118047548 308
UVM_INFO @ 3076.525376 us: (uvm_report_catcher.svh:705) [UVM/REPORT/CATCHER]
--- UVM Report catcher Summary ---
chip_sw_alert_handler_lpg_sleep_mode_alerts 69464318696398314411314633055816117686983876985895630897828091494479342314543 308
UVM_INFO @ 2983.756444 us: (uvm_report_catcher.svh:705) [UVM/REPORT/CATCHER]
--- UVM Report catcher Summary ---
chip_sw_alert_handler_lpg_sleep_mode_alerts 44444704631571641487082899440731556290153205028558625248918119458444273981722 308
UVM_INFO @ 2958.293093 us: (uvm_report_catcher.svh:705) [UVM/REPORT/CATCHER]
--- UVM Report catcher Summary ---
chip_sw_alert_handler_lpg_sleep_mode_alerts 12475622137966465615883254969916739111213804209683123310699894047812171048120 308
UVM_INFO @ 3242.344349 us: (uvm_report_catcher.svh:705) [UVM/REPORT/CATCHER]
--- UVM Report catcher Summary ---
chip_sw_alert_handler_lpg_sleep_mode_alerts 110692879711661795823146465964854577421151155068577494405885676105102460608912 308
UVM_INFO @ 2781.169875 us: (uvm_report_catcher.svh:705) [UVM/REPORT/CATCHER]
--- UVM Report catcher Summary ---
chip_sw_alert_handler_lpg_sleep_mode_alerts 48476788663685848581441641810005014223717569009095863516352933677939806894386 308
UVM_INFO @ 2513.441240 us: (uvm_report_catcher.svh:705) [UVM/REPORT/CATCHER]
--- UVM Report catcher Summary ---
chip_sw_alert_handler_lpg_sleep_mode_alerts 88334967865200729647244333233832740160797102166347844156337921180157174750732 308
UVM_INFO @ 2420.618305 us: (uvm_report_catcher.svh:705) [UVM/REPORT/CATCHER]
--- UVM Report catcher Summary ---
chip_sw_alert_handler_lpg_sleep_mode_alerts 75896368005365796502029228679804206470041907560412336026273981289331765585928 308
UVM_INFO @ 3028.295284 us: (uvm_report_catcher.svh:705) [UVM/REPORT/CATCHER]
--- UVM Report catcher Summary ---
chip_sw_alert_handler_lpg_sleep_mode_alerts 78338979401926246178939017315392375654643569578864873366861364925040123042923 308
UVM_INFO @ 2385.090664 us: (uvm_report_catcher.svh:705) [UVM/REPORT/CATCHER]
--- UVM Report catcher Summary ---
chip_sw_alert_handler_lpg_sleep_mode_alerts 26058896501307589271492206374997151064085808066511517960223752388106416800481 308
UVM_INFO @ 3123.623993 us: (uvm_report_catcher.svh:705) [UVM/REPORT/CATCHER]
--- UVM Report catcher Summary ---
chip_sw_alert_handler_lpg_sleep_mode_alerts 77435478138997639569763037699666363879032081177486583777361790255399424426290 308
UVM_INFO @ 2530.589671 us: (uvm_report_catcher.svh:705) [UVM/REPORT/CATCHER]
--- UVM Report catcher Summary ---
chip_sw_alert_handler_lpg_sleep_mode_alerts 25388204287166345279440089044653876491879180478401844633510308764162404567636 308
UVM_INFO @ 2669.589796 us: (uvm_report_catcher.svh:705) [UVM/REPORT/CATCHER]
--- UVM Report catcher Summary ---
chip_sw_alert_handler_lpg_sleep_mode_alerts 25512915578783549497554127887922308455957687431098919554396636881960140658211 308
UVM_INFO @ 3447.972544 us: (uvm_report_catcher.svh:705) [UVM/REPORT/CATCHER]
--- UVM Report catcher Summary ---
chip_sw_alert_handler_lpg_sleep_mode_alerts 34149072180289612203081717341641498286322743826358866922557601072896504768234 308
UVM_INFO @ 2389.924968 us: (uvm_report_catcher.svh:705) [UVM/REPORT/CATCHER]
--- UVM Report catcher Summary ---
chip_sw_alert_handler_lpg_sleep_mode_alerts 43449048506529331832563521370641560639236680472118770241984706125175312468691 308
UVM_INFO @ 2998.231288 us: (uvm_report_catcher.svh:705) [UVM/REPORT/CATCHER]
--- UVM Report catcher Summary ---
chip_sw_alert_handler_lpg_sleep_mode_alerts 98433257731381542975216416442867643873293308171696443992387032826256970582146 308
UVM_INFO @ 2922.149200 us: (uvm_report_catcher.svh:705) [UVM/REPORT/CATCHER]
--- UVM Report catcher Summary ---
chip_sw_alert_handler_lpg_sleep_mode_alerts 102679857804319119150935586853228841049264759978330798395189018685016786228928 308
UVM_INFO @ 2878.012196 us: (uvm_report_catcher.svh:705) [UVM/REPORT/CATCHER]
--- UVM Report catcher Summary ---
chip_sw_alert_handler_lpg_sleep_mode_alerts 66516047961696372116316765565240204006463954339720777455010032440366462231355 308
UVM_INFO @ 3501.420422 us: (uvm_report_catcher.svh:705) [UVM/REPORT/CATCHER]
--- UVM Report catcher Summary ---
chip_sw_alert_handler_lpg_sleep_mode_alerts 11599186341439844377773039696854277400334561703900151760128454224846754239661 308
UVM_INFO @ 2728.999682 us: (uvm_report_catcher.svh:705) [UVM/REPORT/CATCHER]
--- UVM Report catcher Summary ---
chip_sw_alert_handler_lpg_sleep_mode_alerts 23945472129525607306698459948310972977844507289431717947895995882883268819155 308
UVM_INFO @ 3235.663704 us: (uvm_report_catcher.svh:705) [UVM/REPORT/CATCHER]
--- UVM Report catcher Summary ---
chip_sw_alert_handler_lpg_sleep_mode_alerts 62780716681549874202072350863054924109902058727438676264058462002108663013022 308
UVM_INFO @ 2303.376010 us: (uvm_report_catcher.svh:705) [UVM/REPORT/CATCHER]
--- UVM Report catcher Summary ---
chip_sw_alert_handler_lpg_sleep_mode_alerts 55190969539157903002125774629338136576147927175782991393508515730430090427059 308
UVM_INFO @ 2223.326032 us: (uvm_report_catcher.svh:705) [UVM/REPORT/CATCHER]
--- UVM Report catcher Summary ---
chip_sw_alert_handler_lpg_sleep_mode_alerts 5386622372583535202862475227083064808169855198289101088143201731533557261897 308
UVM_INFO @ 2519.246552 us: (uvm_report_catcher.svh:705) [UVM/REPORT/CATCHER]
--- UVM Report catcher Summary ---
chip_sw_alert_handler_lpg_sleep_mode_alerts 26260266963338033084152904629528078616635362231689782176945448080713242635036 308
UVM_INFO @ 3359.771332 us: (uvm_report_catcher.svh:705) [UVM/REPORT/CATCHER]
--- UVM Report catcher Summary ---
chip_sw_alert_handler_lpg_sleep_mode_alerts 42943970935021709855495805292577155797466741438532027802970124105010145648076 308
UVM_INFO @ 3368.491631 us: (uvm_report_catcher.svh:705) [UVM/REPORT/CATCHER]
--- UVM Report catcher Summary ---
chip_sw_alert_handler_lpg_sleep_mode_alerts 69031793363832847664628708022404377156195416174488325195209795242497214779020 308
UVM_INFO @ 2513.241330 us: (uvm_report_catcher.svh:705) [UVM/REPORT/CATCHER]
--- UVM Report catcher Summary ---
chip_sw_alert_handler_lpg_sleep_mode_alerts 34256468905247653798530871855531419622510295596685502922855258089749851835391 308
UVM_INFO @ 3603.652500 us: (uvm_report_catcher.svh:705) [UVM/REPORT/CATCHER]
--- UVM Report catcher Summary ---
chip_sw_alert_handler_lpg_sleep_mode_alerts 79273737502216110255828288016370373597086307003351295847822746031615887315061 308
UVM_INFO @ 3611.986003 us: (uvm_report_catcher.svh:705) [UVM/REPORT/CATCHER]
--- UVM Report catcher Summary ---
chip_sw_alert_handler_lpg_sleep_mode_alerts 14653821074310563383357719052432317523762784527218106313622978345344611255130 308
UVM_INFO @ 2969.037562 us: (uvm_report_catcher.svh:705) [UVM/REPORT/CATCHER]
--- UVM Report catcher Summary ---
chip_sw_alert_handler_lpg_sleep_mode_alerts 52241412660071269947001112525412952878298482878414214729294198115401434041309 308
UVM_INFO @ 2717.423480 us: (uvm_report_catcher.svh:705) [UVM/REPORT/CATCHER]
--- UVM Report catcher Summary ---
chip_sw_alert_handler_lpg_sleep_mode_alerts 56703443184398828080890718954976301608507721082789832680230136829645994846139 308
UVM_INFO @ 2892.055430 us: (uvm_report_catcher.svh:705) [UVM/REPORT/CATCHER]
--- UVM Report catcher Summary ---
chip_sw_alert_handler_lpg_sleep_mode_alerts 97439434077406344920449818177121434088759686909976670157103744410622585039140 308
UVM_INFO @ 2821.762408 us: (uvm_report_catcher.svh:705) [UVM/REPORT/CATCHER]
--- UVM Report catcher Summary ---
chip_sw_alert_handler_lpg_sleep_mode_alerts 83710702762222812876461681663244603995011863992940080223132138007317889357755 308
UVM_INFO @ 2936.920154 us: (uvm_report_catcher.svh:705) [UVM/REPORT/CATCHER]
--- UVM Report catcher Summary ---
chip_sw_alert_handler_lpg_sleep_mode_alerts 93911326252855444727762122120090110106465393072621670044606099389145851575515 308
UVM_INFO @ 3209.976703 us: (uvm_report_catcher.svh:705) [UVM/REPORT/CATCHER]
--- UVM Report catcher Summary ---
chip_sw_alert_handler_lpg_sleep_mode_alerts 67865454400913440098966312871167971106400539722366587986670145675827235977970 308
UVM_INFO @ 2703.723896 us: (uvm_report_catcher.svh:705) [UVM/REPORT/CATCHER]
--- UVM Report catcher Summary ---
chip_sw_alert_handler_lpg_sleep_mode_alerts 104294727538211974962622042023755561700848595281736629961806830342947202036009 308
UVM_INFO @ 2892.326550 us: (uvm_report_catcher.svh:705) [UVM/REPORT/CATCHER]
--- UVM Report catcher Summary ---
chip_sw_alert_handler_lpg_sleep_mode_alerts 114381900257621906189766652764939392310598675407535655367517224535201068393304 308
UVM_INFO @ 3015.360224 us: (uvm_report_catcher.svh:705) [UVM/REPORT/CATCHER]
--- UVM Report catcher Summary ---
chip_sw_alert_handler_lpg_sleep_mode_alerts 17582993799062004011642343713327321114292001101926708645621600686101859060886 308
UVM_INFO @ 2666.871861 us: (uvm_report_catcher.svh:705) [UVM/REPORT/CATCHER]
--- UVM Report catcher Summary ---
chip_sw_alert_handler_lpg_sleep_mode_alerts 66804526844982906130096621707940641780286679013201562415111647575962814097899 308
UVM_INFO @ 3303.379164 us: (uvm_report_catcher.svh:705) [UVM/REPORT/CATCHER]
--- UVM Report catcher Summary ---
chip_sw_alert_handler_lpg_sleep_mode_alerts 110247155388706598448766190699424288237602320908248848016838651704858785861815 308
UVM_INFO @ 2806.496861 us: (uvm_report_catcher.svh:705) [UVM/REPORT/CATCHER]
--- UVM Report catcher Summary ---
chip_sw_alert_handler_lpg_sleep_mode_alerts 12653060249562354319984489371790146193277015828108016642602023627850387987294 308
UVM_INFO @ 2820.839904 us: (uvm_report_catcher.svh:705) [UVM/REPORT/CATCHER]
--- UVM Report catcher Summary ---
chip_sw_alert_handler_lpg_sleep_mode_alerts 80903760748079660531394928788550586802825733135283266993830714011367510930160 308
UVM_INFO @ 3234.536436 us: (uvm_report_catcher.svh:705) [UVM/REPORT/CATCHER]
--- UVM Report catcher Summary ---
chip_sw_alert_handler_lpg_sleep_mode_alerts 38684436693578669602372897018094849480682179322851595050386973679130859573488 308
UVM_INFO @ 3054.919960 us: (uvm_report_catcher.svh:705) [UVM/REPORT/CATCHER]
--- UVM Report catcher Summary ---
chip_sw_alert_handler_lpg_sleep_mode_alerts 84245406402004390492368607490342857554303868719663614490281745007871424914004 308
UVM_INFO @ 2825.436278 us: (uvm_report_catcher.svh:705) [UVM/REPORT/CATCHER]
--- UVM Report catcher Summary ---
chip_sw_alert_handler_lpg_sleep_mode_alerts 104756389618443153644191510173967790643592532039725722245845377125817667856488 308
UVM_INFO @ 3175.626078 us: (uvm_report_catcher.svh:705) [UVM/REPORT/CATCHER]
--- UVM Report catcher Summary ---
chip_sw_alert_handler_lpg_sleep_mode_alerts 107170024075684177978262752099992185071784985162051422614244664460389527038814 308
UVM_INFO @ 3012.173728 us: (uvm_report_catcher.svh:705) [UVM/REPORT/CATCHER]
--- UVM Report catcher Summary ---
Some pass patterns missing: ['^TEST PASSED (UVM_)?CHECKS$'] 42 test runs
chip_sw_pwrmgr_sleep_wake_5_bug 40711715777402818999811267933019712241656269487381415639682983774959592567633 None
---- STDERR ----
Another command (pid=3241500) is running. Waiting for it to complete on the server (server_pid=256587)...
WARNING: Target pattern parsing failed.
ERROR: Skipping '//sw/device/tests:pwrmgr_sleep_wake_5_bug_test_sim_dv': no such target '//sw/device/tests:pwrmgr_sleep_wake_5_bug_test_sim_dv': target 'pwrmgr_sleep_wake_5_bug_test_sim_dv' not declared in package 'sw/device/tests' defined by /nightly/current_run/opentitan/sw/device/tests/BUILD
ERROR: no such target '//sw/device/tests:pwrmgr_sleep_wake_5_bug_test_sim_dv': target 'pwrmgr_sleep_wake_5_bug_test_sim_dv' not declared in package 'sw/device/tests' defined by /nightly/current_run/opentitan/sw/device/tests/BUILD
ERROR: Build did NOT complete successfully
_run_cmd -> had a non-zero return code of 1.
make: *** [/nightly/current_run/opentitan/hw/dv/tools/dvsim/sim.mk:58: sw_build] Error 1
rom_e2e_boot_policy_valid_a_good_b_good_test_unlocked0 84565439819667914876757990086201338956050194220302338030548349432383725805066 None
---- STDERR ----
Another command (pid=256560) is running. Waiting for it to complete on the server (server_pid=256587)...
WARNING: Target pattern parsing failed.
ERROR: Skipping '//sw/device/silicon_creator/rom/e2e:empty_test_slot_a_fake_ecdsa_prod_key_0_sim_dv': no such target '//sw/device/silicon_creator/rom/e2e:empty_test_slot_a_fake_ecdsa_prod_key_0_sim_dv': target 'empty_test_slot_a_fake_ecdsa_prod_key_0_sim_dv' not declared in package 'sw/device/silicon_creator/rom/e2e' defined by /nightly/current_run/opentitan/sw/device/silicon_creator/rom/e2e/BUILD
ERROR: no such target '//sw/device/silicon_creator/rom/e2e:empty_test_slot_a_fake_ecdsa_prod_key_0_sim_dv': target 'empty_test_slot_a_fake_ecdsa_prod_key_0_sim_dv' not declared in package 'sw/device/silicon_creator/rom/e2e' defined by /nightly/current_run/opentitan/sw/device/silicon_creator/rom/e2e/BUILD
ERROR: Build did NOT complete successfully
_run_cmd -> had a non-zero return code of 1.
make: *** [/nightly/current_run/opentitan/hw/dv/tools/dvsim/sim.mk:58: sw_build] Error 1
rom_e2e_boot_policy_valid_a_good_b_good_dev 93174411733426897206419200666276026564249812644624580625574856597036348548622 None
---- STDOUT ----
---- STDERR ----
WARNING: Target pattern parsing failed.
ERROR: Skipping '//sw/device/silicon_creator/rom/e2e:empty_test_slot_a_fake_ecdsa_prod_key_0_sim_dv': no such target '//sw/device/silicon_creator/rom/e2e:empty_test_slot_a_fake_ecdsa_prod_key_0_sim_dv': target 'empty_test_slot_a_fake_ecdsa_prod_key_0_sim_dv' not declared in package 'sw/device/silicon_creator/rom/e2e' defined by /nightly/current_run/opentitan/sw/device/silicon_creator/rom/e2e/BUILD
ERROR: no such target '//sw/device/silicon_creator/rom/e2e:empty_test_slot_a_fake_ecdsa_prod_key_0_sim_dv': target 'empty_test_slot_a_fake_ecdsa_prod_key_0_sim_dv' not declared in package 'sw/device/silicon_creator/rom/e2e' defined by /nightly/current_run/opentitan/sw/device/silicon_creator/rom/e2e/BUILD
ERROR: Build did NOT complete successfully
_run_cmd -> had a non-zero return code of 1.
make: *** [/nightly/current_run/opentitan/hw/dv/tools/dvsim/sim.mk:58: sw_build] Error 1
rom_e2e_boot_policy_valid_a_good_b_good_prod 27911646686400934338682352620057124621829201949213521452323381098708680300568 None
---- STDOUT ----
---- STDERR ----
WARNING: Target pattern parsing failed.
ERROR: Skipping '//sw/device/silicon_creator/rom/e2e:empty_test_slot_a_fake_ecdsa_prod_key_0_sim_dv': no such target '//sw/device/silicon_creator/rom/e2e:empty_test_slot_a_fake_ecdsa_prod_key_0_sim_dv': target 'empty_test_slot_a_fake_ecdsa_prod_key_0_sim_dv' not declared in package 'sw/device/silicon_creator/rom/e2e' defined by /nightly/current_run/opentitan/sw/device/silicon_creator/rom/e2e/BUILD
ERROR: no such target '//sw/device/silicon_creator/rom/e2e:empty_test_slot_a_fake_ecdsa_prod_key_0_sim_dv': target 'empty_test_slot_a_fake_ecdsa_prod_key_0_sim_dv' not declared in package 'sw/device/silicon_creator/rom/e2e' defined by /nightly/current_run/opentitan/sw/device/silicon_creator/rom/e2e/BUILD
ERROR: Build did NOT complete successfully
_run_cmd -> had a non-zero return code of 1.
make: *** [/nightly/current_run/opentitan/hw/dv/tools/dvsim/sim.mk:58: sw_build] Error 1
rom_e2e_boot_policy_valid_a_good_b_good_prod_end 62352905401953891448343980946020685138414471483188682785290318609085100043524 None
---- STDERR ----
Another command (pid=436599) is running. Waiting for it to complete on the server (server_pid=256587)...
WARNING: Target pattern parsing failed.
ERROR: Skipping '//sw/device/silicon_creator/rom/e2e:empty_test_slot_a_fake_ecdsa_prod_key_0_sim_dv': no such target '//sw/device/silicon_creator/rom/e2e:empty_test_slot_a_fake_ecdsa_prod_key_0_sim_dv': target 'empty_test_slot_a_fake_ecdsa_prod_key_0_sim_dv' not declared in package 'sw/device/silicon_creator/rom/e2e' defined by /nightly/current_run/opentitan/sw/device/silicon_creator/rom/e2e/BUILD
ERROR: no such target '//sw/device/silicon_creator/rom/e2e:empty_test_slot_a_fake_ecdsa_prod_key_0_sim_dv': target 'empty_test_slot_a_fake_ecdsa_prod_key_0_sim_dv' not declared in package 'sw/device/silicon_creator/rom/e2e' defined by /nightly/current_run/opentitan/sw/device/silicon_creator/rom/e2e/BUILD
ERROR: Build did NOT complete successfully
_run_cmd -> had a non-zero return code of 1.
make: *** [/nightly/current_run/opentitan/hw/dv/tools/dvsim/sim.mk:58: sw_build] Error 1
rom_e2e_boot_policy_valid_a_good_b_good_rma 17792918273636601048977097291945907949295334766765282869435781975640390960437 None
---- STDOUT ----
---- STDERR ----
WARNING: Target pattern parsing failed.
ERROR: Skipping '//sw/device/silicon_creator/rom/e2e:empty_test_slot_a_fake_ecdsa_prod_key_0_sim_dv': no such target '//sw/device/silicon_creator/rom/e2e:empty_test_slot_a_fake_ecdsa_prod_key_0_sim_dv': target 'empty_test_slot_a_fake_ecdsa_prod_key_0_sim_dv' not declared in package 'sw/device/silicon_creator/rom/e2e' defined by /nightly/current_run/opentitan/sw/device/silicon_creator/rom/e2e/BUILD
ERROR: no such target '//sw/device/silicon_creator/rom/e2e:empty_test_slot_a_fake_ecdsa_prod_key_0_sim_dv': target 'empty_test_slot_a_fake_ecdsa_prod_key_0_sim_dv' not declared in package 'sw/device/silicon_creator/rom/e2e' defined by /nightly/current_run/opentitan/sw/device/silicon_creator/rom/e2e/BUILD
ERROR: Build did NOT complete successfully
_run_cmd -> had a non-zero return code of 1.
make: *** [/nightly/current_run/opentitan/hw/dv/tools/dvsim/sim.mk:58: sw_build] Error 1
rom_e2e_boot_policy_valid_a_good_b_bad_test_unlocked0 30821117293485492753792594750244831318159362401042259276991746749925466039281 None
Another command (pid=281279) is running. Waiting for it to complete on the server (server_pid=256587)...
Another command (pid=276178) is running. Waiting for it to complete on the server (server_pid=256587)...
Another command (pid=256556) is running. Waiting for it to complete on the server (server_pid=256587)...
WARNING: Target pattern parsing failed.
ERROR: Skipping '//sw/device/silicon_creator/rom/e2e:empty_test_slot_a_fake_ecdsa_prod_key_0_sim_dv': no such target '//sw/device/silicon_creator/rom/e2e:empty_test_slot_a_fake_ecdsa_prod_key_0_sim_dv': target 'empty_test_slot_a_fake_ecdsa_prod_key_0_sim_dv' not declared in package 'sw/device/silicon_creator/rom/e2e' defined by /nightly/current_run/opentitan/sw/device/silicon_creator/rom/e2e/BUILD
ERROR: no such target '//sw/device/silicon_creator/rom/e2e:empty_test_slot_a_fake_ecdsa_prod_key_0_sim_dv': target 'empty_test_slot_a_fake_ecdsa_prod_key_0_sim_dv' not declared in package 'sw/device/silicon_creator/rom/e2e' defined by /nightly/current_run/opentitan/sw/device/silicon_creator/rom/e2e/BUILD
ERROR: Build did NOT complete successfully
_run_cmd -> had a non-zero return code of 1.
make: *** [/nightly/current_run/opentitan/hw/dv/tools/dvsim/sim.mk:58: sw_build] Error 1
rom_e2e_boot_policy_valid_a_good_b_bad_dev 7893055020079425434718444442628270581107444208958825215082845247270175870986 None
---- STDOUT ----
---- STDERR ----
WARNING: Target pattern parsing failed.
ERROR: Skipping '//sw/device/silicon_creator/rom/e2e:empty_test_slot_a_fake_ecdsa_prod_key_0_sim_dv': no such target '//sw/device/silicon_creator/rom/e2e:empty_test_slot_a_fake_ecdsa_prod_key_0_sim_dv': target 'empty_test_slot_a_fake_ecdsa_prod_key_0_sim_dv' not declared in package 'sw/device/silicon_creator/rom/e2e' defined by /nightly/current_run/opentitan/sw/device/silicon_creator/rom/e2e/BUILD
ERROR: no such target '//sw/device/silicon_creator/rom/e2e:empty_test_slot_a_fake_ecdsa_prod_key_0_sim_dv': target 'empty_test_slot_a_fake_ecdsa_prod_key_0_sim_dv' not declared in package 'sw/device/silicon_creator/rom/e2e' defined by /nightly/current_run/opentitan/sw/device/silicon_creator/rom/e2e/BUILD
ERROR: Build did NOT complete successfully
_run_cmd -> had a non-zero return code of 1.
make: *** [/nightly/current_run/opentitan/hw/dv/tools/dvsim/sim.mk:58: sw_build] Error 1
rom_e2e_boot_policy_valid_a_good_b_bad_prod 63028049373495609753802987733575195742874421132287667679912504849463000378452 None
---- STDOUT ----
---- STDERR ----
WARNING: Target pattern parsing failed.
ERROR: Skipping '//sw/device/silicon_creator/rom/e2e:empty_test_slot_a_fake_ecdsa_prod_key_0_sim_dv': no such target '//sw/device/silicon_creator/rom/e2e:empty_test_slot_a_fake_ecdsa_prod_key_0_sim_dv': target 'empty_test_slot_a_fake_ecdsa_prod_key_0_sim_dv' not declared in package 'sw/device/silicon_creator/rom/e2e' defined by /nightly/current_run/opentitan/sw/device/silicon_creator/rom/e2e/BUILD
ERROR: no such target '//sw/device/silicon_creator/rom/e2e:empty_test_slot_a_fake_ecdsa_prod_key_0_sim_dv': target 'empty_test_slot_a_fake_ecdsa_prod_key_0_sim_dv' not declared in package 'sw/device/silicon_creator/rom/e2e' defined by /nightly/current_run/opentitan/sw/device/silicon_creator/rom/e2e/BUILD
ERROR: Build did NOT complete successfully
_run_cmd -> had a non-zero return code of 1.
make: *** [/nightly/current_run/opentitan/hw/dv/tools/dvsim/sim.mk:58: sw_build] Error 1
rom_e2e_boot_policy_valid_a_good_b_bad_prod_end 42793907195239590891317521857553674953671650497945997709240178652107387102662 None
---- STDOUT ----
---- STDERR ----
WARNING: Target pattern parsing failed.
ERROR: Skipping '//sw/device/silicon_creator/rom/e2e:empty_test_slot_a_fake_ecdsa_prod_key_0_sim_dv': no such target '//sw/device/silicon_creator/rom/e2e:empty_test_slot_a_fake_ecdsa_prod_key_0_sim_dv': target 'empty_test_slot_a_fake_ecdsa_prod_key_0_sim_dv' not declared in package 'sw/device/silicon_creator/rom/e2e' defined by /nightly/current_run/opentitan/sw/device/silicon_creator/rom/e2e/BUILD
ERROR: no such target '//sw/device/silicon_creator/rom/e2e:empty_test_slot_a_fake_ecdsa_prod_key_0_sim_dv': target 'empty_test_slot_a_fake_ecdsa_prod_key_0_sim_dv' not declared in package 'sw/device/silicon_creator/rom/e2e' defined by /nightly/current_run/opentitan/sw/device/silicon_creator/rom/e2e/BUILD
ERROR: Build did NOT complete successfully
_run_cmd -> had a non-zero return code of 1.
make: *** [/nightly/current_run/opentitan/hw/dv/tools/dvsim/sim.mk:58: sw_build] Error 1
rom_e2e_boot_policy_valid_a_good_b_bad_rma 14347894528121035087755440019134633808186715734346805341489960481678161484474 None
---- STDOUT ----
---- STDERR ----
WARNING: Target pattern parsing failed.
ERROR: Skipping '//sw/device/silicon_creator/rom/e2e:empty_test_slot_a_fake_ecdsa_prod_key_0_sim_dv': no such target '//sw/device/silicon_creator/rom/e2e:empty_test_slot_a_fake_ecdsa_prod_key_0_sim_dv': target 'empty_test_slot_a_fake_ecdsa_prod_key_0_sim_dv' not declared in package 'sw/device/silicon_creator/rom/e2e' defined by /nightly/current_run/opentitan/sw/device/silicon_creator/rom/e2e/BUILD
ERROR: no such target '//sw/device/silicon_creator/rom/e2e:empty_test_slot_a_fake_ecdsa_prod_key_0_sim_dv': target 'empty_test_slot_a_fake_ecdsa_prod_key_0_sim_dv' not declared in package 'sw/device/silicon_creator/rom/e2e' defined by /nightly/current_run/opentitan/sw/device/silicon_creator/rom/e2e/BUILD
ERROR: Build did NOT complete successfully
_run_cmd -> had a non-zero return code of 1.
make: *** [/nightly/current_run/opentitan/hw/dv/tools/dvsim/sim.mk:58: sw_build] Error 1
rom_e2e_boot_policy_valid_a_bad_b_good_test_unlocked0 16161530304282038907519599690989779538054414743683077691061576339045974679265 None
Another command (pid=285732) is running. Waiting for it to complete on the server (server_pid=256587)...
Another command (pid=287855) is running. Waiting for it to complete on the server (server_pid=256587)...
Another command (pid=292133) is running. Waiting for it to complete on the server (server_pid=256587)...
WARNING: Target pattern parsing failed.
ERROR: Skipping '//sw/device/silicon_creator/rom/e2e:empty_test_slot_b_fake_ecdsa_prod_key_0_sim_dv': no such target '//sw/device/silicon_creator/rom/e2e:empty_test_slot_b_fake_ecdsa_prod_key_0_sim_dv': target 'empty_test_slot_b_fake_ecdsa_prod_key_0_sim_dv' not declared in package 'sw/device/silicon_creator/rom/e2e' defined by /nightly/current_run/opentitan/sw/device/silicon_creator/rom/e2e/BUILD
ERROR: no such target '//sw/device/silicon_creator/rom/e2e:empty_test_slot_b_fake_ecdsa_prod_key_0_sim_dv': target 'empty_test_slot_b_fake_ecdsa_prod_key_0_sim_dv' not declared in package 'sw/device/silicon_creator/rom/e2e' defined by /nightly/current_run/opentitan/sw/device/silicon_creator/rom/e2e/BUILD
ERROR: Build did NOT complete successfully
_run_cmd -> had a non-zero return code of 1.
make: *** [/nightly/current_run/opentitan/hw/dv/tools/dvsim/sim.mk:58: sw_build] Error 1
rom_e2e_boot_policy_valid_a_bad_b_good_dev 58069041553739569237048822573908872418083799792029844108492596003229633244476 None
---- STDOUT ----
---- STDERR ----
WARNING: Target pattern parsing failed.
ERROR: Skipping '//sw/device/silicon_creator/rom/e2e:empty_test_slot_b_fake_ecdsa_prod_key_0_sim_dv': no such target '//sw/device/silicon_creator/rom/e2e:empty_test_slot_b_fake_ecdsa_prod_key_0_sim_dv': target 'empty_test_slot_b_fake_ecdsa_prod_key_0_sim_dv' not declared in package 'sw/device/silicon_creator/rom/e2e' defined by /nightly/current_run/opentitan/sw/device/silicon_creator/rom/e2e/BUILD
ERROR: no such target '//sw/device/silicon_creator/rom/e2e:empty_test_slot_b_fake_ecdsa_prod_key_0_sim_dv': target 'empty_test_slot_b_fake_ecdsa_prod_key_0_sim_dv' not declared in package 'sw/device/silicon_creator/rom/e2e' defined by /nightly/current_run/opentitan/sw/device/silicon_creator/rom/e2e/BUILD
ERROR: Build did NOT complete successfully
_run_cmd -> had a non-zero return code of 1.
make: *** [/nightly/current_run/opentitan/hw/dv/tools/dvsim/sim.mk:58: sw_build] Error 1
rom_e2e_boot_policy_valid_a_bad_b_good_prod 95355138077540653935250646821678956487290226446106295789194043373289452296499 None
---- STDOUT ----
---- STDERR ----
WARNING: Target pattern parsing failed.
ERROR: Skipping '//sw/device/silicon_creator/rom/e2e:empty_test_slot_b_fake_ecdsa_prod_key_0_sim_dv': no such target '//sw/device/silicon_creator/rom/e2e:empty_test_slot_b_fake_ecdsa_prod_key_0_sim_dv': target 'empty_test_slot_b_fake_ecdsa_prod_key_0_sim_dv' not declared in package 'sw/device/silicon_creator/rom/e2e' defined by /nightly/current_run/opentitan/sw/device/silicon_creator/rom/e2e/BUILD
ERROR: no such target '//sw/device/silicon_creator/rom/e2e:empty_test_slot_b_fake_ecdsa_prod_key_0_sim_dv': target 'empty_test_slot_b_fake_ecdsa_prod_key_0_sim_dv' not declared in package 'sw/device/silicon_creator/rom/e2e' defined by /nightly/current_run/opentitan/sw/device/silicon_creator/rom/e2e/BUILD
ERROR: Build did NOT complete successfully
_run_cmd -> had a non-zero return code of 1.
make: *** [/nightly/current_run/opentitan/hw/dv/tools/dvsim/sim.mk:58: sw_build] Error 1
rom_e2e_boot_policy_valid_a_bad_b_good_prod_end 63296911332276551077452884875453557680118604317189867796546230459264837903000 None
---- STDOUT ----
---- STDERR ----
WARNING: Target pattern parsing failed.
ERROR: Skipping '//sw/device/silicon_creator/rom/e2e:empty_test_slot_b_fake_ecdsa_prod_key_0_sim_dv': no such target '//sw/device/silicon_creator/rom/e2e:empty_test_slot_b_fake_ecdsa_prod_key_0_sim_dv': target 'empty_test_slot_b_fake_ecdsa_prod_key_0_sim_dv' not declared in package 'sw/device/silicon_creator/rom/e2e' defined by /nightly/current_run/opentitan/sw/device/silicon_creator/rom/e2e/BUILD
ERROR: no such target '//sw/device/silicon_creator/rom/e2e:empty_test_slot_b_fake_ecdsa_prod_key_0_sim_dv': target 'empty_test_slot_b_fake_ecdsa_prod_key_0_sim_dv' not declared in package 'sw/device/silicon_creator/rom/e2e' defined by /nightly/current_run/opentitan/sw/device/silicon_creator/rom/e2e/BUILD
ERROR: Build did NOT complete successfully
_run_cmd -> had a non-zero return code of 1.
make: *** [/nightly/current_run/opentitan/hw/dv/tools/dvsim/sim.mk:58: sw_build] Error 1
rom_e2e_boot_policy_valid_a_bad_b_good_rma 3838885855265921504886891549332727322161878052263218021441258214091089697203 None
---- STDOUT ----
---- STDERR ----
WARNING: Target pattern parsing failed.
ERROR: Skipping '//sw/device/silicon_creator/rom/e2e:empty_test_slot_b_fake_ecdsa_prod_key_0_sim_dv': no such target '//sw/device/silicon_creator/rom/e2e:empty_test_slot_b_fake_ecdsa_prod_key_0_sim_dv': target 'empty_test_slot_b_fake_ecdsa_prod_key_0_sim_dv' not declared in package 'sw/device/silicon_creator/rom/e2e' defined by /nightly/current_run/opentitan/sw/device/silicon_creator/rom/e2e/BUILD
ERROR: no such target '//sw/device/silicon_creator/rom/e2e:empty_test_slot_b_fake_ecdsa_prod_key_0_sim_dv': target 'empty_test_slot_b_fake_ecdsa_prod_key_0_sim_dv' not declared in package 'sw/device/silicon_creator/rom/e2e' defined by /nightly/current_run/opentitan/sw/device/silicon_creator/rom/e2e/BUILD
ERROR: Build did NOT complete successfully
_run_cmd -> had a non-zero return code of 1.
make: *** [/nightly/current_run/opentitan/hw/dv/tools/dvsim/sim.mk:58: sw_build] Error 1
rom_e2e_asm_init_test_unlocked0 108706146271204052591029661106906885912769465790914966886725528416831343405815 None
Another command (pid=259680) is running. Waiting for it to complete on the server (server_pid=256587)...
Another command (pid=259905) is running. Waiting for it to complete on the server (server_pid=256587)...
Another command (pid=259505) is running. Waiting for it to complete on the server (server_pid=256587)...
WARNING: Target pattern parsing failed.
ERROR: Skipping '//sw/device/silicon_creator/rom/e2e:empty_test_slot_a_fake_ecdsa_prod_key_0_sim_dv': no such target '//sw/device/silicon_creator/rom/e2e:empty_test_slot_a_fake_ecdsa_prod_key_0_sim_dv': target 'empty_test_slot_a_fake_ecdsa_prod_key_0_sim_dv' not declared in package 'sw/device/silicon_creator/rom/e2e' defined by /nightly/current_run/opentitan/sw/device/silicon_creator/rom/e2e/BUILD
ERROR: no such target '//sw/device/silicon_creator/rom/e2e:empty_test_slot_a_fake_ecdsa_prod_key_0_sim_dv': target 'empty_test_slot_a_fake_ecdsa_prod_key_0_sim_dv' not declared in package 'sw/device/silicon_creator/rom/e2e' defined by /nightly/current_run/opentitan/sw/device/silicon_creator/rom/e2e/BUILD
ERROR: Build did NOT complete successfully
_run_cmd -> had a non-zero return code of 1.
make: *** [/nightly/current_run/opentitan/hw/dv/tools/dvsim/sim.mk:58: sw_build] Error 1
rom_e2e_asm_init_dev 48508000246182541851902287243750302385028415277404841672935266509383436528300 None
---- STDERR ----
Another command (pid=430293) is running. Waiting for it to complete on the server (server_pid=256587)...
WARNING: Target pattern parsing failed.
ERROR: Skipping '//sw/device/silicon_creator/rom/e2e:empty_test_slot_a_fake_ecdsa_prod_key_0_sim_dv': no such target '//sw/device/silicon_creator/rom/e2e:empty_test_slot_a_fake_ecdsa_prod_key_0_sim_dv': target 'empty_test_slot_a_fake_ecdsa_prod_key_0_sim_dv' not declared in package 'sw/device/silicon_creator/rom/e2e' defined by /nightly/current_run/opentitan/sw/device/silicon_creator/rom/e2e/BUILD
ERROR: no such target '//sw/device/silicon_creator/rom/e2e:empty_test_slot_a_fake_ecdsa_prod_key_0_sim_dv': target 'empty_test_slot_a_fake_ecdsa_prod_key_0_sim_dv' not declared in package 'sw/device/silicon_creator/rom/e2e' defined by /nightly/current_run/opentitan/sw/device/silicon_creator/rom/e2e/BUILD
ERROR: Build did NOT complete successfully
_run_cmd -> had a non-zero return code of 1.
make: *** [/nightly/current_run/opentitan/hw/dv/tools/dvsim/sim.mk:58: sw_build] Error 1
rom_e2e_asm_init_prod 85163000995429724340682046301172047822428054504136324952106212272487798962756 None
---- STDOUT ----
---- STDERR ----
WARNING: Target pattern parsing failed.
ERROR: Skipping '//sw/device/silicon_creator/rom/e2e:empty_test_slot_a_fake_ecdsa_prod_key_0_sim_dv': no such target '//sw/device/silicon_creator/rom/e2e:empty_test_slot_a_fake_ecdsa_prod_key_0_sim_dv': target 'empty_test_slot_a_fake_ecdsa_prod_key_0_sim_dv' not declared in package 'sw/device/silicon_creator/rom/e2e' defined by /nightly/current_run/opentitan/sw/device/silicon_creator/rom/e2e/BUILD
ERROR: no such target '//sw/device/silicon_creator/rom/e2e:empty_test_slot_a_fake_ecdsa_prod_key_0_sim_dv': target 'empty_test_slot_a_fake_ecdsa_prod_key_0_sim_dv' not declared in package 'sw/device/silicon_creator/rom/e2e' defined by /nightly/current_run/opentitan/sw/device/silicon_creator/rom/e2e/BUILD
ERROR: Build did NOT complete successfully
_run_cmd -> had a non-zero return code of 1.
make: *** [/nightly/current_run/opentitan/hw/dv/tools/dvsim/sim.mk:58: sw_build] Error 1
rom_e2e_asm_init_prod_end 66019702414591749146212772319646707817360621686084859549820847957831866923586 None
---- STDOUT ----
---- STDERR ----
WARNING: Target pattern parsing failed.
ERROR: Skipping '//sw/device/silicon_creator/rom/e2e:empty_test_slot_a_fake_ecdsa_prod_key_0_sim_dv': no such target '//sw/device/silicon_creator/rom/e2e:empty_test_slot_a_fake_ecdsa_prod_key_0_sim_dv': target 'empty_test_slot_a_fake_ecdsa_prod_key_0_sim_dv' not declared in package 'sw/device/silicon_creator/rom/e2e' defined by /nightly/current_run/opentitan/sw/device/silicon_creator/rom/e2e/BUILD
ERROR: no such target '//sw/device/silicon_creator/rom/e2e:empty_test_slot_a_fake_ecdsa_prod_key_0_sim_dv': target 'empty_test_slot_a_fake_ecdsa_prod_key_0_sim_dv' not declared in package 'sw/device/silicon_creator/rom/e2e' defined by /nightly/current_run/opentitan/sw/device/silicon_creator/rom/e2e/BUILD
ERROR: Build did NOT complete successfully
_run_cmd -> had a non-zero return code of 1.
make: *** [/nightly/current_run/opentitan/hw/dv/tools/dvsim/sim.mk:58: sw_build] Error 1
rom_e2e_asm_init_rma 68850154788500710459809992034330601167333068625005330266702466760631417876313 None
---- STDOUT ----
---- STDERR ----
WARNING: Target pattern parsing failed.
ERROR: Skipping '//sw/device/silicon_creator/rom/e2e:empty_test_slot_a_fake_ecdsa_prod_key_0_sim_dv': no such target '//sw/device/silicon_creator/rom/e2e:empty_test_slot_a_fake_ecdsa_prod_key_0_sim_dv': target 'empty_test_slot_a_fake_ecdsa_prod_key_0_sim_dv' not declared in package 'sw/device/silicon_creator/rom/e2e' defined by /nightly/current_run/opentitan/sw/device/silicon_creator/rom/e2e/BUILD
ERROR: no such target '//sw/device/silicon_creator/rom/e2e:empty_test_slot_a_fake_ecdsa_prod_key_0_sim_dv': target 'empty_test_slot_a_fake_ecdsa_prod_key_0_sim_dv' not declared in package 'sw/device/silicon_creator/rom/e2e' defined by /nightly/current_run/opentitan/sw/device/silicon_creator/rom/e2e/BUILD
ERROR: Build did NOT complete successfully
_run_cmd -> had a non-zero return code of 1.
make: *** [/nightly/current_run/opentitan/hw/dv/tools/dvsim/sim.mk:58: sw_build] Error 1
rom_volatile_raw_unlock 12443045671347878963660689810226689501728860852495038039105661736338090579489 None
Another command (pid=263535) is running. Waiting for it to complete on the server (server_pid=256587)...
Another command (pid=283966) is running. Waiting for it to complete on the server (server_pid=256587)...
Another command (pid=285413) is running. Waiting for it to complete on the server (server_pid=256587)...
WARNING: Target pattern parsing failed.
ERROR: Skipping '//sw/device/silicon_creator/rom/e2e:empty_test_slot_a_fake_ecdsa_test_key_0_sim_dv': no such target '//sw/device/silicon_creator/rom/e2e:empty_test_slot_a_fake_ecdsa_test_key_0_sim_dv': target 'empty_test_slot_a_fake_ecdsa_test_key_0_sim_dv' not declared in package 'sw/device/silicon_creator/rom/e2e' defined by /nightly/current_run/opentitan/sw/device/silicon_creator/rom/e2e/BUILD
ERROR: no such target '//sw/device/silicon_creator/rom/e2e:empty_test_slot_a_fake_ecdsa_test_key_0_sim_dv': target 'empty_test_slot_a_fake_ecdsa_test_key_0_sim_dv' not declared in package 'sw/device/silicon_creator/rom/e2e' defined by /nightly/current_run/opentitan/sw/device/silicon_creator/rom/e2e/BUILD
ERROR: Build did NOT complete successfully
_run_cmd -> had a non-zero return code of 1.
make: *** [/nightly/current_run/opentitan/hw/dv/tools/dvsim/sim.mk:58: sw_build] Error 1
rom_raw_unlock 102947881204274780703351964518817077314467099991500871709599862370536587475734 None
Another command (pid=285732) is running. Waiting for it to complete on the server (server_pid=256587)...
Another command (pid=287855) is running. Waiting for it to complete on the server (server_pid=256587)...
Another command (pid=292133) is running. Waiting for it to complete on the server (server_pid=256587)...
WARNING: Target pattern parsing failed.
ERROR: Skipping '//sw/device/silicon_creator/rom/e2e:empty_test_slot_a_fake_ecdsa_test_key_0_sim_dv': no such target '//sw/device/silicon_creator/rom/e2e:empty_test_slot_a_fake_ecdsa_test_key_0_sim_dv': target 'empty_test_slot_a_fake_ecdsa_test_key_0_sim_dv' not declared in package 'sw/device/silicon_creator/rom/e2e' defined by /nightly/current_run/opentitan/sw/device/silicon_creator/rom/e2e/BUILD
ERROR: no such target '//sw/device/silicon_creator/rom/e2e:empty_test_slot_a_fake_ecdsa_test_key_0_sim_dv': target 'empty_test_slot_a_fake_ecdsa_test_key_0_sim_dv' not declared in package 'sw/device/silicon_creator/rom/e2e' defined by /nightly/current_run/opentitan/sw/device/silicon_creator/rom/e2e/BUILD
ERROR: Build did NOT complete successfully
_run_cmd -> had a non-zero return code of 1.
make: *** [/nightly/current_run/opentitan/hw/dv/tools/dvsim/sim.mk:58: sw_build] Error 1
rom_e2e_self_hash 23975639266079113631605457237382356720601690183813190847872987584167174887731 None
---- STDERR ----
Another command (pid=256560) is running. Waiting for it to complete on the server (server_pid=256587)...
WARNING: Target pattern parsing failed.
ERROR: Skipping '//sw/device/silicon_creator/rom/e2e/release:rom_e2e_self_hash_test_sim_dv': no such target '//sw/device/silicon_creator/rom/e2e/release:rom_e2e_self_hash_test_sim_dv': target 'rom_e2e_self_hash_test_sim_dv' not declared in package 'sw/device/silicon_creator/rom/e2e/release' defined by /nightly/current_run/opentitan/sw/device/silicon_creator/rom/e2e/release/BUILD
ERROR: no such target '//sw/device/silicon_creator/rom/e2e/release:rom_e2e_self_hash_test_sim_dv': target 'rom_e2e_self_hash_test_sim_dv' not declared in package 'sw/device/silicon_creator/rom/e2e/release' defined by /nightly/current_run/opentitan/sw/device/silicon_creator/rom/e2e/release/BUILD
ERROR: Build did NOT complete successfully
_run_cmd -> had a non-zero return code of 1.
make: *** [/nightly/current_run/opentitan/hw/dv/tools/dvsim/sim.mk:58: sw_build] Error 1
chip_sw_pwrmgr_sleep_wake_5_bug 83787250257962371489310947758998192836977231331524895322033528304821677753428 None
Another command (pid=4152623) is running. Waiting for it to complete on the server (server_pid=256587)...
Another command (pid=4153526) is running. Waiting for it to complete on the server (server_pid=256587)...
Another command (pid=4153732) is running. Waiting for it to complete on the server (server_pid=256587)...
WARNING: Target pattern parsing failed.
ERROR: Skipping '//sw/device/tests:pwrmgr_sleep_wake_5_bug_test_sim_dv': no such target '//sw/device/tests:pwrmgr_sleep_wake_5_bug_test_sim_dv': target 'pwrmgr_sleep_wake_5_bug_test_sim_dv' not declared in package 'sw/device/tests' defined by /nightly/current_run/opentitan/sw/device/tests/BUILD
ERROR: no such target '//sw/device/tests:pwrmgr_sleep_wake_5_bug_test_sim_dv': target 'pwrmgr_sleep_wake_5_bug_test_sim_dv' not declared in package 'sw/device/tests' defined by /nightly/current_run/opentitan/sw/device/tests/BUILD
ERROR: Build did NOT complete successfully
_run_cmd -> had a non-zero return code of 1.
make: *** [/nightly/current_run/opentitan/hw/dv/tools/dvsim/sim.mk:58: sw_build] Error 1
rom_e2e_asm_init_test_unlocked0 73754364523232574582593195957513137482856303824830174803818711337799770904461 None
Another command (pid=281832) is running. Waiting for it to complete on the server (server_pid=256587)...
Another command (pid=283405) is running. Waiting for it to complete on the server (server_pid=256587)...
Another command (pid=263077) is running. Waiting for it to complete on the server (server_pid=256587)...
WARNING: Target pattern parsing failed.
ERROR: Skipping '//sw/device/silicon_creator/rom/e2e:empty_test_slot_a_fake_ecdsa_prod_key_0_sim_dv': no such target '//sw/device/silicon_creator/rom/e2e:empty_test_slot_a_fake_ecdsa_prod_key_0_sim_dv': target 'empty_test_slot_a_fake_ecdsa_prod_key_0_sim_dv' not declared in package 'sw/device/silicon_creator/rom/e2e' defined by /nightly/current_run/opentitan/sw/device/silicon_creator/rom/e2e/BUILD
ERROR: no such target '//sw/device/silicon_creator/rom/e2e:empty_test_slot_a_fake_ecdsa_prod_key_0_sim_dv': target 'empty_test_slot_a_fake_ecdsa_prod_key_0_sim_dv' not declared in package 'sw/device/silicon_creator/rom/e2e' defined by /nightly/current_run/opentitan/sw/device/silicon_creator/rom/e2e/BUILD
ERROR: Build did NOT complete successfully
_run_cmd -> had a non-zero return code of 1.
make: *** [/nightly/current_run/opentitan/hw/dv/tools/dvsim/sim.mk:58: sw_build] Error 1
rom_e2e_asm_init_dev 35196720286789029993472277916013631394112411210228633167772064481704452989803 None
---- STDOUT ----
---- STDERR ----
WARNING: Target pattern parsing failed.
ERROR: Skipping '//sw/device/silicon_creator/rom/e2e:empty_test_slot_a_fake_ecdsa_prod_key_0_sim_dv': no such target '//sw/device/silicon_creator/rom/e2e:empty_test_slot_a_fake_ecdsa_prod_key_0_sim_dv': target 'empty_test_slot_a_fake_ecdsa_prod_key_0_sim_dv' not declared in package 'sw/device/silicon_creator/rom/e2e' defined by /nightly/current_run/opentitan/sw/device/silicon_creator/rom/e2e/BUILD
ERROR: no such target '//sw/device/silicon_creator/rom/e2e:empty_test_slot_a_fake_ecdsa_prod_key_0_sim_dv': target 'empty_test_slot_a_fake_ecdsa_prod_key_0_sim_dv' not declared in package 'sw/device/silicon_creator/rom/e2e' defined by /nightly/current_run/opentitan/sw/device/silicon_creator/rom/e2e/BUILD
ERROR: Build did NOT complete successfully
_run_cmd -> had a non-zero return code of 1.
make: *** [/nightly/current_run/opentitan/hw/dv/tools/dvsim/sim.mk:58: sw_build] Error 1
rom_e2e_asm_init_prod 110824944599614376096642914459543987224207592509384258382696566369590743494156 None
---- STDOUT ----
---- STDERR ----
WARNING: Target pattern parsing failed.
ERROR: Skipping '//sw/device/silicon_creator/rom/e2e:empty_test_slot_a_fake_ecdsa_prod_key_0_sim_dv': no such target '//sw/device/silicon_creator/rom/e2e:empty_test_slot_a_fake_ecdsa_prod_key_0_sim_dv': target 'empty_test_slot_a_fake_ecdsa_prod_key_0_sim_dv' not declared in package 'sw/device/silicon_creator/rom/e2e' defined by /nightly/current_run/opentitan/sw/device/silicon_creator/rom/e2e/BUILD
ERROR: no such target '//sw/device/silicon_creator/rom/e2e:empty_test_slot_a_fake_ecdsa_prod_key_0_sim_dv': target 'empty_test_slot_a_fake_ecdsa_prod_key_0_sim_dv' not declared in package 'sw/device/silicon_creator/rom/e2e' defined by /nightly/current_run/opentitan/sw/device/silicon_creator/rom/e2e/BUILD
ERROR: Build did NOT complete successfully
_run_cmd -> had a non-zero return code of 1.
make: *** [/nightly/current_run/opentitan/hw/dv/tools/dvsim/sim.mk:58: sw_build] Error 1
rom_e2e_asm_init_prod_end 38880612655151266151379260407846597848299776589396699963732501685009000848893 None
---- STDOUT ----
---- STDERR ----
WARNING: Target pattern parsing failed.
ERROR: Skipping '//sw/device/silicon_creator/rom/e2e:empty_test_slot_a_fake_ecdsa_prod_key_0_sim_dv': no such target '//sw/device/silicon_creator/rom/e2e:empty_test_slot_a_fake_ecdsa_prod_key_0_sim_dv': target 'empty_test_slot_a_fake_ecdsa_prod_key_0_sim_dv' not declared in package 'sw/device/silicon_creator/rom/e2e' defined by /nightly/current_run/opentitan/sw/device/silicon_creator/rom/e2e/BUILD
ERROR: no such target '//sw/device/silicon_creator/rom/e2e:empty_test_slot_a_fake_ecdsa_prod_key_0_sim_dv': target 'empty_test_slot_a_fake_ecdsa_prod_key_0_sim_dv' not declared in package 'sw/device/silicon_creator/rom/e2e' defined by /nightly/current_run/opentitan/sw/device/silicon_creator/rom/e2e/BUILD
ERROR: Build did NOT complete successfully
_run_cmd -> had a non-zero return code of 1.
make: *** [/nightly/current_run/opentitan/hw/dv/tools/dvsim/sim.mk:58: sw_build] Error 1
rom_e2e_asm_init_rma 15348724269426883782499941288371310952915420287423642693608278314969841504586 None
---- STDOUT ----
---- STDERR ----
WARNING: Target pattern parsing failed.
ERROR: Skipping '//sw/device/silicon_creator/rom/e2e:empty_test_slot_a_fake_ecdsa_prod_key_0_sim_dv': no such target '//sw/device/silicon_creator/rom/e2e:empty_test_slot_a_fake_ecdsa_prod_key_0_sim_dv': target 'empty_test_slot_a_fake_ecdsa_prod_key_0_sim_dv' not declared in package 'sw/device/silicon_creator/rom/e2e' defined by /nightly/current_run/opentitan/sw/device/silicon_creator/rom/e2e/BUILD
ERROR: no such target '//sw/device/silicon_creator/rom/e2e:empty_test_slot_a_fake_ecdsa_prod_key_0_sim_dv': target 'empty_test_slot_a_fake_ecdsa_prod_key_0_sim_dv' not declared in package 'sw/device/silicon_creator/rom/e2e' defined by /nightly/current_run/opentitan/sw/device/silicon_creator/rom/e2e/BUILD
ERROR: Build did NOT complete successfully
_run_cmd -> had a non-zero return code of 1.
make: *** [/nightly/current_run/opentitan/hw/dv/tools/dvsim/sim.mk:58: sw_build] Error 1
rom_volatile_raw_unlock 114707080398548854214057114104915246148321548425410445090753168690374188166397 None
Another command (pid=263077) is running. Waiting for it to complete on the server (server_pid=256587)...
Another command (pid=282825) is running. Waiting for it to complete on the server (server_pid=256587)...
Another command (pid=256583) is running. Waiting for it to complete on the server (server_pid=256587)...
WARNING: Target pattern parsing failed.
ERROR: Skipping '//sw/device/silicon_creator/rom/e2e:empty_test_slot_a_fake_ecdsa_test_key_0_sim_dv': no such target '//sw/device/silicon_creator/rom/e2e:empty_test_slot_a_fake_ecdsa_test_key_0_sim_dv': target 'empty_test_slot_a_fake_ecdsa_test_key_0_sim_dv' not declared in package 'sw/device/silicon_creator/rom/e2e' defined by /nightly/current_run/opentitan/sw/device/silicon_creator/rom/e2e/BUILD
ERROR: no such target '//sw/device/silicon_creator/rom/e2e:empty_test_slot_a_fake_ecdsa_test_key_0_sim_dv': target 'empty_test_slot_a_fake_ecdsa_test_key_0_sim_dv' not declared in package 'sw/device/silicon_creator/rom/e2e' defined by /nightly/current_run/opentitan/sw/device/silicon_creator/rom/e2e/BUILD
ERROR: Build did NOT complete successfully
_run_cmd -> had a non-zero return code of 1.
make: *** [/nightly/current_run/opentitan/hw/dv/tools/dvsim/sim.mk:58: sw_build] Error 1
rom_raw_unlock 107751067648485163781010682547318949641190006370868973752071759507474449798019 None
Another command (pid=288449) is running. Waiting for it to complete on the server (server_pid=256587)...
Another command (pid=293362) is running. Waiting for it to complete on the server (server_pid=256587)...
Another command (pid=289267) is running. Waiting for it to complete on the server (server_pid=256587)...
WARNING: Target pattern parsing failed.
ERROR: Skipping '//sw/device/silicon_creator/rom/e2e:empty_test_slot_a_fake_ecdsa_test_key_0_sim_dv': no such target '//sw/device/silicon_creator/rom/e2e:empty_test_slot_a_fake_ecdsa_test_key_0_sim_dv': target 'empty_test_slot_a_fake_ecdsa_test_key_0_sim_dv' not declared in package 'sw/device/silicon_creator/rom/e2e' defined by /nightly/current_run/opentitan/sw/device/silicon_creator/rom/e2e/BUILD
ERROR: no such target '//sw/device/silicon_creator/rom/e2e:empty_test_slot_a_fake_ecdsa_test_key_0_sim_dv': target 'empty_test_slot_a_fake_ecdsa_test_key_0_sim_dv' not declared in package 'sw/device/silicon_creator/rom/e2e' defined by /nightly/current_run/opentitan/sw/device/silicon_creator/rom/e2e/BUILD
ERROR: Build did NOT complete successfully
_run_cmd -> had a non-zero return code of 1.
make: *** [/nightly/current_run/opentitan/hw/dv/tools/dvsim/sim.mk:58: sw_build] Error 1
rom_e2e_self_hash 33791780507896495496929285427863447866429019164960848193423062775112084404406 None
---- STDERR ----
Another command (pid=261090) is running. Waiting for it to complete on the server (server_pid=256587)...
WARNING: Target pattern parsing failed.
ERROR: Skipping '//sw/device/silicon_creator/rom/e2e/release:rom_e2e_self_hash_test_sim_dv': no such target '//sw/device/silicon_creator/rom/e2e/release:rom_e2e_self_hash_test_sim_dv': target 'rom_e2e_self_hash_test_sim_dv' not declared in package 'sw/device/silicon_creator/rom/e2e/release' defined by /nightly/current_run/opentitan/sw/device/silicon_creator/rom/e2e/release/BUILD
ERROR: no such target '//sw/device/silicon_creator/rom/e2e/release:rom_e2e_self_hash_test_sim_dv': target 'rom_e2e_self_hash_test_sim_dv' not declared in package 'sw/device/silicon_creator/rom/e2e/release' defined by /nightly/current_run/opentitan/sw/device/silicon_creator/rom/e2e/release/BUILD
ERROR: Build did NOT complete successfully
_run_cmd -> had a non-zero return code of 1.
make: *** [/nightly/current_run/opentitan/hw/dv/tools/dvsim/sim.mk:58: sw_build] Error 1
chip_sw_pwrmgr_sleep_wake_5_bug 34925000566985903204512256879784904364679698382080490020831606526514755838097 None
---- STDOUT ----
---- STDERR ----
WARNING: Target pattern parsing failed.
ERROR: Skipping '//sw/device/tests:pwrmgr_sleep_wake_5_bug_test_sim_dv': no such target '//sw/device/tests:pwrmgr_sleep_wake_5_bug_test_sim_dv': target 'pwrmgr_sleep_wake_5_bug_test_sim_dv' not declared in package 'sw/device/tests' defined by /nightly/current_run/opentitan/sw/device/tests/BUILD
ERROR: no such target '//sw/device/tests:pwrmgr_sleep_wake_5_bug_test_sim_dv': target 'pwrmgr_sleep_wake_5_bug_test_sim_dv' not declared in package 'sw/device/tests' defined by /nightly/current_run/opentitan/sw/device/tests/BUILD
ERROR: Build did NOT complete successfully
_run_cmd -> had a non-zero return code of 1.
make: *** [/nightly/current_run/opentitan/hw/dv/tools/dvsim/sim.mk:58: sw_build] Error 1
rom_e2e_asm_init_test_unlocked0 74747577554770773769944350953180262576465705388694179177582946393332448672778 None
Another command (pid=312949) is running. Waiting for it to complete on the server (server_pid=256587)...
Another command (pid=322247) is running. Waiting for it to complete on the server (server_pid=256587)...
Another command (pid=313583) is running. Waiting for it to complete on the server (server_pid=256587)...
WARNING: Target pattern parsing failed.
ERROR: Skipping '//sw/device/silicon_creator/rom/e2e:empty_test_slot_a_fake_ecdsa_prod_key_0_sim_dv': no such target '//sw/device/silicon_creator/rom/e2e:empty_test_slot_a_fake_ecdsa_prod_key_0_sim_dv': target 'empty_test_slot_a_fake_ecdsa_prod_key_0_sim_dv' not declared in package 'sw/device/silicon_creator/rom/e2e' defined by /nightly/current_run/opentitan/sw/device/silicon_creator/rom/e2e/BUILD
ERROR: no such target '//sw/device/silicon_creator/rom/e2e:empty_test_slot_a_fake_ecdsa_prod_key_0_sim_dv': target 'empty_test_slot_a_fake_ecdsa_prod_key_0_sim_dv' not declared in package 'sw/device/silicon_creator/rom/e2e' defined by /nightly/current_run/opentitan/sw/device/silicon_creator/rom/e2e/BUILD
ERROR: Build did NOT complete successfully
_run_cmd -> had a non-zero return code of 1.
make: *** [/nightly/current_run/opentitan/hw/dv/tools/dvsim/sim.mk:58: sw_build] Error 1
rom_e2e_asm_init_dev 69643861883997655343187726961623899423143873022020860986622521107882273074081 None
---- STDOUT ----
---- STDERR ----
WARNING: Target pattern parsing failed.
ERROR: Skipping '//sw/device/silicon_creator/rom/e2e:empty_test_slot_a_fake_ecdsa_prod_key_0_sim_dv': no such target '//sw/device/silicon_creator/rom/e2e:empty_test_slot_a_fake_ecdsa_prod_key_0_sim_dv': target 'empty_test_slot_a_fake_ecdsa_prod_key_0_sim_dv' not declared in package 'sw/device/silicon_creator/rom/e2e' defined by /nightly/current_run/opentitan/sw/device/silicon_creator/rom/e2e/BUILD
ERROR: no such target '//sw/device/silicon_creator/rom/e2e:empty_test_slot_a_fake_ecdsa_prod_key_0_sim_dv': target 'empty_test_slot_a_fake_ecdsa_prod_key_0_sim_dv' not declared in package 'sw/device/silicon_creator/rom/e2e' defined by /nightly/current_run/opentitan/sw/device/silicon_creator/rom/e2e/BUILD
ERROR: Build did NOT complete successfully
_run_cmd -> had a non-zero return code of 1.
make: *** [/nightly/current_run/opentitan/hw/dv/tools/dvsim/sim.mk:58: sw_build] Error 1
rom_e2e_asm_init_prod 79391010997942585666473808624578248335396466695315542206346300709942173224762 None
---- STDOUT ----
---- STDERR ----
WARNING: Target pattern parsing failed.
ERROR: Skipping '//sw/device/silicon_creator/rom/e2e:empty_test_slot_a_fake_ecdsa_prod_key_0_sim_dv': no such target '//sw/device/silicon_creator/rom/e2e:empty_test_slot_a_fake_ecdsa_prod_key_0_sim_dv': target 'empty_test_slot_a_fake_ecdsa_prod_key_0_sim_dv' not declared in package 'sw/device/silicon_creator/rom/e2e' defined by /nightly/current_run/opentitan/sw/device/silicon_creator/rom/e2e/BUILD
ERROR: no such target '//sw/device/silicon_creator/rom/e2e:empty_test_slot_a_fake_ecdsa_prod_key_0_sim_dv': target 'empty_test_slot_a_fake_ecdsa_prod_key_0_sim_dv' not declared in package 'sw/device/silicon_creator/rom/e2e' defined by /nightly/current_run/opentitan/sw/device/silicon_creator/rom/e2e/BUILD
ERROR: Build did NOT complete successfully
_run_cmd -> had a non-zero return code of 1.
make: *** [/nightly/current_run/opentitan/hw/dv/tools/dvsim/sim.mk:58: sw_build] Error 1
rom_e2e_asm_init_prod_end 88478515029405525749001467553749100304473984616952294330627099084843687489756 None
---- STDOUT ----
---- STDERR ----
WARNING: Target pattern parsing failed.
ERROR: Skipping '//sw/device/silicon_creator/rom/e2e:empty_test_slot_a_fake_ecdsa_prod_key_0_sim_dv': no such target '//sw/device/silicon_creator/rom/e2e:empty_test_slot_a_fake_ecdsa_prod_key_0_sim_dv': target 'empty_test_slot_a_fake_ecdsa_prod_key_0_sim_dv' not declared in package 'sw/device/silicon_creator/rom/e2e' defined by /nightly/current_run/opentitan/sw/device/silicon_creator/rom/e2e/BUILD
ERROR: no such target '//sw/device/silicon_creator/rom/e2e:empty_test_slot_a_fake_ecdsa_prod_key_0_sim_dv': target 'empty_test_slot_a_fake_ecdsa_prod_key_0_sim_dv' not declared in package 'sw/device/silicon_creator/rom/e2e' defined by /nightly/current_run/opentitan/sw/device/silicon_creator/rom/e2e/BUILD
ERROR: Build did NOT complete successfully
_run_cmd -> had a non-zero return code of 1.
make: *** [/nightly/current_run/opentitan/hw/dv/tools/dvsim/sim.mk:58: sw_build] Error 1
rom_e2e_asm_init_rma 106445403486559229434960740068683023316430051206353064257385770054430316315166 None
---- STDOUT ----
---- STDERR ----
WARNING: Target pattern parsing failed.
ERROR: Skipping '//sw/device/silicon_creator/rom/e2e:empty_test_slot_a_fake_ecdsa_prod_key_0_sim_dv': no such target '//sw/device/silicon_creator/rom/e2e:empty_test_slot_a_fake_ecdsa_prod_key_0_sim_dv': target 'empty_test_slot_a_fake_ecdsa_prod_key_0_sim_dv' not declared in package 'sw/device/silicon_creator/rom/e2e' defined by /nightly/current_run/opentitan/sw/device/silicon_creator/rom/e2e/BUILD
ERROR: no such target '//sw/device/silicon_creator/rom/e2e:empty_test_slot_a_fake_ecdsa_prod_key_0_sim_dv': target 'empty_test_slot_a_fake_ecdsa_prod_key_0_sim_dv' not declared in package 'sw/device/silicon_creator/rom/e2e' defined by /nightly/current_run/opentitan/sw/device/silicon_creator/rom/e2e/BUILD
ERROR: Build did NOT complete successfully
_run_cmd -> had a non-zero return code of 1.
make: *** [/nightly/current_run/opentitan/hw/dv/tools/dvsim/sim.mk:58: sw_build] Error 1
rom_volatile_raw_unlock 27072552888840816502110531183990789317071333262659997135524894070525922985923 None
Another command (pid=300878) is running. Waiting for it to complete on the server (server_pid=256587)...
Another command (pid=304619) is running. Waiting for it to complete on the server (server_pid=256587)...
Another command (pid=304573) is running. Waiting for it to complete on the server (server_pid=256587)...
WARNING: Target pattern parsing failed.
ERROR: Skipping '//sw/device/silicon_creator/rom/e2e:empty_test_slot_a_fake_ecdsa_test_key_0_sim_dv': no such target '//sw/device/silicon_creator/rom/e2e:empty_test_slot_a_fake_ecdsa_test_key_0_sim_dv': target 'empty_test_slot_a_fake_ecdsa_test_key_0_sim_dv' not declared in package 'sw/device/silicon_creator/rom/e2e' defined by /nightly/current_run/opentitan/sw/device/silicon_creator/rom/e2e/BUILD
ERROR: no such target '//sw/device/silicon_creator/rom/e2e:empty_test_slot_a_fake_ecdsa_test_key_0_sim_dv': target 'empty_test_slot_a_fake_ecdsa_test_key_0_sim_dv' not declared in package 'sw/device/silicon_creator/rom/e2e' defined by /nightly/current_run/opentitan/sw/device/silicon_creator/rom/e2e/BUILD
ERROR: Build did NOT complete successfully
_run_cmd -> had a non-zero return code of 1.
make: *** [/nightly/current_run/opentitan/hw/dv/tools/dvsim/sim.mk:58: sw_build] Error 1
rom_raw_unlock 107521276706227002570454923634796738924154849846700247255077141963912833209365 None
Another command (pid=285732) is running. Waiting for it to complete on the server (server_pid=256587)...
Another command (pid=287855) is running. Waiting for it to complete on the server (server_pid=256587)...
Another command (pid=292133) is running. Waiting for it to complete on the server (server_pid=256587)...
WARNING: Target pattern parsing failed.
ERROR: Skipping '//sw/device/silicon_creator/rom/e2e:empty_test_slot_a_fake_ecdsa_test_key_0_sim_dv': no such target '//sw/device/silicon_creator/rom/e2e:empty_test_slot_a_fake_ecdsa_test_key_0_sim_dv': target 'empty_test_slot_a_fake_ecdsa_test_key_0_sim_dv' not declared in package 'sw/device/silicon_creator/rom/e2e' defined by /nightly/current_run/opentitan/sw/device/silicon_creator/rom/e2e/BUILD
ERROR: no such target '//sw/device/silicon_creator/rom/e2e:empty_test_slot_a_fake_ecdsa_test_key_0_sim_dv': target 'empty_test_slot_a_fake_ecdsa_test_key_0_sim_dv' not declared in package 'sw/device/silicon_creator/rom/e2e' defined by /nightly/current_run/opentitan/sw/device/silicon_creator/rom/e2e/BUILD
ERROR: Build did NOT complete successfully
_run_cmd -> had a non-zero return code of 1.
make: *** [/nightly/current_run/opentitan/hw/dv/tools/dvsim/sim.mk:58: sw_build] Error 1
rom_e2e_self_hash 61537266121618430402615812896701376939579885650239499208713218030506726511286 None
Another command (pid=299205) is running. Waiting for it to complete on the server (server_pid=256587)...
Another command (pid=296651) is running. Waiting for it to complete on the server (server_pid=256587)...
Another command (pid=315432) is running. Waiting for it to complete on the server (server_pid=256587)...
WARNING: Target pattern parsing failed.
ERROR: Skipping '//sw/device/silicon_creator/rom/e2e/release:rom_e2e_self_hash_test_sim_dv': no such target '//sw/device/silicon_creator/rom/e2e/release:rom_e2e_self_hash_test_sim_dv': target 'rom_e2e_self_hash_test_sim_dv' not declared in package 'sw/device/silicon_creator/rom/e2e/release' defined by /nightly/current_run/opentitan/sw/device/silicon_creator/rom/e2e/release/BUILD
ERROR: no such target '//sw/device/silicon_creator/rom/e2e/release:rom_e2e_self_hash_test_sim_dv': target 'rom_e2e_self_hash_test_sim_dv' not declared in package 'sw/device/silicon_creator/rom/e2e/release' defined by /nightly/current_run/opentitan/sw/device/silicon_creator/rom/e2e/release/BUILD
ERROR: Build did NOT complete successfully
_run_cmd -> had a non-zero return code of 1.
make: *** [/nightly/current_run/opentitan/hw/dv/tools/dvsim/sim.mk:58: sw_build] Error 1
UVM_ERROR @ * us: (cip_base_scoreboard.sv:575) scoreboard [scoreboard] On interface chip_reg_block, item had unexpected d_error value(predicted *, but saw *). 28 test runs
chip_tl_errors 95188738750710049276795313400456487373584561607964990772465470518491321841253 217
TL item was: req: (cip_tl_seq_item@31478) { a_addr: 'h10718 a_data: 'h6bfa37c9 a_mask: 'hf a_size: 'h2 a_param: 'h0 a_source: 'h39 a_opcode: 'h4 a_user: 'h1a9f0 d_param: 'h0 d_source: 'h39 d_data: 'h0 d_size: 'h2 d_opcode: 'h1 d_error: 'h0 d_sink: 'h0 d_user: 'hd2a a_valid_delay: 'h0 d_valid_delay: 'h0 a_valid_len: 'h0 d_valid_len: 'h0 req_abort_after_a_valid_len: 'h0 rsp_abort_after_d_valid_len: 'h0 req_completed: 'h0 rsp_completed: 'h0 tl_intg_err_type: TlIntgErrNone max_ecc_errors: 'h3 }
Reasons for predicted error: '{"Fetch from CSR"} .
UVM_INFO @ 2595.726388 us: (uvm_report_catcher.svh:705) [UVM/REPORT/CATCHER]
--- UVM Report catcher Summary ---
chip_csr_mem_rw_with_rand_reset 11709651998880089366706792437962172807611192373493454255753463559148692442968 224
TL item was: req: (cip_tl_seq_item@31156) { a_addr: 'h10684 a_data: 'hf98d26a9 a_mask: 'hf a_size: 'h2 a_param: 'h0 a_source: 'h3 a_opcode: 'h4 a_user: 'h1a2da d_param: 'h0 d_source: 'h3 d_data: 'h0 d_size: 'h2 d_opcode: 'h1 d_error: 'h0 d_sink: 'h0 d_user: 'hd2a a_valid_delay: 'h0 d_valid_delay: 'h0 a_valid_len: 'h0 d_valid_len: 'h0 req_abort_after_a_valid_len: 'h0 rsp_abort_after_d_valid_len: 'h0 req_completed: 'h0 rsp_completed: 'h0 tl_intg_err_type: TlIntgErrNone max_ecc_errors: 'h3 }
Reasons for predicted error: '{"Fetch from CSR"} .
UVM_INFO @ 3036.659470 us: (uvm_report_catcher.svh:705) [UVM/REPORT/CATCHER]
--- UVM Report catcher Summary ---
chip_tl_errors 11157598136778566494450773595955768924009979180849319201397934320029086692091 217
TL item was: req: (cip_tl_seq_item@33706) { a_addr: 'h10790 a_data: 'hf4feda2b a_mask: 'hf a_size: 'h2 a_param: 'h0 a_source: 'h2b a_opcode: 'h4 a_user: 'h18dcb d_param: 'h0 d_source: 'h2b d_data: 'h0 d_size: 'h2 d_opcode: 'h1 d_error: 'h0 d_sink: 'h0 d_user: 'hd2a a_valid_delay: 'h0 d_valid_delay: 'h0 a_valid_len: 'h0 d_valid_len: 'h0 req_abort_after_a_valid_len: 'h0 rsp_abort_after_d_valid_len: 'h0 req_completed: 'h0 rsp_completed: 'h0 tl_intg_err_type: TlIntgErrNone max_ecc_errors: 'h3 }
Reasons for predicted error: '{"Fetch from CSR"} .
UVM_INFO @ 2587.767302 us: (uvm_report_catcher.svh:705) [UVM/REPORT/CATCHER]
--- UVM Report catcher Summary ---
chip_csr_mem_rw_with_rand_reset 56174630953751274941019321577449158068052066256204119896986307337149592206472 224
TL item was: req: (cip_tl_seq_item@32500) { a_addr: 'h1061c a_data: 'h27162584 a_mask: 'hf a_size: 'h2 a_param: 'h0 a_source: 'h35 a_opcode: 'h4 a_user: 'h1a267 d_param: 'h0 d_source: 'h35 d_data: 'h0 d_size: 'h2 d_opcode: 'h1 d_error: 'h0 d_sink: 'h0 d_user: 'hd2a a_valid_delay: 'h0 d_valid_delay: 'h0 a_valid_len: 'h0 d_valid_len: 'h0 req_abort_after_a_valid_len: 'h0 rsp_abort_after_d_valid_len: 'h0 req_completed: 'h0 rsp_completed: 'h0 tl_intg_err_type: TlIntgErrNone max_ecc_errors: 'h3 }
Reasons for predicted error: '{"Fetch from CSR"} .
UVM_INFO @ 2512.393211 us: (uvm_report_catcher.svh:705) [UVM/REPORT/CATCHER]
--- UVM Report catcher Summary ---
chip_tl_errors 42638899458242619092448039714388332017218407780036993954185199119072620242041 217
TL item was: req: (cip_tl_seq_item@32038) { a_addr: 'h1045c a_data: 'h604d2bb0 a_mask: 'hf a_size: 'h2 a_param: 'h0 a_source: 'h28 a_opcode: 'h4 a_user: 'h181f8 d_param: 'h0 d_source: 'h28 d_data: 'h0 d_size: 'h2 d_opcode: 'h1 d_error: 'h0 d_sink: 'h0 d_user: 'hd2a a_valid_delay: 'h0 d_valid_delay: 'h0 a_valid_len: 'h0 d_valid_len: 'h0 req_abort_after_a_valid_len: 'h0 rsp_abort_after_d_valid_len: 'h0 req_completed: 'h0 rsp_completed: 'h0 tl_intg_err_type: TlIntgErrNone max_ecc_errors: 'h3 }
Reasons for predicted error: '{"Fetch from CSR"} .
UVM_INFO @ 2630.023716 us: (uvm_report_catcher.svh:705) [UVM/REPORT/CATCHER]
--- UVM Report catcher Summary ---
chip_tl_errors 56391529392689292557272212545652769388966442938647860857784459674197295347424 217
TL item was: req: (cip_tl_seq_item@36338) { a_addr: 'h10650 a_data: 'h93367fb7 a_mask: 'hf a_size: 'h2 a_param: 'h0 a_source: 'h21 a_opcode: 'h4 a_user: 'h192b5 d_param: 'h0 d_source: 'h21 d_data: 'h0 d_size: 'h2 d_opcode: 'h1 d_error: 'h0 d_sink: 'h0 d_user: 'hd2a a_valid_delay: 'h0 d_valid_delay: 'h0 a_valid_len: 'h0 d_valid_len: 'h0 req_abort_after_a_valid_len: 'h0 rsp_abort_after_d_valid_len: 'h0 req_completed: 'h0 rsp_completed: 'h0 tl_intg_err_type: TlIntgErrNone max_ecc_errors: 'h3 }
Reasons for predicted error: '{"Fetch from CSR"} .
UVM_INFO @ 1951.300343 us: (uvm_report_catcher.svh:705) [UVM/REPORT/CATCHER]
--- UVM Report catcher Summary ---
chip_tl_errors 359058007890069470215661433315685772501924984800078237738570032401229683570 218
TL item was: req: (cip_tl_seq_item@142654) { a_addr: 'h1037c a_data: 'hd8169a1 a_mask: 'hf a_size: 'h2 a_param: 'h0 a_source: 'hf a_opcode: 'h4 a_user: 'h18638 d_param: 'h0 d_source: 'hf d_data: 'h0 d_size: 'h2 d_opcode: 'h1 d_error: 'h0 d_sink: 'h0 d_user: 'hd2a a_valid_delay: 'h0 d_valid_delay: 'h0 a_valid_len: 'h0 d_valid_len: 'h0 req_abort_after_a_valid_len: 'h0 rsp_abort_after_d_valid_len: 'h0 req_completed: 'h0 rsp_completed: 'h0 tl_intg_err_type: TlIntgErrNone max_ecc_errors: 'h3 }
Reasons for predicted error: '{"Fetch from CSR"} .
UVM_INFO @ 2782.770208 us: (uvm_report_catcher.svh:705) [UVM/REPORT/CATCHER]
--- UVM Report catcher Summary ---
chip_tl_errors 105842104947809309690899691508071878898246107158748347947346265122327758939880 217
TL item was: req: (cip_tl_seq_item@32224) { a_addr: 'h10668 a_data: 'hfc0ecfcc a_mask: 'hf a_size: 'h2 a_param: 'h0 a_source: 'h27 a_opcode: 'h4 a_user: 'h1ba21 d_param: 'h0 d_source: 'h27 d_data: 'h0 d_size: 'h2 d_opcode: 'h1 d_error: 'h0 d_sink: 'h0 d_user: 'hd2a a_valid_delay: 'h0 d_valid_delay: 'h0 a_valid_len: 'h0 d_valid_len: 'h0 req_abort_after_a_valid_len: 'h0 rsp_abort_after_d_valid_len: 'h0 req_completed: 'h0 rsp_completed: 'h0 tl_intg_err_type: TlIntgErrNone max_ecc_errors: 'h3 }
Reasons for predicted error: '{"Fetch from CSR"} .
UVM_INFO @ 2347.439724 us: (uvm_report_catcher.svh:705) [UVM/REPORT/CATCHER]
--- UVM Report catcher Summary ---
chip_tl_errors 1507352239025749017950013890284043579669186348732975275914065878495702423827 217
TL item was: req: (cip_tl_seq_item@46752) { a_addr: 'h107ec a_data: 'h5edec46d a_mask: 'hf a_size: 'h2 a_param: 'h0 a_source: 'h34 a_opcode: 'h4 a_user: 'h1817d d_param: 'h0 d_source: 'h34 d_data: 'h0 d_size: 'h2 d_opcode: 'h1 d_error: 'h0 d_sink: 'h0 d_user: 'hd2a a_valid_delay: 'h0 d_valid_delay: 'h0 a_valid_len: 'h0 d_valid_len: 'h0 req_abort_after_a_valid_len: 'h0 rsp_abort_after_d_valid_len: 'h0 req_completed: 'h0 rsp_completed: 'h0 tl_intg_err_type: TlIntgErrNone max_ecc_errors: 'h3 }
Reasons for predicted error: '{"Fetch from CSR"} .
UVM_INFO @ 2458.927104 us: (uvm_report_catcher.svh:705) [UVM/REPORT/CATCHER]
--- UVM Report catcher Summary ---
chip_tl_errors 92372272753105584496877785411368977723680052888852100617551448031099931478505 217
TL item was: req: (cip_tl_seq_item@33152) { a_addr: 'h10340 a_data: 'h80fab06e a_mask: 'hf a_size: 'h2 a_param: 'h0 a_source: 'h32 a_opcode: 'h4 a_user: 'h1a206 d_param: 'h0 d_source: 'h32 d_data: 'hc55513 d_size: 'h2 d_opcode: 'h1 d_error: 'h0 d_sink: 'h0 d_user: 'hd33 a_valid_delay: 'h0 d_valid_delay: 'h0 a_valid_len: 'h0 d_valid_len: 'h0 req_abort_after_a_valid_len: 'h0 rsp_abort_after_d_valid_len: 'h0 req_completed: 'h0 rsp_completed: 'h0 tl_intg_err_type: TlIntgErrNone max_ecc_errors: 'h3 }
Reasons for predicted error: '{"Fetch from CSR"} .
UVM_INFO @ 2520.024235 us: (uvm_report_catcher.svh:705) [UVM/REPORT/CATCHER]
--- UVM Report catcher Summary ---
chip_tl_errors 101872739478158206862615323711332045396353516858556551918504885804684319327220 218
TL item was: req: (cip_tl_seq_item@131014) { a_addr: 'h106a8 a_data: 'h5ad71996 a_mask: 'hf a_size: 'h2 a_param: 'h0 a_source: 'h12 a_opcode: 'h4 a_user: 'h1a24b d_param: 'h0 d_source: 'h12 d_data: 'h0 d_size: 'h2 d_opcode: 'h1 d_error: 'h0 d_sink: 'h0 d_user: 'hd2a a_valid_delay: 'h0 d_valid_delay: 'h0 a_valid_len: 'h0 d_valid_len: 'h0 req_abort_after_a_valid_len: 'h0 rsp_abort_after_d_valid_len: 'h0 req_completed: 'h0 rsp_completed: 'h0 tl_intg_err_type: TlIntgErrNone max_ecc_errors: 'h3 }
Reasons for predicted error: '{"Fetch from CSR"} .
UVM_INFO @ 2461.073761 us: (uvm_report_catcher.svh:705) [UVM/REPORT/CATCHER]
--- UVM Report catcher Summary ---
chip_tl_errors 57416520461422819918690523837000944850940088081410108138919050028001260581043 217
TL item was: req: (cip_tl_seq_item@35344) { a_addr: 'h10370 a_data: 'hd382206e a_mask: 'hf a_size: 'h2 a_param: 'h0 a_source: 'h3 a_opcode: 'h4 a_user: 'h19e2d d_param: 'h0 d_source: 'h3 d_data: 'h0 d_size: 'h2 d_opcode: 'h1 d_error: 'h0 d_sink: 'h0 d_user: 'hd2a a_valid_delay: 'h0 d_valid_delay: 'h0 a_valid_len: 'h0 d_valid_len: 'h0 req_abort_after_a_valid_len: 'h0 rsp_abort_after_d_valid_len: 'h0 req_completed: 'h0 rsp_completed: 'h0 tl_intg_err_type: TlIntgErrNone max_ecc_errors: 'h3 }
Reasons for predicted error: '{"Fetch from CSR"} .
UVM_INFO @ 1908.137000 us: (uvm_report_catcher.svh:705) [UVM/REPORT/CATCHER]
--- UVM Report catcher Summary ---
chip_tl_errors 39929404643928719822659021137648707323467619954074154896531676245003059809745 217
TL item was: req: (cip_tl_seq_item@31898) { a_addr: 'h106c0 a_data: 'hd6258344 a_mask: 'hf a_size: 'h2 a_param: 'h0 a_source: 'h12 a_opcode: 'h4 a_user: 'h18692 d_param: 'h0 d_source: 'h12 d_data: 'h0 d_size: 'h2 d_opcode: 'h1 d_error: 'h0 d_sink: 'h0 d_user: 'hd2a a_valid_delay: 'h0 d_valid_delay: 'h0 a_valid_len: 'h0 d_valid_len: 'h0 req_abort_after_a_valid_len: 'h0 rsp_abort_after_d_valid_len: 'h0 req_completed: 'h0 rsp_completed: 'h0 tl_intg_err_type: TlIntgErrNone max_ecc_errors: 'h3 }
Reasons for predicted error: '{"Fetch from CSR"} .
UVM_INFO @ 2919.921151 us: (uvm_report_catcher.svh:705) [UVM/REPORT/CATCHER]
--- UVM Report catcher Summary ---
chip_tl_errors 43395580014059919692057742676205624338958723695348746216261131159102541358954 217
TL item was: req: (cip_tl_seq_item@31010) { a_addr: 'h10418 a_data: 'h28c92668 a_mask: 'hf a_size: 'h2 a_param: 'h0 a_source: 'h1b a_opcode: 'h4 a_user: 'h1a5d2 d_param: 'h0 d_source: 'h1b d_data: 'h0 d_size: 'h2 d_opcode: 'h1 d_error: 'h0 d_sink: 'h0 d_user: 'hd2a a_valid_delay: 'h0 d_valid_delay: 'h0 a_valid_len: 'h0 d_valid_len: 'h0 req_abort_after_a_valid_len: 'h0 rsp_abort_after_d_valid_len: 'h0 req_completed: 'h0 rsp_completed: 'h0 tl_intg_err_type: TlIntgErrNone max_ecc_errors: 'h3 }
Reasons for predicted error: '{"Fetch from CSR"} .
UVM_INFO @ 3045.717689 us: (uvm_report_catcher.svh:705) [UVM/REPORT/CATCHER]
--- UVM Report catcher Summary ---
chip_tl_errors 30153128943627213088162511053986077679597031793162347941767808442145102785451 217
TL item was: req: (cip_tl_seq_item@31244) { a_addr: 'h10684 a_data: 'h5ef85c90 a_mask: 'hf a_size: 'h2 a_param: 'h0 a_source: 'h2b a_opcode: 'h4 a_user: 'h1a2a3 d_param: 'h0 d_source: 'h2b d_data: 'h0 d_size: 'h2 d_opcode: 'h1 d_error: 'h0 d_sink: 'h0 d_user: 'hd2a a_valid_delay: 'h0 d_valid_delay: 'h0 a_valid_len: 'h0 d_valid_len: 'h0 req_abort_after_a_valid_len: 'h0 rsp_abort_after_d_valid_len: 'h0 req_completed: 'h0 rsp_completed: 'h0 tl_intg_err_type: TlIntgErrNone max_ecc_errors: 'h3 }
Reasons for predicted error: '{"Fetch from CSR"} .
UVM_INFO @ 2464.153624 us: (uvm_report_catcher.svh:705) [UVM/REPORT/CATCHER]
--- UVM Report catcher Summary ---
chip_tl_errors 7915491057336336773540335802378639664029759104972908021513893462110473314831 217
TL item was: req: (cip_tl_seq_item@31130) { a_addr: 'h10670 a_data: 'he8fc8a31 a_mask: 'hf a_size: 'h2 a_param: 'h0 a_source: 'h23 a_opcode: 'h4 a_user: 'h18a08 d_param: 'h0 d_source: 'h23 d_data: 'h0 d_size: 'h2 d_opcode: 'h1 d_error: 'h0 d_sink: 'h0 d_user: 'hd2a a_valid_delay: 'h0 d_valid_delay: 'h0 a_valid_len: 'h0 d_valid_len: 'h0 req_abort_after_a_valid_len: 'h0 rsp_abort_after_d_valid_len: 'h0 req_completed: 'h0 rsp_completed: 'h0 tl_intg_err_type: TlIntgErrNone max_ecc_errors: 'h3 }
Reasons for predicted error: '{"Fetch from CSR"} .
UVM_INFO @ 2941.979336 us: (uvm_report_catcher.svh:705) [UVM/REPORT/CATCHER]
--- UVM Report catcher Summary ---
chip_tl_errors 8787360177364145027830951027383496394917255859923106100360364832119577989842 217
TL item was: req: (cip_tl_seq_item@30998) { a_addr: 'h10678 a_data: 'h857be1a9 a_mask: 'hf a_size: 'h2 a_param: 'h0 a_source: 'h3a a_opcode: 'h4 a_user: 'h19e91 d_param: 'h0 d_source: 'h3a d_data: 'h0 d_size: 'h2 d_opcode: 'h1 d_error: 'h0 d_sink: 'h0 d_user: 'hd2a a_valid_delay: 'h0 d_valid_delay: 'h0 a_valid_len: 'h0 d_valid_len: 'h0 req_abort_after_a_valid_len: 'h0 rsp_abort_after_d_valid_len: 'h0 req_completed: 'h0 rsp_completed: 'h0 tl_intg_err_type: TlIntgErrNone max_ecc_errors: 'h3 }
Reasons for predicted error: '{"Fetch from CSR"} .
UVM_INFO @ 2126.236582 us: (uvm_report_catcher.svh:705) [UVM/REPORT/CATCHER]
--- UVM Report catcher Summary ---
chip_tl_errors 70889924891953719029232350304235296910748771977664138401432883949431461325183 217
TL item was: req: (cip_tl_seq_item@31284) { a_addr: 'h105b0 a_data: 'h780009a2 a_mask: 'hf a_size: 'h2 a_param: 'h0 a_source: 'h2f a_opcode: 'h4 a_user: 'h19e78 d_param: 'h0 d_source: 'h2f d_data: 'h0 d_size: 'h2 d_opcode: 'h1 d_error: 'h0 d_sink: 'h0 d_user: 'hd2a a_valid_delay: 'h0 d_valid_delay: 'h0 a_valid_len: 'h0 d_valid_len: 'h0 req_abort_after_a_valid_len: 'h0 rsp_abort_after_d_valid_len: 'h0 req_completed: 'h0 rsp_completed: 'h0 tl_intg_err_type: TlIntgErrNone max_ecc_errors: 'h3 }
Reasons for predicted error: '{"Fetch from CSR"} .
UVM_INFO @ 2215.262960 us: (uvm_report_catcher.svh:705) [UVM/REPORT/CATCHER]
--- UVM Report catcher Summary ---
chip_tl_errors 95966577187851482109984938661527907173263677649269714585277841940934800032361 217
TL item was: req: (cip_tl_seq_item@48060) { a_addr: 'h10780 a_data: 'h1e1b4a3e a_mask: 'hf a_size: 'h2 a_param: 'h0 a_source: 'h35 a_opcode: 'h4 a_user: 'h1a916 d_param: 'h0 d_source: 'h35 d_data: 'h0 d_size: 'h2 d_opcode: 'h1 d_error: 'h0 d_sink: 'h0 d_user: 'hd2a a_valid_delay: 'h0 d_valid_delay: 'h0 a_valid_len: 'h0 d_valid_len: 'h0 req_abort_after_a_valid_len: 'h0 rsp_abort_after_d_valid_len: 'h0 req_completed: 'h0 rsp_completed: 'h0 tl_intg_err_type: TlIntgErrNone max_ecc_errors: 'h3 }
Reasons for predicted error: '{"Fetch from CSR"} .
UVM_INFO @ 2550.166458 us: (uvm_report_catcher.svh:705) [UVM/REPORT/CATCHER]
--- UVM Report catcher Summary ---
chip_tl_errors 38254987544923932071225886691824489160266542979386304100159986045853584695350 217
TL item was: req: (cip_tl_seq_item@36036) { a_addr: 'h10780 a_data: 'h88360c6c a_mask: 'hf a_size: 'h2 a_param: 'h0 a_source: 'h1c a_opcode: 'h4 a_user: 'h1a952 d_param: 'h0 d_source: 'h1c d_data: 'h0 d_size: 'h2 d_opcode: 'h1 d_error: 'h0 d_sink: 'h0 d_user: 'hd2a a_valid_delay: 'h0 d_valid_delay: 'h0 a_valid_len: 'h0 d_valid_len: 'h0 req_abort_after_a_valid_len: 'h0 rsp_abort_after_d_valid_len: 'h0 req_completed: 'h0 rsp_completed: 'h0 tl_intg_err_type: TlIntgErrNone max_ecc_errors: 'h3 }
Reasons for predicted error: '{"Fetch from CSR"} .
UVM_INFO @ 2762.466948 us: (uvm_report_catcher.svh:705) [UVM/REPORT/CATCHER]
--- UVM Report catcher Summary ---
chip_tl_errors 22153536491462276973162556242723282104633736452873815420876595602811238891852 218
TL item was: req: (cip_tl_seq_item@141364) { a_addr: 'h104bc a_data: 'h18cbb25 a_mask: 'hf a_size: 'h2 a_param: 'h0 a_source: 'h23 a_opcode: 'h4 a_user: 'h1814d d_param: 'h0 d_source: 'h23 d_data: 'h0 d_size: 'h2 d_opcode: 'h1 d_error: 'h0 d_sink: 'h0 d_user: 'hd2a a_valid_delay: 'h0 d_valid_delay: 'h0 a_valid_len: 'h0 d_valid_len: 'h0 req_abort_after_a_valid_len: 'h0 rsp_abort_after_d_valid_len: 'h0 req_completed: 'h0 rsp_completed: 'h0 tl_intg_err_type: TlIntgErrNone max_ecc_errors: 'h3 }
Reasons for predicted error: '{"Fetch from CSR"} .
UVM_INFO @ 3591.690386 us: (uvm_report_catcher.svh:705) [UVM/REPORT/CATCHER]
--- UVM Report catcher Summary ---
chip_tl_errors 37314236009773690116525756660896548733155887420674892440161123653348281463251 217
TL item was: req: (cip_tl_seq_item@31878) { a_addr: 'h104c8 a_data: 'h4e9b93e3 a_mask: 'hf a_size: 'h2 a_param: 'h0 a_source: 'h2a a_opcode: 'h4 a_user: 'h1993e d_param: 'h0 d_source: 'h2a d_data: 'h0 d_size: 'h2 d_opcode: 'h1 d_error: 'h0 d_sink: 'h0 d_user: 'hd2a a_valid_delay: 'h0 d_valid_delay: 'h0 a_valid_len: 'h0 d_valid_len: 'h0 req_abort_after_a_valid_len: 'h0 rsp_abort_after_d_valid_len: 'h0 req_completed: 'h0 rsp_completed: 'h0 tl_intg_err_type: TlIntgErrNone max_ecc_errors: 'h3 }
Reasons for predicted error: '{"Fetch from CSR"} .
UVM_INFO @ 2664.406624 us: (uvm_report_catcher.svh:705) [UVM/REPORT/CATCHER]
--- UVM Report catcher Summary ---
chip_tl_errors 63409335318168484945907255092306122827190071265395359395305632771345062663498 218
TL item was: req: (cip_tl_seq_item@44364) { a_addr: 'h10574 a_data: 'hd055134b a_mask: 'hf a_size: 'h2 a_param: 'h0 a_source: 'h1b a_opcode: 'h4 a_user: 'h18ad4 d_param: 'h0 d_source: 'h1b d_data: 'h0 d_size: 'h2 d_opcode: 'h1 d_error: 'h0 d_sink: 'h0 d_user: 'hd2a a_valid_delay: 'h0 d_valid_delay: 'h0 a_valid_len: 'h0 d_valid_len: 'h0 req_abort_after_a_valid_len: 'h0 rsp_abort_after_d_valid_len: 'h0 req_completed: 'h0 rsp_completed: 'h0 tl_intg_err_type: TlIntgErrNone max_ecc_errors: 'h3 }
Reasons for predicted error: '{"Fetch from CSR"} .
UVM_INFO @ 2364.426616 us: (uvm_report_catcher.svh:705) [UVM/REPORT/CATCHER]
--- UVM Report catcher Summary ---
chip_tl_errors 90628912290379522007841855775424786250667657514876599844658113586564564231107 217
TL item was: req: (cip_tl_seq_item@31150) { a_addr: 'h10764 a_data: 'hb0aa6125 a_mask: 'hf a_size: 'h2 a_param: 'h0 a_source: 'h3 a_opcode: 'h4 a_user: 'h1a57b d_param: 'h0 d_source: 'h3 d_data: 'h0 d_size: 'h2 d_opcode: 'h1 d_error: 'h0 d_sink: 'h0 d_user: 'hd2a a_valid_delay: 'h0 d_valid_delay: 'h0 a_valid_len: 'h0 d_valid_len: 'h0 req_abort_after_a_valid_len: 'h0 rsp_abort_after_d_valid_len: 'h0 req_completed: 'h0 rsp_completed: 'h0 tl_intg_err_type: TlIntgErrNone max_ecc_errors: 'h3 }
Reasons for predicted error: '{"Fetch from CSR"} .
UVM_INFO @ 2998.905388 us: (uvm_report_catcher.svh:705) [UVM/REPORT/CATCHER]
--- UVM Report catcher Summary ---
chip_tl_errors 80381068092675077218936376728018565630312470467714102634675659692350072762719 217
TL item was: req: (cip_tl_seq_item@38236) { a_addr: 'h106cc a_data: 'h49dee7de a_mask: 'hf a_size: 'h2 a_param: 'h0 a_source: 'h37 a_opcode: 'h4 a_user: 'h19ee9 d_param: 'h0 d_source: 'h37 d_data: 'h0 d_size: 'h2 d_opcode: 'h1 d_error: 'h0 d_sink: 'h0 d_user: 'hd2a a_valid_delay: 'h0 d_valid_delay: 'h0 a_valid_len: 'h0 d_valid_len: 'h0 req_abort_after_a_valid_len: 'h0 rsp_abort_after_d_valid_len: 'h0 req_completed: 'h0 rsp_completed: 'h0 tl_intg_err_type: TlIntgErrNone max_ecc_errors: 'h3 }
Reasons for predicted error: '{"Fetch from CSR"} .
UVM_INFO @ 2188.866158 us: (uvm_report_catcher.svh:705) [UVM/REPORT/CATCHER]
--- UVM Report catcher Summary ---
chip_tl_errors 80685393742341809342761614578529764680402335299752233697040377340348402569513 217
TL item was: req: (cip_tl_seq_item@31310) { a_addr: 'h1064c a_data: 'h4adaad7f a_mask: 'hf a_size: 'h2 a_param: 'h0 a_source: 'h3d a_opcode: 'h4 a_user: 'h1ae6e d_param: 'h0 d_source: 'h3d d_data: 'h0 d_size: 'h2 d_opcode: 'h1 d_error: 'h0 d_sink: 'h0 d_user: 'hd2a a_valid_delay: 'h0 d_valid_delay: 'h0 a_valid_len: 'h0 d_valid_len: 'h0 req_abort_after_a_valid_len: 'h0 rsp_abort_after_d_valid_len: 'h0 req_completed: 'h0 rsp_completed: 'h0 tl_intg_err_type: TlIntgErrNone max_ecc_errors: 'h3 }
Reasons for predicted error: '{"Fetch from CSR"} .
UVM_INFO @ 2305.139904 us: (uvm_report_catcher.svh:705) [UVM/REPORT/CATCHER]
--- UVM Report catcher Summary ---
chip_tl_errors 46304941248101277537525372184874811536122746564203532762648419961379536853391 217
TL item was: req: (cip_tl_seq_item@32906) { a_addr: 'h10358 a_data: 'h88ed4a0a a_mask: 'hf a_size: 'h2 a_param: 'h0 a_source: 'h2e a_opcode: 'h4 a_user: 'h19274 d_param: 'h0 d_source: 'h2e d_data: 'h7b302573 d_size: 'h2 d_opcode: 'h1 d_error: 'h0 d_sink: 'h0 d_user: 'hd1f a_valid_delay: 'h0 d_valid_delay: 'h0 a_valid_len: 'h0 d_valid_len: 'h0 req_abort_after_a_valid_len: 'h0 rsp_abort_after_d_valid_len: 'h0 req_completed: 'h0 rsp_completed: 'h0 tl_intg_err_type: TlIntgErrNone max_ecc_errors: 'h3 }
Reasons for predicted error: '{"Fetch from CSR"} .
UVM_INFO @ 2548.681816 us: (uvm_report_catcher.svh:705) [UVM/REPORT/CATCHER]
--- UVM Report catcher Summary ---
chip_tl_errors 63028956496512265073373583956036735465896973251221896034122654444247383421513 217
TL item was: req: (cip_tl_seq_item@32066) { a_addr: 'h107d8 a_data: 'hcb58bf48 a_mask: 'hf a_size: 'h2 a_param: 'h0 a_source: 'h3 a_opcode: 'h4 a_user: 'h1b1e3 d_param: 'h0 d_source: 'h3 d_data: 'h0 d_size: 'h2 d_opcode: 'h1 d_error: 'h0 d_sink: 'h0 d_user: 'hd2a a_valid_delay: 'h0 d_valid_delay: 'h0 a_valid_len: 'h0 d_valid_len: 'h0 req_abort_after_a_valid_len: 'h0 rsp_abort_after_d_valid_len: 'h0 req_completed: 'h0 rsp_completed: 'h0 tl_intg_err_type: TlIntgErrNone max_ecc_errors: 'h3 }
Reasons for predicted error: '{"Fetch from CSR"} .
UVM_INFO @ 2871.685790 us: (uvm_report_catcher.svh:705) [UVM/REPORT/CATCHER]
--- UVM Report catcher Summary ---
Job timed out after * minutes 12 test runs
chip_sw_rv_timer_systick_test 32103287634194538936763978710407262574149882861280379049406492191879754090759 None
chip_sw_adc_ctrl_sleep_debug_cable_wakeup 104409425428189290393762277258361226731254648514003246212485498131424409320251 None
chip_sw_alert_handler_lpg_sleep_mode_pings 33710664387098631677518329887698910246274110622912864858596291595566621644057 None
ate_bootstrap_disjoint 98896037524173589347552183480093817748533438058557100927169991495763013598537 None
chip_sw_rv_timer_systick_test 17073898440432981992540658449539831341982262203396744104689546873694031652703 None
chip_sw_adc_ctrl_sleep_debug_cable_wakeup 32780064674466582260996925698806841328776088660345175666975097764226440215277 None
chip_sw_alert_handler_lpg_sleep_mode_pings 68475861022254715739122472858956517574893929187816908533934273312167159156984 None
ate_bootstrap_disjoint 17728077267147014109771005132129268866242922748812560656625585606685557012767 None
chip_sw_rv_timer_systick_test 87076969016170078145699011452304262462115930772362595186926633988555843753644 None
chip_sw_adc_ctrl_sleep_debug_cable_wakeup 29201444134469363188204578549405279660874947303905184657704833552595379432115 None
chip_sw_alert_handler_lpg_sleep_mode_pings 94347946421777806466511191578676374868334039779550998621434676765203968442798 None
ate_bootstrap_disjoint 4195690355498736859100452888683393039718232917790417006147203123639308672367 None
UVM_ERROR @ * us: (chip_sw_base_vseq.sv:322) virtual_sequencer [chip_sw_base_vseq] SW TEST TIMED OUT. STATE: SwTestStatusInTest, TIMEOUT = * ns 9 test runs
chip_sw_hmac_oneshot 63023325276495179250893461424872707374573150718521131251352475823489239796937 310
UVM_INFO @ 12018.523149 us: (uvm_report_catcher.svh:705) [UVM/REPORT/CATCHER]
--- UVM Report catcher Summary ---
chip_sw_hmac_multistream 16637947258094490718973829354780798741031246114438167856931516045061215846250 310
UVM_INFO @ 12018.615515 us: (uvm_report_catcher.svh:705) [UVM/REPORT/CATCHER]
--- UVM Report catcher Summary ---
chip_sw_keymgr_sideload_otbn 1615339008173056279177160144685227570529304982851672332249459545993450192241 336
UVM_INFO @ 20018.394200 us: (uvm_report_catcher.svh:705) [UVM/REPORT/CATCHER]
--- UVM Report catcher Summary ---
chip_sw_hmac_oneshot 85749067209540559927457949573107473924298982498985806255816270621604489033486 310
UVM_INFO @ 12018.680369 us: (uvm_report_catcher.svh:705) [UVM/REPORT/CATCHER]
--- UVM Report catcher Summary ---
chip_sw_hmac_multistream 35160902334775592646509526542137567402705452260539082130651552331618378911609 310
UVM_INFO @ 12018.439708 us: (uvm_report_catcher.svh:705) [UVM/REPORT/CATCHER]
--- UVM Report catcher Summary ---
chip_sw_keymgr_sideload_otbn 51544843871851352269432944756164304442673056983140092147496926380918425766744 336
UVM_INFO @ 20026.940639 us: (uvm_report_catcher.svh:705) [UVM/REPORT/CATCHER]
--- UVM Report catcher Summary ---
chip_sw_hmac_oneshot 38144883339604923079517865973393627253079657722466828481159070194620069638785 310
UVM_INFO @ 12018.453809 us: (uvm_report_catcher.svh:705) [UVM/REPORT/CATCHER]
--- UVM Report catcher Summary ---
chip_sw_hmac_multistream 105207908800551690341034120198588618436848022928291174556060882202367406136031 310
UVM_INFO @ 12027.012040 us: (uvm_report_catcher.svh:705) [UVM/REPORT/CATCHER]
--- UVM Report catcher Summary ---
chip_sw_keymgr_sideload_otbn 60379014433875112799422666835462453630940110655108282033625529578388238945670 338
UVM_INFO @ 20026.715815 us: (uvm_report_catcher.svh:705) [UVM/REPORT/CATCHER]
--- UVM Report catcher Summary ---
UVM_ERROR @ * us: (sw_logger_if.sv:526) [lc_walkthrough_test_sim_dv(sw/device/lib/testing/test_framework/ottf_alerts.c:172)] ERROR: Alert * is asserted but not expected 8 test runs
chip_sw_lc_walkthrough_dev 39048680757812444469793639398319345564296031963014494835549197610977627707461 369
UVM_INFO @ 10632.111255 us: (uvm_report_catcher.svh:705) [UVM/REPORT/CATCHER]
--- UVM Report catcher Summary ---
chip_sw_lc_walkthrough_prod 28537418881312590453134938516555322208859927034570244861608809589843096287901 369
UVM_INFO @ 10077.854276 us: (uvm_report_catcher.svh:705) [UVM/REPORT/CATCHER]
--- UVM Report catcher Summary ---
chip_sw_lc_walkthrough_rma 111852030521507216688003429479429910784700743521509069407007440035670004487529 341
UVM_INFO @ 5596.263017 us: (uvm_report_catcher.svh:705) [UVM/REPORT/CATCHER]
--- UVM Report catcher Summary ---
chip_sw_lc_walkthrough_dev 64477129157409484363066040261497243609993990529622354802620911571119721904934 369
UVM_INFO @ 11263.638890 us: (uvm_report_catcher.svh:705) [UVM/REPORT/CATCHER]
--- UVM Report catcher Summary ---
chip_sw_lc_walkthrough_prod 108515171447675733027570832527030806684385906624640106847816536865418556311907 369
UVM_INFO @ 7860.471816 us: (uvm_report_catcher.svh:705) [UVM/REPORT/CATCHER]
--- UVM Report catcher Summary ---
chip_sw_lc_walkthrough_rma 18808302163184202630878144433733167057654416346435064229629296130627414833445 341
UVM_INFO @ 5922.002056 us: (uvm_report_catcher.svh:705) [UVM/REPORT/CATCHER]
--- UVM Report catcher Summary ---
chip_sw_lc_walkthrough_prod 55869452989414885657947147774791303750226460129370641285773447572327746777507 369
UVM_INFO @ 9500.407588 us: (uvm_report_catcher.svh:705) [UVM/REPORT/CATCHER]
--- UVM Report catcher Summary ---
chip_sw_lc_walkthrough_rma 16585439704153866664638029851156804720120562639320055180945968383821835734080 341
UVM_INFO @ 6355.112388 us: (uvm_report_catcher.svh:705) [UVM/REPORT/CATCHER]
--- UVM Report catcher Summary ---
Error-[NOA] Null object access 8 test runs
chip_sw_rv_dm_ndm_reset_req_when_cpu_halted 100488783549107090062325844554736835240546676532058763444228686276011085537414 332
src/lowrisc_dv_jtag_dmi_agent_0/jtag_rv_debugger.sv, 1108
The object at dereference depth 1 is being used before it was
constructed/allocated.
Please make sure that the object is allocated before using it.
rom_e2e_jtag_debug_test_unlocked0 69672792173244674020968307858238640411102593818448361007759077545437851938597 352
src/lowrisc_dv_jtag_dmi_agent_0/jtag_rv_debugger.sv, 903
The object at dereference depth 1 is being used before it was
constructed/allocated.
Please make sure that the object is allocated before using it.
rom_e2e_jtag_debug_dev 45070219007933203269300350542774648776258738741929494245813377596528464056913 319
src/lowrisc_dv_jtag_dmi_agent_0/jtag_rv_debugger.sv, 1078
The object at dereference depth 1 is being used before it was
constructed/allocated.
Please make sure that the object is allocated before using it.
rom_e2e_jtag_inject_test_unlocked0 34314460907527165402438580347031151658875878793385179203725513218556419271248 303
src/lowrisc_dv_jtag_dmi_agent_0/jtag_rv_debugger.sv, 1108
The object at dereference depth 1 is being used before it was
constructed/allocated.
Please make sure that the object is allocated before using it.
rom_e2e_jtag_inject_dev 74874483958987062988549473322432651649327538126572616821894769969437852620932 305
src/lowrisc_dv_jtag_dmi_agent_0/jtag_rv_debugger.sv, 1078
The object at dereference depth 1 is being used before it was
constructed/allocated.
Please make sure that the object is allocated before using it.
rom_e2e_jtag_inject_rma 32673022063495710489856798281109371365181466698676360591022925031178009611247 307
src/lowrisc_dv_jtag_dmi_agent_0/jtag_rv_debugger.sv, 1078
The object at dereference depth 1 is being used before it was
constructed/allocated.
Please make sure that the object is allocated before using it.
chip_sw_rv_dm_ndm_reset_req_when_cpu_halted 20708485916652080724413529692448355306817770807126559219021392071164865035259 327
src/lowrisc_dv_jtag_dmi_agent_0/jtag_rv_debugger.sv, 1108
The object at dereference depth 1 is being used before it was
constructed/allocated.
Please make sure that the object is allocated before using it.
chip_sw_rv_dm_ndm_reset_req_when_cpu_halted 18246000923187088900135945216478670672525328069292670619102106564179482376267 327
src/lowrisc_dv_jtag_dmi_agent_0/jtag_rv_debugger.sv, 1108
The object at dereference depth 1 is being used before it was
constructed/allocated.
Please make sure that the object is allocated before using it.
Offending '(!$fell(lc_ctrl_pkg::lc_tx_test_true_strict(lc_init_done_o)))' 6 test runs
chip_sw_otp_ctrl_escalation 106193921952836272882889707516432428812688688374016120674748191643314937777494 316
UVM_ERROR @ 3237.803880 us: (lc_ctrl.sv:884) [ASSERT FAILED] LcInitDoneSticky_A
UVM_INFO @ 3237.803880 us: (uvm_report_catcher.svh:705) [UVM/REPORT/CATCHER]
--- UVM Report catcher Summary ---
chip_sw_csrng_fuse_en_sw_app_read_test 113710033692990251855339147347692930077317348236051755526850238830726963104569 312
UVM_ERROR @ 2840.414346 us: (lc_ctrl.sv:884) [ASSERT FAILED] LcInitDoneSticky_A
UVM_INFO @ 2840.414346 us: (uvm_report_catcher.svh:705) [UVM/REPORT/CATCHER]
--- UVM Report catcher Summary ---
chip_sw_all_escalation_resets 108808072748672252269006132322394713449735837792082829702935120200560077660011 317
UVM_ERROR @ 3466.539624 us: (lc_ctrl.sv:884) [ASSERT FAILED] LcInitDoneSticky_A
UVM_INFO @ 3466.539624 us: (uvm_report_catcher.svh:705) [UVM/REPORT/CATCHER]
--- UVM Report catcher Summary ---
chip_sw_all_escalation_resets 89166956187007832393470666905031859832528365909296737051464009333591798640016 317
UVM_ERROR @ 3399.746560 us: (lc_ctrl.sv:884) [ASSERT FAILED] LcInitDoneSticky_A
UVM_INFO @ 3399.746560 us: (uvm_report_catcher.svh:705) [UVM/REPORT/CATCHER]
--- UVM Report catcher Summary ---
chip_sw_all_escalation_resets 63018232034691190406009753461510853791045039171121816413479798779041957284768 317
UVM_ERROR @ 3504.775260 us: (lc_ctrl.sv:884) [ASSERT FAILED] LcInitDoneSticky_A
UVM_INFO @ 3504.775260 us: (uvm_report_catcher.svh:705) [UVM/REPORT/CATCHER]
--- UVM Report catcher Summary ---
chip_sw_all_escalation_resets 50124893161171642900455957281949254894205169849397659373609080517659538155548 317
UVM_ERROR @ 3551.139206 us: (lc_ctrl.sv:884) [ASSERT FAILED] LcInitDoneSticky_A
UVM_INFO @ 3551.139206 us: (uvm_report_catcher.svh:705) [UVM/REPORT/CATCHER]
--- UVM Report catcher Summary ---
Offending '(rstreqs[*] && (reset_cause == HwReq))' 6 test runs
chip_sw_aon_timer_wdog_bite_reset 114678108162381810036366294865779213932532854179257437223222619265152668766777 319
UVM_ERROR @ 7551.727000 us: (pwrmgr_rstreqs_sva_if.sv:49) [ASSERT FAILED] HwResetOn_A
UVM_INFO @ 7551.727000 us: (uvm_report_catcher.svh:705) [UVM/REPORT/CATCHER]
--- UVM Report catcher Summary ---
chip_sw_pwrmgr_deep_sleep_por_reset 19240628598107112205654549361967834534852879631635507322417212639709462734538 325
UVM_ERROR @ 7401.575000 us: (pwrmgr_rstreqs_sva_if.sv:49) [ASSERT FAILED] HwResetOn_A
UVM_INFO @ 7401.575000 us: (uvm_report_catcher.svh:705) [UVM/REPORT/CATCHER]
--- UVM Report catcher Summary ---
chip_sw_pwrmgr_random_sleep_power_glitch_reset 45395824881477982657115799968967360894629743697881690250965356394839021646367 328
UVM_ERROR @ 8851.000000 us: (pwrmgr_rstreqs_sva_if.sv:49) [ASSERT FAILED] HwResetOn_A
UVM_INFO @ 8851.000000 us: (uvm_report_catcher.svh:705) [UVM/REPORT/CATCHER]
--- UVM Report catcher Summary ---
chip_sw_aon_timer_wdog_bite_reset 69768032453584443822186115870042969195475721426236692740419128413696150472303 319
UVM_ERROR @ 7624.043500 us: (pwrmgr_rstreqs_sva_if.sv:49) [ASSERT FAILED] HwResetOn_A
UVM_INFO @ 7624.043500 us: (uvm_report_catcher.svh:705) [UVM/REPORT/CATCHER]
--- UVM Report catcher Summary ---
chip_sw_pwrmgr_random_sleep_all_reset_reqs 73956795109335061914848405366906573800777346268354246603126229854335568542851 315
UVM_ERROR @ 6557.672000 us: (pwrmgr_rstreqs_sva_if.sv:49) [ASSERT FAILED] HwResetOn_A
UVM_INFO @ 6557.672000 us: (uvm_report_catcher.svh:705) [UVM/REPORT/CATCHER]
--- UVM Report catcher Summary ---
chip_sw_pwrmgr_deep_sleep_por_reset 68462606199933727235012012795761494634361469910449466797264249278952175769619 325
UVM_ERROR @ 7171.317000 us: (pwrmgr_rstreqs_sva_if.sv:49) [ASSERT FAILED] HwResetOn_A
UVM_INFO @ 7171.317000 us: (uvm_report_catcher.svh:705) [UVM/REPORT/CATCHER]
--- UVM Report catcher Summary ---
UVM_FATAL @ * us: (mem_bkdr_util.sv:658) [mem_bkdr_util[FlashBank0Data]] file empty_test_slot_a_corrupted_sim_dv.fake_ecdsa_prod_key_*.signed.*.scr.vmem could not be opened for r mode 6 test runs
rom_e2e_sigverify_always_a_bad_b_bad_prod 49723674223173764913125508388096255389034765105205617913597548984025065020931 365
UVM_INFO @ 10.240001 us: (uvm_report_catcher.svh:705) [UVM/REPORT/CATCHER]
--- UVM Report catcher Summary ---
rom_e2e_sigverify_always_a_bad_b_bad_prod_end 504284578462983293897905535936550905139443575631187183629268718111492297256 368
UVM_INFO @ 10.220001 us: (uvm_report_catcher.svh:705) [UVM/REPORT/CATCHER]
--- UVM Report catcher Summary ---
rom_e2e_sigverify_always_a_bad_b_bad_rma 103398612782639441810313869214455539686857016342849881335635408897322425005181 365
UVM_INFO @ 10.200001 us: (uvm_report_catcher.svh:705) [UVM/REPORT/CATCHER]
--- UVM Report catcher Summary ---
rom_e2e_sigverify_always_a_bad_b_nothing_prod 57675050965718452410665241857563704108746661201444941081458992147515729703335 328
UVM_INFO @ 10.380001 us: (uvm_report_catcher.svh:705) [UVM/REPORT/CATCHER]
--- UVM Report catcher Summary ---
rom_e2e_sigverify_always_a_bad_b_nothing_prod_end 58849001740517001380186112622677103986368134989362574421514070686470916563507 328
UVM_INFO @ 10.200001 us: (uvm_report_catcher.svh:705) [UVM/REPORT/CATCHER]
--- UVM Report catcher Summary ---
rom_e2e_sigverify_always_a_bad_b_nothing_rma 5527155085469840740076254942181067859221074271469507599116883800006993429061 328
UVM_INFO @ 10.140001 us: (uvm_report_catcher.svh:705) [UVM/REPORT/CATCHER]
--- UVM Report catcher Summary ---
Offending '(!$fell((pwrmgr_data_o.done == MuBi4True)))' 5 test runs
chip_sw_pwrmgr_sleep_power_glitch_reset 115563104104176365857177286120651052133169332234939046515527887037984938023284 318
UVM_ERROR @ 2428.301838 us: (rom_ctrl.sv:586) [ASSERT FAILED] PwrmgrDataChk_A
UVM_INFO @ 2428.301838 us: (uvm_report_catcher.svh:705) [UVM/REPORT/CATCHER]
--- UVM Report catcher Summary ---
chip_sw_pwrmgr_random_sleep_power_glitch_reset 98606420166330838711863899789911369017915939767934204311656114055290250257063 315
UVM_ERROR @ 4524.751080 us: (rom_ctrl.sv:586) [ASSERT FAILED] PwrmgrDataChk_A
UVM_INFO @ 4524.751080 us: (uvm_report_catcher.svh:705) [UVM/REPORT/CATCHER]
--- UVM Report catcher Summary ---
chip_sw_pwrmgr_sleep_power_glitch_reset 105420040406119085475073695878986488666608580969482992904599875217984809018464 313
UVM_ERROR @ 3795.949767 us: (rom_ctrl.sv:586) [ASSERT FAILED] PwrmgrDataChk_A
UVM_INFO @ 3795.949767 us: (uvm_report_catcher.svh:705) [UVM/REPORT/CATCHER]
--- UVM Report catcher Summary ---
chip_sw_pwrmgr_sleep_power_glitch_reset 60390278558936728120779754307638686927087785470232503696030684260811731862107 313
UVM_ERROR @ 2911.684772 us: (rom_ctrl.sv:586) [ASSERT FAILED] PwrmgrDataChk_A
UVM_INFO @ 2911.684772 us: (uvm_report_catcher.svh:705) [UVM/REPORT/CATCHER]
--- UVM Report catcher Summary ---
chip_sw_pwrmgr_random_sleep_power_glitch_reset 66714457667051165385151591417772740505120886525444900316858975979116717682315 395
UVM_ERROR @ 20406.491256 us: (rom_ctrl.sv:586) [ASSERT FAILED] PwrmgrDataChk_A
UVM_INFO @ 20406.491256 us: (uvm_report_catcher.svh:705) [UVM/REPORT/CATCHER]
--- UVM Report catcher Summary ---
UVM_FATAL @ * us: (sec_cm_pkg.sv:48) [sec_cm_pkg::find_sec_cm_if_proxy] no proxy with path *rstmgr_aon.u_d0_spi_host*.leaf_rst_path 3 test runs
chip_sw_rstmgr_rst_cnsty_escalation 105249498275992739676653822813374433688974343147662441132799918329079660640368 306
UVM_INFO @ 10.220001 us: (uvm_report_catcher.svh:705) [UVM/REPORT/CATCHER]
--- UVM Report catcher Summary ---
chip_sw_rstmgr_rst_cnsty_escalation 39318515019202426592624602170294699612923663113748855343077423934584254902467 301
UVM_INFO @ 10.340001 us: (uvm_report_catcher.svh:705) [UVM/REPORT/CATCHER]
--- UVM Report catcher Summary ---
chip_sw_rstmgr_rst_cnsty_escalation 36410864767725842094034645267492604525455542143567125001192785243717550512362 301
UVM_INFO @ 10.160001 us: (uvm_report_catcher.svh:705) [UVM/REPORT/CATCHER]
--- UVM Report catcher Summary ---
UVM_ERROR @ * us: (sw_logger_if.sv:526) [flash_ctrl_lc_rw_en_test_sim_dv(sw/device/lib/testing/test_framework/ottf_alerts.c:172)] ERROR: Alert * is asserted but not expected 3 test runs
chip_sw_flash_ctrl_lc_rw_en 27313901436785484188087004013476673327676870154890993481407884962574501835049 309
UVM_INFO @ 2504.530136 us: (uvm_report_catcher.svh:705) [UVM/REPORT/CATCHER]
--- UVM Report catcher Summary ---
chip_sw_flash_ctrl_lc_rw_en 8043243817778954573767351222453575645952415605053053935583810110873592287601 309
UVM_INFO @ 2742.961260 us: (uvm_report_catcher.svh:705) [UVM/REPORT/CATCHER]
--- UVM Report catcher Summary ---
chip_sw_flash_ctrl_lc_rw_en 27197480390127611681662043575261343529427315084976537822773282551868085119141 309
UVM_INFO @ 2198.205256 us: (uvm_report_catcher.svh:705) [UVM/REPORT/CATCHER]
--- UVM Report catcher Summary ---
UVM_ERROR @ * us: (sw_logger_if.sv:526) [otp_ctrl_lc_signals_test_sim_dv(sw/device/lib/testing/otp_ctrl_testutils.c:39)] Expected a DAI error for access to * 3 test runs
chip_sw_otp_ctrl_lc_signals_rma 92335865143081147351120089241747215270386886487928641525046535720349958294353 342
UVM_INFO @ 6774.567300 us: (uvm_report_catcher.svh:705) [UVM/REPORT/CATCHER]
--- UVM Report catcher Summary ---
chip_sw_otp_ctrl_lc_signals_rma 78343809280056808197241039909520982847290252442314414201574634027353353361591 342
UVM_INFO @ 5883.172512 us: (uvm_report_catcher.svh:705) [UVM/REPORT/CATCHER]
--- UVM Report catcher Summary ---
chip_sw_otp_ctrl_lc_signals_rma 29738928050180555936962234577337286034980308165826357357592397300399140867514 342
UVM_INFO @ 7874.710943 us: (uvm_report_catcher.svh:705) [UVM/REPORT/CATCHER]
--- UVM Report catcher Summary ---
Offending '((~rst_ni) === (~seed_en_q))' 3 test runs
chip_sw_pwrmgr_full_aon_reset 69276687220055084024717954674584937028132939101709637674552265437124248946630 316
UVM_ERROR @ 5650.190430 us: (otbn_rnd.sv:233) [ASSERT FAILED] UrndNoReseedOnReset_A
UVM_INFO @ 5650.190430 us: (uvm_report_catcher.svh:705) [UVM/REPORT/CATCHER]
--- UVM Report catcher Summary ---
chip_sw_pwrmgr_full_aon_reset 57010548158533154648203994502434791960668962674007589305641204892528485397845 322
UVM_ERROR @ 6398.773433 us: (otbn_rnd.sv:233) [ASSERT FAILED] UrndNoReseedOnReset_A
UVM_INFO @ 6398.773433 us: (uvm_report_catcher.svh:705) [UVM/REPORT/CATCHER]
--- UVM Report catcher Summary ---
chip_sw_pwrmgr_full_aon_reset 59006303355087601998883649622954754063753503405368748560806651708640904618869 320
UVM_ERROR @ 5439.381324 us: (otbn_rnd.sv:233) [ASSERT FAILED] UrndNoReseedOnReset_A
UVM_INFO @ 5439.381324 us: (uvm_report_catcher.svh:705) [UVM/REPORT/CATCHER]
--- UVM Report catcher Summary ---
UVM_ERROR @ * us: (sw_logger_if.sv:526) [clkmgr_jitter_frequency_test_sim_dv(sw/device/lib/testing/test_framework/ottf_alerts.c:172)] ERROR: Alert * is asserted but not expected 3 test runs
chip_sw_clkmgr_jitter_frequency 68106837771931698524674740582110693516923638539929458613316699264472524352993 343
UVM_INFO @ 4077.654354 us: (uvm_report_catcher.svh:705) [UVM/REPORT/CATCHER]
--- UVM Report catcher Summary ---
chip_sw_clkmgr_jitter_frequency 35517469348283258597331281763874296918562105791081255917267480185076262971379 343
UVM_INFO @ 3957.434608 us: (uvm_report_catcher.svh:705) [UVM/REPORT/CATCHER]
--- UVM Report catcher Summary ---
chip_sw_clkmgr_jitter_frequency 28175791163389162550333004434159913339630582258759288302833898387749253915517 343
UVM_INFO @ 3471.873817 us: (uvm_report_catcher.svh:705) [UVM/REPORT/CATCHER]
--- UVM Report catcher Summary ---
UVM_ERROR @ * us: (chip_sw_power_idle_load_vseq.sv:91) virtual_sequencer [chip_sw_power_idle_load_vseq] PWMCH* : pkt* Clock period is wrong. rcv : * exp : * 3 test runs
chip_sw_power_idle_load 42954373038215042494766563909517311299036428310438757549088701378232629519330 312
UVM_INFO @ 3409.850000 us: (uvm_report_catcher.svh:705) [UVM/REPORT/CATCHER]
--- UVM Report catcher Summary ---
chip_sw_power_idle_load 62292348126384988872986837526398899020095161461042523052273947290678782225269 312
UVM_INFO @ 3634.606000 us: (uvm_report_catcher.svh:705) [UVM/REPORT/CATCHER]
--- UVM Report catcher Summary ---
chip_sw_power_idle_load 74148971774870714664613907149922251125118403109083033029515073068344351530084 312
UVM_INFO @ 3101.409000 us: (uvm_report_catcher.svh:705) [UVM/REPORT/CATCHER]
--- UVM Report catcher Summary ---
UVM_ERROR @ * us: (chip_sw_power_sleep_load_vseq.sv:114) virtual_sequencer [chip_sw_power_sleep_load_vseq] PWMCH* : pkt* Clock period is wrong. rcv : * exp : * 3 test runs
chip_sw_power_sleep_load 9219425660774779085431154059823745797211526186137194672237900277041937873153 318
UVM_INFO @ 3134.388000 us: (uvm_report_catcher.svh:705) [UVM/REPORT/CATCHER]
--- UVM Report catcher Summary ---
chip_sw_power_sleep_load 10611998085561786946361594962543054661984156055351995474317017187142085419280 318
UVM_INFO @ 4127.009000 us: (uvm_report_catcher.svh:705) [UVM/REPORT/CATCHER]
--- UVM Report catcher Summary ---
chip_sw_power_sleep_load 42044144870113166318885566953507098618978646043265586343165859593160714971046 318
UVM_INFO @ 3280.241500 us: (uvm_report_catcher.svh:705) [UVM/REPORT/CATCHER]
--- UVM Report catcher Summary ---
UVM_ERROR @ * us: (sw_logger_if.sv:526) [ast_clk_rst_inputs_sim_dv(sw/device/lib/testing/autogen/isr_testutils.c:41)] CHECK-fail: Only adc_ctrl IRQ * expected to fire. Actual IRQ state = * 3 test runs
chip_sw_ast_clk_rst_inputs 60655052153344794420698635995849500078933047812793619621133430628853332823340 327
UVM_INFO @ 15208.493125 us: (uvm_report_catcher.svh:705) [UVM/REPORT/CATCHER]
--- UVM Report catcher Summary ---
chip_sw_ast_clk_rst_inputs 47858414537617177989091932899691308152109256626428122533447559569858908723950 327
UVM_INFO @ 15103.747405 us: (uvm_report_catcher.svh:705) [UVM/REPORT/CATCHER]
--- UVM Report catcher Summary ---
chip_sw_ast_clk_rst_inputs 37311928543070057143885888654183919628195913305618966202636074540943292092495 327
UVM_INFO @ 13145.555812 us: (uvm_report_catcher.svh:705) [UVM/REPORT/CATCHER]
--- UVM Report catcher Summary ---
UVM_FATAL @ * us: (csr_utils_pkg.sv:614) [csr_utils_pkg::csr_spinwait.isolation_fork] timeout chip_reg_block.spi_device.cmd_info_*.opcode (addr=*, Comparison=CompareOpEq, exp_data=*, call_count=1) 3 test runs
ate_bootstrap_flash_erase 2021903767077293370396994633832126009586066395713612970429019983312675730217 272
UVM_INFO @ 10010.380001 us: (uvm_report_catcher.svh:705) [UVM/REPORT/CATCHER]
--- UVM Report catcher Summary ---
ate_bootstrap_flash_erase 16513144364402198033357488678767595271614767215239719264789389707986443714720 272
UVM_INFO @ 10010.160001 us: (uvm_report_catcher.svh:705) [UVM/REPORT/CATCHER]
--- UVM Report catcher Summary ---
ate_bootstrap_flash_erase 22406253499164895933640306634056472213029282900882810835288382662702233321448 272
UVM_INFO @ 10010.380001 us: (uvm_report_catcher.svh:705) [UVM/REPORT/CATCHER]
--- UVM Report catcher Summary ---
UVM_FATAL @ * us: (mem_bkdr_util.sv:658) [mem_bkdr_util[FlashBank0Data]] file empty_test_slot_b_corrupted_sim_dv.fake_ecdsa_prod_key_*.signed.*.scr.vmem could not be opened for r mode 3 test runs
rom_e2e_sigverify_always_a_nothing_b_bad_prod 61600313005172107899286857552238936443343674091046983519839911687919210003483 325
UVM_INFO @ 10.120001 us: (uvm_report_catcher.svh:705) [UVM/REPORT/CATCHER]
--- UVM Report catcher Summary ---
rom_e2e_sigverify_always_a_nothing_b_bad_prod_end 17758006185222641078421955880562776653680220167687887254852561190696372196577 328
UVM_INFO @ 10.280001 us: (uvm_report_catcher.svh:705) [UVM/REPORT/CATCHER]
--- UVM Report catcher Summary ---
rom_e2e_sigverify_always_a_nothing_b_bad_rma 29689132109806010257944962494688929470706030214808908135270806981957204877224 328
UVM_INFO @ 10.280001 us: (uvm_report_catcher.svh:705) [UVM/REPORT/CATCHER]
--- UVM Report catcher Summary ---
Offending '$stable(key_data_i)' 3 test runs
rom_keymgr_functest 33271562753881265969758406507392751118064195416942715545164940686922770189174 332
UVM_ERROR @ 4962.692246 us: (kmac_core.sv:464) [ASSERT FAILED] KeyDataStableWhenValid_M
UVM_INFO @ 4962.692246 us: (uvm_report_catcher.svh:705) [UVM/REPORT/CATCHER]
--- UVM Report catcher Summary ---
rom_keymgr_functest 48668194979122044060319364672335808012755969744373357443156820970100725184304 327
UVM_ERROR @ 4790.925225 us: (kmac_core.sv:464) [ASSERT FAILED] KeyDataStableWhenValid_M
UVM_INFO @ 4790.925225 us: (uvm_report_catcher.svh:705) [UVM/REPORT/CATCHER]
--- UVM Report catcher Summary ---
rom_keymgr_functest 45746433911610365757522576998259521289885735226988379370988751778056938606978 327
UVM_ERROR @ 4590.037773 us: (kmac_core.sv:464) [ASSERT FAILED] KeyDataStableWhenValid_M
UVM_INFO @ 4590.037773 us: (uvm_report_catcher.svh:705) [UVM/REPORT/CATCHER]
--- UVM Report catcher Summary ---
UVM_ERROR @ * us: (sw_logger_if.sv:526) [all_escalation_resets_test_sim_dv(w/device/tests/sim_dv/all_escalation_resets_test.c:633)] CHECK-fail: Unexpected mtval: expected *, got * 3 test runs
chip_sw_all_escalation_resets 40919975287588184734358304389334938009310593900504668319034849661108128275705 317
UVM_INFO @ 3243.634608 us: (uvm_report_catcher.svh:705) [UVM/REPORT/CATCHER]
--- UVM Report catcher Summary ---
chip_sw_all_escalation_resets 97961568907654016173537967512678753531657989630141726129821409040991722184192 317
UVM_INFO @ 2721.921497 us: (uvm_report_catcher.svh:705) [UVM/REPORT/CATCHER]
--- UVM Report catcher Summary ---
chip_sw_all_escalation_resets 95102046643364313761820244251934058424604409212052687453514480179158063061862 317
UVM_INFO @ 3084.347766 us: (uvm_report_catcher.svh:705) [UVM/REPORT/CATCHER]
--- UVM Report catcher Summary ---
Offending '(reset_cause == HwReq)' 2 test runs
chip_sw_sensor_ctrl_alert 23925957561169201555456690317921844274118105281079420307178848378007963556335 336
UVM_ERROR @ 5522.451632 us: (pwrmgr_rstreqs_sva_if.sv:98) [ASSERT FAILED] SwResetSetCause_A
UVM_INFO @ 5522.451632 us: (uvm_report_catcher.svh:705) [UVM/REPORT/CATCHER]
--- UVM Report catcher Summary ---
chip_sw_sensor_ctrl_alert 60041265230083972625807154564269041898224521836432451358801106308131756876425 331
UVM_ERROR @ 5207.350392 us: (pwrmgr_rstreqs_sva_if.sv:98) [ASSERT FAILED] SwResetSetCause_A
UVM_INFO @ 5207.350392 us: (uvm_report_catcher.svh:705) [UVM/REPORT/CATCHER]
--- UVM Report catcher Summary ---
UVM_FATAL @ * us: (mem_bkdr_util.sv:658) [mem_bkdr_util[FlashBank0Data]] file empty_test_slot_a_corrupted_sim_dv.fake_ecdsa_test_key_*.signed.*.scr.vmem could not be opened for r mode 2 test runs
rom_e2e_sigverify_always_a_bad_b_bad_test_unlocked0 49754220703597797766053690327200948287672135267824289060275954775443561784270 365
UVM_INFO @ 10.220001 us: (uvm_report_catcher.svh:705) [UVM/REPORT/CATCHER]
--- UVM Report catcher Summary ---
rom_e2e_sigverify_always_a_bad_b_nothing_test_unlocked0 43741723429605118893260747662558610692321490429363192786084702047316420864732 325
UVM_INFO @ 10.100001 us: (uvm_report_catcher.svh:705) [UVM/REPORT/CATCHER]
--- UVM Report catcher Summary ---
UVM_FATAL @ * us: (mem_bkdr_util.sv:658) [mem_bkdr_util[FlashBank0Data]] file empty_test_slot_a_corrupted_sim_dv.fake_ecdsa_dev_key_*.signed.*.scr.vmem could not be opened for r mode 2 test runs
rom_e2e_sigverify_always_a_bad_b_bad_dev 109778517940688499008725155062796078427937196948298080716429133421793914828870 365
UVM_INFO @ 10.360001 us: (uvm_report_catcher.svh:705) [UVM/REPORT/CATCHER]
--- UVM Report catcher Summary ---
rom_e2e_sigverify_always_a_bad_b_nothing_dev 79611749557988630948348971114597460068255752977210197320133667008311910507829 328
UVM_INFO @ 10.100001 us: (uvm_report_catcher.svh:705) [UVM/REPORT/CATCHER]
--- UVM Report catcher Summary ---
UVM_ERROR @ * us: (sw_logger_if.sv:526) [spi_passthrough_test_sim_dv(sw/device/tests/sim_dv/spi_passthrough_test.c:382)] CHECK-fail: irq == kDtSpiDeviceIrqUploadCmdfifoNotEmpty 2 test runs
chip_sw_spi_device_pass_through_collision 67298097061496805258914033249660167668346347467258977231966232502857754826682 327
UVM_INFO @ 3408.243965 us: (uvm_report_catcher.svh:705) [UVM/REPORT/CATCHER]
--- UVM Report catcher Summary ---
chip_sw_spi_device_pass_through_collision 95418732735123120136428683843729802185937378762605137420323888787863922816169 327
UVM_INFO @ 3441.864458 us: (uvm_report_catcher.svh:705) [UVM/REPORT/CATCHER]
--- UVM Report catcher Summary ---
UVM_FATAL @ * us: (chip_sw_base_vseq.sv:864) virtual_sequencer [chip_sw_lc_walkthrough_vseq] max attempt reached to get lc status LcExtClockSwitched! 2 test runs
chip_sw_lc_walkthrough_dev 28925670696973325085365048732843860090266571309117887633425213805214036710414 308
UVM_INFO @ 26181.248029 us: (uvm_report_catcher.svh:705) [UVM/REPORT/CATCHER]
--- UVM Report catcher Summary ---
chip_sw_lc_walkthrough_prodend 74307591705012117688540596358281523086570360356323926118698693229369192452311 308
UVM_INFO @ 26432.622035 us: (uvm_report_catcher.svh:705) [UVM/REPORT/CATCHER]
--- UVM Report catcher Summary ---
UVM_ERROR @ * us: (cip_base_vseq.sv:923) virtual_sequencer [chip_sw_all_escalation_resets_vseq] Alert usbdev_fatal_fault fired unexpectedly. 2 test runs
chip_sw_all_escalation_resets 114218035699730838282220814625778170673330026327276136521916076520681601847065 316
UVM_INFO @ 3177.219036 us: (uvm_report_catcher.svh:705) [UVM/REPORT/CATCHER]
--- UVM Report catcher Summary ---
chip_sw_all_escalation_resets 28155380439978918962786120232147307806617563099124820288944562415552776681998 316
UVM_INFO @ 3189.613750 us: (uvm_report_catcher.svh:705) [UVM/REPORT/CATCHER]
--- UVM Report catcher Summary ---
UVM_ERROR @ * us: (chip_sw_spi_passthrough_collision_vseq.sv:183) virtual_sequencer [chip_sw_spi_passthrough_collision_vseq] Compare mismatch 1 test run
chip_sw_spi_device_pass_through_collision 77440715360567016108606988470148525772140161031440827237479692576991061313707 334
host_rsp:
-------------------------------------------------------------------------
Name Type Size Value
-------------------------------------------------------------------------
UVM_FATAL @ * us: (mem_bkdr_util.sv:658) [mem_bkdr_util[Otp]] file otp_img_test_unlocked0_manuf_empty.*.vmem could not be opened for r mode 1 test run
chip_sw_otp_ctrl_rot_auth_config 19174059982170491315418092624839689772095407983843509588328951602773847945913 282
UVM_INFO @ 0.000000 us: (uvm_report_catcher.svh:705) [UVM/REPORT/CATCHER]
--- UVM Report catcher Summary ---
UVM_ERROR @ * us: (sw_logger_if.sv:526) [alert_test_sim_dv(hw/top_earlgrey/sw/autogen/tests/alert_test.c:302)] CHECK-fail: Expect alert *! 1 test run
chip_sw_alert_test 86784336846153400993686307131286463988656198955221318295356992930320862141735 307
UVM_INFO @ 3086.509868 us: (uvm_report_catcher.svh:705) [UVM/REPORT/CATCHER]
--- UVM Report catcher Summary ---
UVM_ERROR @ * us: (sw_logger_if.sv:526) [pwrmgr_lowpower_cancel_test_sim_dv(sw/device/tests/pwrmgr_lowpower_cancel_test.c:78)] CHECK-fail: Timed out after * usec (* CPU cycles) waiting for !get_wakeup_status() 1 test run
chip_sw_pwrmgr_lowpower_cancel 47925898826357161874395692621617664106818951454921763889520470561402763424022 317
UVM_INFO @ 4466.590898 us: (uvm_report_catcher.svh:705) [UVM/REPORT/CATCHER]
--- UVM Report catcher Summary ---
UVM_ERROR @ * us: (cip_base_vseq.sv:660) [chip_rv_dm_lc_disabled_vseq] Check failed masked_data == exp_data (* [*] vs * [*]) addr * read out mismatch 1 test run
chip_rv_dm_lc_disabled 42222962641712484310840838658093765451279707407358713189139156714469795750965 265
UVM_INFO @ 8152.025500 us: (uvm_report_catcher.svh:705) [UVM/REPORT/CATCHER]
--- UVM Report catcher Summary ---
UVM_FATAL @ * us: (mem_bkdr_util.sv:658) [mem_bkdr_util[FlashBank0Data]] file empty_test_slot_b_corrupted_sim_dv.fake_ecdsa_test_key_*.signed.*.scr.vmem could not be opened for r mode 1 test run
rom_e2e_sigverify_always_a_nothing_b_bad_test_unlocked0 99805690281777379104084575941426863316055836010094985537656075270835571051367 326
UVM_INFO @ 10.340001 us: (uvm_report_catcher.svh:705) [UVM/REPORT/CATCHER]
--- UVM Report catcher Summary ---
UVM_FATAL @ * us: (mem_bkdr_util.sv:658) [mem_bkdr_util[FlashBank0Data]] file empty_test_slot_b_corrupted_sim_dv.fake_ecdsa_dev_key_*.signed.*.scr.vmem could not be opened for r mode 1 test run
rom_e2e_sigverify_always_a_nothing_b_bad_dev 14305718433560539779203141918022364036206312165232845679301384905722601236076 326
UVM_INFO @ 10.280001 us: (uvm_report_catcher.svh:705) [UVM/REPORT/CATCHER]
--- UVM Report catcher Summary ---
UVM_ERROR @ * us: (jtag_rv_debugger.sv:784) [debugger] Index * appears to be out of bounds 1 test run
rom_e2e_jtag_debug_rma 61241459202489192288588344146966721153250941422973380875134013135894487526347 318
UVM_INFO @ 4332.714795 us: (uvm_report_catcher.svh:705) [UVM/REPORT/CATCHER]
--- UVM Report catcher Summary ---
UVM_FATAL @ * us: (chip_sw_base_vseq.sv:864) virtual_sequencer [chip_sw_lc_ctrl_transition_vseq] max attempt reached to get lc status LcExtClockSwitched! 1 test run
chip_sw_lc_ctrl_transition 76153502231033814065448527856340904502949070565552262726355139242041981387593 347
UVM_INFO @ 30882.367974 us: (uvm_report_catcher.svh:705) [UVM/REPORT/CATCHER]
--- UVM Report catcher Summary ---
UVM_FATAL @ * us: (chip_sw_base_vseq.sv:864) virtual_sequencer [chip_sw_lc_walkthrough_testunlocks_vseq] max attempt reached to get lc status LcExtClockSwitched! 1 test run
chip_sw_lc_walkthrough_testunlocks 40953030400340861507668679466322695800745207890554051169341183559905737868102 304
UVM_INFO @ 26203.445619 us: (uvm_report_catcher.svh:705) [UVM/REPORT/CATCHER]
--- UVM Report catcher Summary ---
UVM_ERROR @ * us: (sw_logger_if.sv:526) [alert_test_sim_dv(hw/top_earlgrey/sw/autogen/tests/alert_test.c:392)] CHECK-fail: Expect alert *! 1 test run
chip_sw_alert_test 88874606324295581297598675356226647197566274824381900249947157153734469534530 307
UVM_INFO @ 3275.932000 us: (uvm_report_catcher.svh:705) [UVM/REPORT/CATCHER]
--- UVM Report catcher Summary ---
UVM_ERROR @ * us: (chip_sw_sleep_pin_mio_dio_val_vseq.sv:92) [chip_sw_sleep_pin_mio_dio_val_vseq] Check failed cfg.chip_vif.mios_if.pins[i] === exp (* [*] vs *xz [z]) for MIO[*] 1 test run
chip_sw_sleep_pin_mio_dio_val 53803294818926567295256582343799365111074684833885298036122840511213289812900 451
UVM_INFO @ 3019.478000 us: (uvm_report_catcher.svh:705) [UVM/REPORT/CATCHER]
--- UVM Report catcher Summary ---
UVM_ERROR @ * us: (sw_logger_if.sv:526) [alert_test_sim_dv(hw/top_earlgrey/sw/autogen/tests/alert_test.c:377)] CHECK-fail: Expect alert *! 1 test run
chip_sw_alert_test 5793032311105904002404880278655820657797623847642128166867881544479091761839 307
UVM_INFO @ 3585.641570 us: (uvm_report_catcher.svh:705) [UVM/REPORT/CATCHER]
--- UVM Report catcher Summary ---
UVM_ERROR @ * us: (sw_logger_if.sv:526) [rom_e2e_keymgr_init_otp_meas_sim_dv(sw/device/silicon_creator/rom/e2e/keymgr/rom_e2e_keymgr_init_test.c:38)] DIF-fail: dif_otp_ctrl_get_digest( &otp_ctrl, kDifOtpCtrlPartitionCreatorSwCfg, &creator_digest) returns * 1 test run
rom_e2e_keymgr_init_rom_ext_meas 99575823173917016995205537542407476139982338618544106380967437755962851754732 319
UVM_INFO @ 16455.626178 us: (uvm_report_catcher.svh:705) [UVM/REPORT/CATCHER]
--- UVM Report catcher Summary ---
UVM_ERROR @ * us: (sw_logger_if.sv:526) [rom_e2e_keymgr_init_otp_no_meas_sim_dv(sw/device/silicon_creator/rom/e2e/keymgr/rom_e2e_keymgr_init_test.c:38)] DIF-fail: dif_otp_ctrl_get_digest( &otp_ctrl, kDifOtpCtrlPartitionCreatorSwCfg, &creator_digest) returns * 1 test run
rom_e2e_keymgr_init_rom_ext_no_meas 94165723919928322417622820006455604830200985732025664096777830802703505555818 319
UVM_INFO @ 16579.898117 us: (uvm_report_catcher.svh:705) [UVM/REPORT/CATCHER]
--- UVM Report catcher Summary ---