Simulation Results: chip

 
25/07/2026 02:41:09 DVSim: v1.49.0 sha: 72f4b42 json Branch: master Tool: vcs [unknown]
Coverage statistics
  • Total
  • 93.50 %
  • code
  • 83.06 %
  • assert
  • 97.99 %
  • func
  • 99.44 %
  • line
  • 94.84 %
  • branch
  • 94.75 %
  • cond
  • 93.15 %
  • toggle
  • 75.43 %
  • FSM
  • 57.14 %
Validation stages
V1
96.09%
V2
85.30%
V2S
100.00%
V3
85.53%
unmapped
54.84%
Testpoint Test Max Runtime Sim Time Pass Total %
chip_sw_example_tests 12 12 100.00
chip_sw_example_flash 285.690s 3718.894us 3 3 100.00
chip_sw_example_rom 138.280s 3194.843us 3 3 100.00
chip_sw_example_manufacturer 232.780s 3490.728us 3 3 100.00
chip_sw_example_concurrency 239.260s 3512.963us 3 3 100.00
csr_hw_reset 1 1 100.00
chip_csr_hw_reset 311.510s 6617.307us 1 1 100.00
csr_rw 5 5 100.00
chip_csr_rw 644.730s 5827.812us 5 5 100.00
csr_bit_bash 1 1 100.00
chip_csr_bit_bash 1349.690s 11898.176us 1 1 100.00
csr_aliasing 1 1 100.00
chip_csr_aliasing 4841.930s 26039.649us 1 1 100.00
csr_mem_rw_with_rand_reset 0 5 0.00
chip_csr_mem_rw_with_rand_reset 102.610s 2517.270us 0 5 0.00
regwen_csr_and_corresponding_lockable_csr 6 6 100.00
chip_csr_aliasing 4841.930s 26039.649us 1 1 100.00
chip_csr_rw 644.730s 5827.812us 5 5 100.00
xbar_smoke 50 50 100.00
xbar_smoke 10.620s 238.533us 50 50 100.00
chip_sw_gpio_out 3 3 100.00
chip_sw_gpio 463.890s 5336.066us 3 3 100.00
chip_sw_gpio_in 3 3 100.00
chip_sw_gpio 463.890s 5336.066us 3 3 100.00
chip_sw_gpio_irq 3 3 100.00
chip_sw_gpio 463.890s 5336.066us 3 3 100.00
chip_sw_uart_tx_rx 5 5 100.00
chip_sw_uart_tx_rx 522.130s 5562.416us 5 5 100.00
chip_sw_uart_rx_overflow 20 20 100.00
chip_sw_uart_tx_rx 522.130s 5562.416us 5 5 100.00
chip_sw_uart_tx_rx_idx1 543.090s 5104.921us 5 5 100.00
chip_sw_uart_tx_rx_idx2 515.030s 4826.121us 5 5 100.00
chip_sw_uart_tx_rx_idx3 544.590s 4797.041us 5 5 100.00
chip_sw_uart_baud_rate 20 20 100.00
chip_sw_uart_rand_baudrate 2208.890s 13741.237us 20 20 100.00
chip_sw_uart_tx_rx_alt_clk_freq 10 10 100.00
chip_sw_uart_tx_rx_alt_clk_freq 1544.170s 9619.487us 5 5 100.00
chip_sw_uart_tx_rx_alt_clk_freq_low_speed 965.400s 10010.518us 5 5 100.00
Testpoint Test Max Runtime Sim Time Pass Total %
chip_pin_mux 10 10 100.00
chip_padctrl_attributes 397.370s 7172.334us 10 10 100.00
chip_padctrl_attributes 10 10 100.00
chip_padctrl_attributes 397.370s 7172.334us 10 10 100.00
chip_sw_sleep_pin_mio_dio_val 2 3 66.67
chip_sw_sleep_pin_mio_dio_val 323.470s 3891.340us 2 3 66.67
chip_sw_sleep_pin_wake 3 3 100.00
chip_sw_sleep_pin_wake 440.410s 7720.763us 3 3 100.00
chip_sw_sleep_pin_retention 3 3 100.00
chip_sw_sleep_pin_retention 305.960s 4253.496us 3 3 100.00
chip_sw_tap_strap_sampling 20 20 100.00
chip_tap_straps_dev 1372.470s 16220.821us 5 5 100.00
chip_tap_straps_testunlock0 850.860s 11662.248us 5 5 100.00
chip_tap_straps_rma 455.380s 6094.364us 5 5 100.00
chip_tap_straps_prod 1147.540s 14605.708us 5 5 100.00
chip_sw_data_integrity 6 6 100.00
chip_sw_data_integrity_escalation 688.340s 5737.758us 6 6 100.00
chip_sw_instruction_integrity 6 6 100.00
chip_sw_data_integrity_escalation 688.340s 5737.758us 6 6 100.00
chip_sw_ast_clk_outputs 3 3 100.00
chip_sw_ast_clk_outputs 957.550s 9906.190us 3 3 100.00
chip_sw_ast_clk_rst_inputs 0 3 0.00
chip_sw_ast_clk_rst_inputs 2356.570s 17330.421us 0 3 0.00
chip_sw_ast_sys_clk_jitter 30 30 100.00
chip_sw_flash_ctrl_ops_jitter_en 549.750s 5057.514us 3 3 100.00
chip_sw_flash_ctrl_access_jitter_en 759.430s 7171.363us 3 3 100.00
chip_sw_otbn_ecdsa_op_irq_jitter_en 4997.760s 18705.633us 3 3 100.00
chip_sw_aes_enc_jitter_en 245.340s 3184.651us 3 3 100.00
chip_sw_edn_entropy_reqs_jitter 1139.920s 9470.676us 3 3 100.00
chip_sw_hmac_enc_jitter_en 300.130s 3932.465us 3 3 100.00
chip_sw_keymgr_key_derivation_jitter_en 2232.240s 14706.223us 3 3 100.00
chip_sw_kmac_mode_kmac_jitter_en 261.660s 2723.075us 3 3 100.00
chip_sw_sram_ctrl_scrambled_access_jitter_en 581.340s 6263.304us 3 3 100.00
chip_sw_clkmgr_jitter 272.130s 3673.396us 3 3 100.00
chip_sw_ast_usb_clk_calib 1 1 100.00
chip_sw_usb_ast_clk_calib 299.810s 3860.543us 1 1 100.00
chip_sw_sensor_ctrl_ast_alerts 8 8 100.00
chip_sw_sensor_ctrl_alert 950.950s 11876.313us 5 5 100.00
chip_sw_pwrmgr_sleep_sensor_ctrl_alert_wakeup 384.090s 5894.556us 3 3 100.00
chip_sw_sensor_ctrl_ast_status 3 3 100.00
chip_sw_sensor_ctrl_status 290.130s 3849.046us 3 3 100.00
chip_sw_pwrmgr_sleep_sensor_ctrl_alert_wakeup 3 3 100.00
chip_sw_pwrmgr_sleep_sensor_ctrl_alert_wakeup 384.090s 5894.556us 3 3 100.00
chip_sw_smoketest 51 51 100.00
chip_sw_flash_scrambling_smoketest 283.000s 4009.508us 3 3 100.00
chip_sw_aes_smoketest 252.700s 3991.193us 3 3 100.00
chip_sw_aon_timer_smoketest 290.090s 4029.187us 3 3 100.00
chip_sw_clkmgr_smoketest 273.110s 3623.092us 3 3 100.00
chip_sw_csrng_smoketest 268.900s 3955.777us 3 3 100.00
chip_sw_entropy_src_smoketest 1311.840s 7742.998us 3 3 100.00
chip_sw_gpio_smoketest 287.940s 3502.843us 3 3 100.00
chip_sw_hmac_smoketest 283.200s 3574.366us 3 3 100.00
chip_sw_kmac_smoketest 309.280s 3594.088us 3 3 100.00
chip_sw_otbn_smoketest 1924.810s 10378.904us 3 3 100.00
chip_sw_pwrmgr_smoketest 540.530s 8049.698us 3 3 100.00
chip_sw_pwrmgr_usbdev_smoketest 483.850s 7432.958us 3 3 100.00
chip_sw_rv_plic_smoketest 269.700s 3681.354us 3 3 100.00
chip_sw_rv_timer_smoketest 285.710s 4186.947us 3 3 100.00
chip_sw_rstmgr_smoketest 269.490s 3664.888us 3 3 100.00
chip_sw_sram_ctrl_smoketest 267.360s 3604.805us 3 3 100.00
chip_sw_uart_smoketest 285.610s 3767.202us 3 3 100.00
chip_sw_otp_smoketest 3 3 100.00
chip_sw_otp_ctrl_smoketest 218.270s 3372.978us 3 3 100.00
chip_sw_rom_functests 0 3 0.00
rom_keymgr_functest 603.750s 6813.037us 0 3 0.00
chip_sw_boot 3 3 100.00
chip_sw_uart_tx_rx_bootstrap 12385.330s 60926.251us 3 3 100.00
chip_sw_secure_boot 3 3 100.00
rom_e2e_smoke 4041.620s 15339.259us 3 3 100.00
chip_sw_rom_raw_unlock 0 3 0.00
rom_raw_unlock 79.933s 0.000us 0 3 0.00
chip_sw_power_idle_load 0 3 0.00
chip_sw_power_idle_load 1351.610s 15853.837us 0 3 0.00
chip_sw_power_sleep_load 0 3 0.00
chip_sw_power_sleep_load 1301.090s 15375.078us 0 3 0.00
chip_sw_exit_test_unlocked_bootstrap 3 3 100.00
chip_sw_exit_test_unlocked_bootstrap 10940.230s 53603.280us 3 3 100.00
chip_sw_inject_scramble_seed 3 3 100.00
chip_sw_inject_scramble_seed 11752.750s 56285.662us 3 3 100.00
tl_d_oob_addr_access 2 30 6.67
chip_tl_errors 233.220s 4415.152us 2 30 6.67
tl_d_illegal_access 2 30 6.67
chip_tl_errors 233.220s 4415.152us 2 30 6.67
tl_d_outstanding_access 12 12 100.00
chip_csr_aliasing 4841.930s 26039.649us 1 1 100.00
chip_same_csr_outstanding 3401.550s 26904.743us 5 5 100.00
chip_csr_hw_reset 311.510s 6617.307us 1 1 100.00
chip_csr_rw 644.730s 5827.812us 5 5 100.00
tl_d_partial_access 12 12 100.00
chip_csr_aliasing 4841.930s 26039.649us 1 1 100.00
chip_same_csr_outstanding 3401.550s 26904.743us 5 5 100.00
chip_csr_hw_reset 311.510s 6617.307us 1 1 100.00
chip_csr_rw 644.730s 5827.812us 5 5 100.00
xbar_base_random_sequence 50 50 100.00
xbar_random 82.480s 2490.470us 50 50 100.00
xbar_random_delay 300 300 100.00
xbar_smoke_zero_delays 7.150s 53.000us 50 50 100.00
xbar_smoke_large_delays 92.470s 9044.133us 50 50 100.00
xbar_smoke_slow_rsp 83.240s 5872.010us 50 50 100.00
xbar_random_zero_delays 45.630s 526.303us 50 50 100.00
xbar_random_large_delays 454.300s 51584.173us 50 50 100.00
xbar_random_slow_rsp 410.180s 29059.580us 50 50 100.00
xbar_unmapped_address 100 100 100.00
xbar_unmapped_addr 49.380s 1206.289us 50 50 100.00
xbar_error_and_unmapped_addr 51.770s 1419.203us 50 50 100.00
xbar_error_cases 100 100 100.00
xbar_error_random 76.010s 2065.429us 50 50 100.00
xbar_error_and_unmapped_addr 51.770s 1419.203us 50 50 100.00
xbar_all_access_same_device 100 100 100.00
xbar_access_same_device 119.210s 3516.288us 50 50 100.00
xbar_access_same_device_slow_rsp 949.000s 97818.310us 50 50 100.00
xbar_all_hosts_use_same_source_id 50 50 100.00
xbar_same_source 69.710s 2657.993us 50 50 100.00
xbar_stress_all 100 100 100.00
xbar_stress_all 488.610s 13577.417us 50 50 100.00
xbar_stress_all_with_error 486.770s 18888.378us 50 50 100.00
xbar_stress_with_reset 100 100 100.00
xbar_stress_all_with_rand_reset 834.980s 17919.763us 50 50 100.00
xbar_stress_all_with_reset_error 597.440s 17811.087us 50 50 100.00
rom_e2e_smoke 3 3 100.00
rom_e2e_smoke 4041.620s 15339.259us 3 3 100.00
rom_e2e_shutdown_output 0 3 0.00
rom_e2e_shutdown_output 689.320s 7964.138us 0 3 0.00
rom_e2e_shutdown_exception_c 0 3 0.00
rom_e2e_shutdown_exception_c 659.870s 6831.062us 0 3 0.00
rom_e2e_boot_policy_valid 0 15 0.00
rom_e2e_boot_policy_valid_a_good_b_good_test_unlocked0 19.593s 0.000us 0 1 0.00
rom_e2e_boot_policy_valid_a_good_b_good_dev 10.698s 0.000us 0 1 0.00
rom_e2e_boot_policy_valid_a_good_b_good_prod 9.711s 0.000us 0 1 0.00
rom_e2e_boot_policy_valid_a_good_b_good_prod_end 9.456s 0.000us 0 1 0.00
rom_e2e_boot_policy_valid_a_good_b_good_rma 10.794s 0.000us 0 1 0.00
rom_e2e_boot_policy_valid_a_good_b_bad_test_unlocked0 141.385s 0.000us 0 1 0.00
rom_e2e_boot_policy_valid_a_good_b_bad_dev 9.074s 0.000us 0 1 0.00
rom_e2e_boot_policy_valid_a_good_b_bad_prod 10.877s 0.000us 0 1 0.00
rom_e2e_boot_policy_valid_a_good_b_bad_prod_end 10.899s 0.000us 0 1 0.00
rom_e2e_boot_policy_valid_a_good_b_bad_rma 11.163s 0.000us 0 1 0.00
rom_e2e_boot_policy_valid_a_bad_b_good_test_unlocked0 129.449s 0.000us 0 1 0.00
rom_e2e_boot_policy_valid_a_bad_b_good_dev 12.469s 0.000us 0 1 0.00
rom_e2e_boot_policy_valid_a_bad_b_good_prod 12.253s 0.000us 0 1 0.00
rom_e2e_boot_policy_valid_a_bad_b_good_prod_end 12.103s 0.000us 0 1 0.00
rom_e2e_boot_policy_valid_a_bad_b_good_rma 12.168s 0.000us 0 1 0.00
rom_e2e_sigverify_always 0 15 0.00
rom_e2e_sigverify_always_a_bad_b_bad_test_unlocked0 36.640s 10.380us 0 1 0.00
rom_e2e_sigverify_always_a_bad_b_bad_dev 35.360s 10.240us 0 1 0.00
rom_e2e_sigverify_always_a_bad_b_bad_prod 34.500s 10.360us 0 1 0.00
rom_e2e_sigverify_always_a_bad_b_bad_prod_end 30.810s 10.340us 0 1 0.00
rom_e2e_sigverify_always_a_bad_b_bad_rma 26.090s 10.220us 0 1 0.00
rom_e2e_sigverify_always_a_bad_b_nothing_test_unlocked0 23.620s 10.300us 0 1 0.00
rom_e2e_sigverify_always_a_bad_b_nothing_dev 22.710s 10.400us 0 1 0.00
rom_e2e_sigverify_always_a_bad_b_nothing_prod 27.070s 10.220us 0 1 0.00
rom_e2e_sigverify_always_a_bad_b_nothing_prod_end 30.840s 10.360us 0 1 0.00
rom_e2e_sigverify_always_a_bad_b_nothing_rma 25.400s 10.260us 0 1 0.00
rom_e2e_sigverify_always_a_nothing_b_bad_test_unlocked0 27.180s 10.140us 0 1 0.00
rom_e2e_sigverify_always_a_nothing_b_bad_dev 27.010s 10.260us 0 1 0.00
rom_e2e_sigverify_always_a_nothing_b_bad_prod 24.890s 10.380us 0 1 0.00
rom_e2e_sigverify_always_a_nothing_b_bad_prod_end 30.130s 10.160us 0 1 0.00
rom_e2e_sigverify_always_a_nothing_b_bad_rma 24.920s 10.240us 0 1 0.00
rom_e2e_asm_init 0 15 0.00
rom_e2e_asm_init_test_unlocked0 33.556s 0.000us 0 3 0.00
rom_e2e_asm_init_dev 11.050s 0.000us 0 3 0.00
rom_e2e_asm_init_prod 11.032s 0.000us 0 3 0.00
rom_e2e_asm_init_prod_end 11.676s 0.000us 0 3 0.00
rom_e2e_asm_init_rma 11.776s 0.000us 0 3 0.00
rom_e2e_keymgr_init 5 9 55.56
rom_e2e_keymgr_init_rom_ext_meas 8307.390s 29744.846us 3 3 100.00
rom_e2e_keymgr_init_rom_ext_no_meas 7762.460s 32215.315us 2 3 66.67
rom_e2e_keymgr_init_rom_ext_invalid_meas 4101.440s 16597.189us 0 3 0.00
rom_e2e_static_critical 3 3 100.00
rom_e2e_static_critical 4082.460s 16680.759us 3 3 100.00
chip_sw_adc_ctrl_debug_cable_irq 0 3 0.00
chip_sw_adc_ctrl_sleep_debug_cable_wakeup 3600.170s 0.000us 0 3 0.00
chip_sw_adc_ctrl_sleep_debug_cable_wakeup 0 3 0.00
chip_sw_adc_ctrl_sleep_debug_cable_wakeup 3600.170s 0.000us 0 3 0.00
chip_sw_aes_enc 6 6 100.00
chip_sw_aes_enc 305.700s 3931.916us 3 3 100.00
chip_sw_aes_enc_jitter_en 245.340s 3184.651us 3 3 100.00
chip_sw_aes_entropy 3 3 100.00
chip_sw_aes_entropy 287.710s 3761.760us 3 3 100.00
chip_sw_aes_idle 3 3 100.00
chip_sw_aes_idle 256.200s 3408.888us 3 3 100.00
chip_sw_aes_sideload 3 3 100.00
chip_sw_keymgr_sideload_aes 1484.570s 10428.067us 3 3 100.00
chip_sw_alert_handler_alerts 0 3 0.00
chip_sw_alert_test 246.750s 2947.192us 0 3 0.00
chip_sw_alert_handler_escalations 3 3 100.00
chip_sw_alert_handler_escalation 538.630s 7391.634us 3 3 100.00
chip_sw_all_escalation_resets 95 100 95.00
chip_sw_all_escalation_resets 735.240s 8051.887us 95 100 95.00
chip_sw_alert_handler_irqs 9 9 100.00
chip_plic_all_irqs_0 783.430s 6347.831us 3 3 100.00
chip_plic_all_irqs_10 379.980s 4038.274us 3 3 100.00
chip_plic_all_irqs_20 470.300s 5209.203us 3 3 100.00
chip_sw_alert_handler_entropy 3 3 100.00
chip_sw_alert_handler_entropy 354.030s 4283.627us 3 3 100.00
chip_sw_alert_handler_crashdump 3 3 100.00
chip_sw_rstmgr_alert_info 1638.970s 17376.411us 3 3 100.00
chip_sw_alert_handler_ping_timeout 3 3 100.00
chip_sw_alert_handler_ping_timeout 459.140s 6458.128us 3 3 100.00
chip_sw_alert_handler_lpg_sleep_mode_alerts 0 90 0.00
chip_sw_alert_handler_lpg_sleep_mode_alerts 309.140s 4342.592us 0 90 0.00
chip_sw_alert_handler_lpg_sleep_mode_pings 0 3 0.00
chip_sw_alert_handler_lpg_sleep_mode_pings 14400.175s 0.000us 0 3 0.00
chip_sw_alert_handler_lpg_clock_off 3 3 100.00
chip_sw_alert_handler_lpg_clkoff 1691.570s 9560.765us 3 3 100.00
chip_sw_alert_handler_lpg_reset_toggle 3 3 100.00
chip_sw_alert_handler_lpg_reset_toggle 1323.370s 8065.182us 3 3 100.00
chip_sw_alert_handler_ping_ok 3 3 100.00
chip_sw_alert_handler_ping_ok 1162.310s 8467.160us 3 3 100.00
chip_sw_alert_handler_reverse_ping_in_deep_sleep 2 3 66.67
chip_sw_alert_handler_reverse_ping_in_deep_sleep 14400.416s 0.000us 2 3 66.67
chip_sw_aon_timer_wakeup_irq 3 3 100.00
chip_sw_aon_timer_irq 386.340s 5084.303us 3 3 100.00
chip_sw_aon_timer_sleep_wakeup 3 3 100.00
chip_sw_pwrmgr_smoketest 540.530s 8049.698us 3 3 100.00
chip_sw_aon_timer_wdog_bark_irq 3 3 100.00
chip_sw_aon_timer_irq 386.340s 5084.303us 3 3 100.00
chip_sw_aon_timer_wdog_bite_reset 1 3 33.33
chip_sw_aon_timer_wdog_bite_reset 784.880s 8748.639us 1 3 33.33
chip_sw_aon_timer_sleep_wdog_bite_reset 1 3 33.33
chip_sw_aon_timer_wdog_bite_reset 784.880s 8748.639us 1 3 33.33
chip_sw_aon_timer_sleep_wdog_sleep_pause 5 5 100.00
chip_sw_aon_timer_sleep_wdog_sleep_pause 493.320s 7778.412us 5 5 100.00
chip_sw_aon_timer_wdog_lc_escalate 3 3 100.00
chip_sw_aon_timer_wdog_lc_escalate 636.970s 6405.057us 3 3 100.00
chip_sw_clkmgr_idle_trans 12 12 100.00
chip_sw_otbn_randomness 833.060s 6310.383us 3 3 100.00
chip_sw_aes_idle 256.200s 3408.888us 3 3 100.00
chip_sw_hmac_enc_idle 284.500s 4108.115us 3 3 100.00
chip_sw_kmac_idle 240.770s 3440.295us 3 3 100.00
chip_sw_clkmgr_off_trans 12 12 100.00
chip_sw_clkmgr_off_aes_trans 515.150s 7038.675us 3 3 100.00
chip_sw_clkmgr_off_hmac_trans 488.600s 5168.906us 3 3 100.00
chip_sw_clkmgr_off_kmac_trans 416.630s 5804.939us 3 3 100.00
chip_sw_clkmgr_off_otbn_trans 474.870s 6440.105us 3 3 100.00
chip_sw_clkmgr_off_peri 3 3 100.00
chip_sw_clkmgr_off_peri 1425.260s 16927.514us 3 3 100.00
chip_sw_clkmgr_div 21 21 100.00
chip_sw_clkmgr_external_clk_src_for_sw_fast_test_unlocked0 579.900s 5031.789us 3 3 100.00
chip_sw_clkmgr_external_clk_src_for_sw_slow_test_unlocked0 555.170s 6020.765us 3 3 100.00
chip_sw_clkmgr_external_clk_src_for_sw_fast_dev 570.210s 4897.433us 3 3 100.00
chip_sw_clkmgr_external_clk_src_for_sw_slow_dev 564.290s 5426.912us 3 3 100.00
chip_sw_clkmgr_external_clk_src_for_sw_fast_rma 553.400s 4805.993us 3 3 100.00
chip_sw_clkmgr_external_clk_src_for_sw_slow_rma 536.290s 5336.793us 3 3 100.00
chip_sw_ast_clk_outputs 957.550s 9906.190us 3 3 100.00
chip_sw_clkmgr_external_clk_src_for_lc 2 3 66.67
chip_sw_clkmgr_external_clk_src_for_lc 1105.780s 26179.108us 2 3 66.67
chip_sw_clkmgr_external_clk_src_for_sw 6 6 100.00
chip_sw_clkmgr_external_clk_src_for_sw_fast_dev 570.210s 4897.433us 3 3 100.00
chip_sw_clkmgr_external_clk_src_for_sw_slow_dev 564.290s 5426.912us 3 3 100.00
chip_sw_clkmgr_jitter 30 30 100.00
chip_sw_flash_ctrl_ops_jitter_en 549.750s 5057.514us 3 3 100.00
chip_sw_flash_ctrl_access_jitter_en 759.430s 7171.363us 3 3 100.00
chip_sw_otbn_ecdsa_op_irq_jitter_en 4997.760s 18705.633us 3 3 100.00
chip_sw_aes_enc_jitter_en 245.340s 3184.651us 3 3 100.00
chip_sw_edn_entropy_reqs_jitter 1139.920s 9470.676us 3 3 100.00
chip_sw_hmac_enc_jitter_en 300.130s 3932.465us 3 3 100.00
chip_sw_keymgr_key_derivation_jitter_en 2232.240s 14706.223us 3 3 100.00
chip_sw_kmac_mode_kmac_jitter_en 261.660s 2723.075us 3 3 100.00
chip_sw_sram_ctrl_scrambled_access_jitter_en 581.340s 6263.304us 3 3 100.00
chip_sw_clkmgr_jitter 272.130s 3673.396us 3 3 100.00
chip_sw_clkmgr_extended_range 33 33 100.00
chip_sw_clkmgr_jitter_reduced_freq 233.390s 3776.596us 3 3 100.00
chip_sw_flash_ctrl_ops_jitter_en_reduced_freq 541.500s 5708.441us 3 3 100.00
chip_sw_flash_ctrl_access_jitter_en_reduced_freq 826.910s 7762.865us 3 3 100.00
chip_sw_otbn_ecdsa_op_irq_jitter_en_reduced_freq 5264.390s 25699.175us 3 3 100.00
chip_sw_aes_enc_jitter_en_reduced_freq 245.250s 3662.058us 3 3 100.00
chip_sw_hmac_enc_jitter_en_reduced_freq 246.200s 3728.489us 3 3 100.00
chip_sw_keymgr_key_derivation_jitter_en_reduced_freq 1287.840s 10926.398us 3 3 100.00
chip_sw_kmac_mode_kmac_jitter_en_reduced_freq 292.520s 4691.124us 3 3 100.00
chip_sw_sram_ctrl_scrambled_access_jitter_en_reduced_freq 529.640s 5360.327us 3 3 100.00
chip_sw_flash_init_reduced_freq 1877.660s 35199.090us 3 3 100.00
chip_sw_csrng_edn_concurrency_reduced_freq 20935.310s 127470.634us 3 3 100.00
chip_sw_clkmgr_deep_sleep_frequency 3 3 100.00
chip_sw_ast_clk_outputs 957.550s 9906.190us 3 3 100.00
chip_sw_clkmgr_sleep_frequency 3 3 100.00
chip_sw_clkmgr_sleep_frequency 503.460s 5575.639us 3 3 100.00
chip_sw_clkmgr_reset_frequency 3 3 100.00
chip_sw_clkmgr_reset_frequency 356.310s 3865.099us 3 3 100.00
chip_sw_clkmgr_escalation_reset 95 100 95.00
chip_sw_all_escalation_resets 735.240s 8051.887us 95 100 95.00
chip_sw_clkmgr_alert_handler_clock_enables 3 3 100.00
chip_sw_alert_handler_lpg_clkoff 1691.570s 9560.765us 3 3 100.00
chip_sw_csrng_edn_cmd 3 3 100.00
chip_sw_entropy_src_csrng 3039.060s 25065.437us 3 3 100.00
chip_sw_csrng_fuse_en_sw_app_read 3 3 100.00
chip_sw_csrng_fuse_en_sw_app_read_test 517.650s 5424.127us 3 3 100.00
chip_sw_csrng_lc_hw_debug_en 3 3 100.00
chip_sw_csrng_lc_hw_debug_en_test 731.590s 9278.513us 3 3 100.00
chip_sw_csrng_known_answer_tests 3 3 100.00
chip_sw_csrng_kat_test 270.680s 3785.464us 3 3 100.00
chip_sw_edn_entropy_reqs 16 16 100.00
chip_sw_csrng_edn_concurrency 4907.730s 22972.132us 10 10 100.00
chip_sw_entropy_src_ast_rng_req 246.430s 3721.810us 3 3 100.00
chip_sw_edn_entropy_reqs 1057.250s 8940.535us 3 3 100.00
chip_sw_entropy_src_ast_rng_req 3 3 100.00
chip_sw_entropy_src_ast_rng_req 246.430s 3721.810us 3 3 100.00
chip_sw_entropy_src_csrng 3 3 100.00
chip_sw_entropy_src_csrng 3039.060s 25065.437us 3 3 100.00
chip_sw_entropy_src_known_answer_tests 3 3 100.00
chip_sw_entropy_src_kat_test 223.010s 3286.345us 3 3 100.00
chip_sw_flash_init 3 3 100.00
chip_sw_flash_init 2149.750s 30357.136us 3 3 100.00
chip_sw_flash_host_access 6 6 100.00
chip_sw_flash_ctrl_access 751.400s 5759.659us 3 3 100.00
chip_sw_flash_ctrl_access_jitter_en 759.430s 7171.363us 3 3 100.00
chip_sw_flash_ctrl_ops 6 6 100.00
chip_sw_flash_ctrl_ops 521.040s 5454.659us 3 3 100.00
chip_sw_flash_ctrl_ops_jitter_en 549.750s 5057.514us 3 3 100.00
chip_sw_flash_rma_unlocked 3 3 100.00
chip_sw_flash_rma_unlocked 5262.590s 46944.220us 3 3 100.00
chip_sw_flash_scramble 3 3 100.00
chip_sw_flash_init 2149.750s 30357.136us 3 3 100.00
chip_sw_flash_idle_low_power 3 3 100.00
chip_sw_flash_ctrl_idle_low_power 329.510s 3761.209us 3 3 100.00
chip_sw_flash_keymgr_seeds 3 3 100.00
chip_sw_keymgr_key_derivation 2060.570s 13587.624us 3 3 100.00
chip_sw_flash_lc_creator_seed_sw_rw_en 0 3 0.00
chip_sw_flash_ctrl_lc_rw_en 291.950s 4160.981us 0 3 0.00
chip_sw_flash_creator_seed_wipe_on_rma 3 3 100.00
chip_sw_flash_rma_unlocked 5262.590s 46944.220us 3 3 100.00
chip_sw_flash_lc_owner_seed_sw_rw_en 0 3 0.00
chip_sw_flash_ctrl_lc_rw_en 291.950s 4160.981us 0 3 0.00
chip_sw_flash_lc_iso_part_sw_rd_en 0 3 0.00
chip_sw_flash_ctrl_lc_rw_en 291.950s 4160.981us 0 3 0.00
chip_sw_flash_lc_iso_part_sw_wr_en 0 3 0.00
chip_sw_flash_ctrl_lc_rw_en 291.950s 4160.981us 0 3 0.00
chip_sw_flash_lc_seed_hw_rd_en 0 3 0.00
chip_sw_flash_ctrl_lc_rw_en 291.950s 4160.981us 0 3 0.00
chip_sw_flash_lc_escalate_en 95 100 95.00
chip_sw_all_escalation_resets 735.240s 8051.887us 95 100 95.00
chip_sw_flash_prim_tl_access 3 3 100.00
chip_prim_tl_access 526.930s 12423.942us 3 3 100.00
chip_sw_flash_ctrl_clock_freqs 3 3 100.00
chip_sw_flash_ctrl_clock_freqs 851.400s 6694.856us 3 3 100.00
chip_sw_flash_ctrl_escalation_reset 3 3 100.00
chip_sw_flash_crash_alert 590.770s 7309.197us 3 3 100.00
chip_sw_flash_ctrl_write_clear 3 3 100.00
chip_sw_flash_crash_alert 590.770s 7309.197us 3 3 100.00
chip_sw_hmac_enc 6 6 100.00
chip_sw_hmac_enc 259.550s 3658.269us 3 3 100.00
chip_sw_hmac_enc_jitter_en 300.130s 3932.465us 3 3 100.00
chip_sw_hmac_idle 3 3 100.00
chip_sw_hmac_enc_idle 284.500s 4108.115us 3 3 100.00
chip_sw_hmac_all_configurations 2 3 66.67
chip_sw_hmac_oneshot 1940.950s 12026.776us 2 3 66.67
chip_sw_hmac_multistream_mode 0 3 0.00
chip_sw_hmac_multistream 2270.290s 12018.623us 0 3 0.00
chip_sw_i2c_host_tx_rx 9 9 100.00
chip_sw_i2c_host_tx_rx 634.390s 6101.194us 3 3 100.00
chip_sw_i2c_host_tx_rx_idx1 662.850s 6082.585us 3 3 100.00
chip_sw_i2c_host_tx_rx_idx2 548.320s 4835.851us 3 3 100.00
chip_sw_i2c_device_tx_rx 3 3 100.00
chip_sw_i2c_device_tx_rx 422.250s 4321.957us 3 3 100.00
chip_sw_keymgr_key_derivation 6 6 100.00
chip_sw_keymgr_key_derivation 2060.570s 13587.624us 3 3 100.00
chip_sw_keymgr_key_derivation_jitter_en 2232.240s 14706.223us 3 3 100.00
chip_sw_keymgr_sideload_kmac 3 3 100.00
chip_sw_keymgr_sideload_kmac 2463.260s 14953.440us 3 3 100.00
chip_sw_keymgr_sideload_aes 3 3 100.00
chip_sw_keymgr_sideload_aes 1484.570s 10428.067us 3 3 100.00
chip_sw_keymgr_sideload_otbn 0 3 0.00
chip_sw_keymgr_sideload_otbn 5929.100s 20018.551us 0 3 0.00
chip_sw_kmac_enc 9 9 100.00
chip_sw_kmac_mode_cshake 258.260s 3149.093us 3 3 100.00
chip_sw_kmac_mode_kmac 281.950s 3373.503us 3 3 100.00
chip_sw_kmac_mode_kmac_jitter_en 261.660s 2723.075us 3 3 100.00
chip_sw_kmac_app_keymgr 3 3 100.00
chip_sw_keymgr_key_derivation 2060.570s 13587.624us 3 3 100.00
chip_sw_kmac_app_lc 15 15 100.00
chip_sw_lc_ctrl_transition 1208.870s 14836.353us 15 15 100.00
chip_sw_kmac_app_rom 3 3 100.00
chip_sw_kmac_app_rom 258.330s 4058.922us 3 3 100.00
chip_sw_kmac_entropy 3 3 100.00
chip_sw_kmac_entropy 1826.400s 10591.935us 3 3 100.00
chip_sw_kmac_idle 3 3 100.00
chip_sw_kmac_idle 240.770s 3440.295us 3 3 100.00
chip_sw_lc_ctrl_alert_handler_escalation 3 3 100.00
chip_sw_alert_handler_escalation 538.630s 7391.634us 3 3 100.00
chip_sw_lc_ctrl_jtag_access 15 15 100.00
chip_tap_straps_dev 1372.470s 16220.821us 5 5 100.00
chip_tap_straps_rma 455.380s 6094.364us 5 5 100.00
chip_tap_straps_prod 1147.540s 14605.708us 5 5 100.00
chip_sw_lc_ctrl_otp_hw_cfg0 3 3 100.00
chip_sw_lc_ctrl_otp_hw_cfg0 288.040s 4233.910us 3 3 100.00
chip_sw_lc_ctrl_init 15 15 100.00
chip_sw_lc_ctrl_transition 1208.870s 14836.353us 15 15 100.00
chip_sw_lc_ctrl_transitions 15 15 100.00
chip_sw_lc_ctrl_transition 1208.870s 14836.353us 15 15 100.00
chip_sw_lc_ctrl_kmac_req 15 15 100.00
chip_sw_lc_ctrl_transition 1208.870s 14836.353us 15 15 100.00
chip_sw_lc_ctrl_key_div 3 3 100.00
chip_sw_keymgr_key_derivation_prod 1920.830s 12024.573us 3 3 100.00
chip_sw_lc_ctrl_broadcast 75 84 89.29
chip_sw_flash_ctrl_lc_rw_en 291.950s 4160.981us 0 3 0.00
chip_sw_flash_rma_unlocked 5262.590s 46944.220us 3 3 100.00
chip_sw_otp_ctrl_lc_signals_test_unlocked0 353.280s 4435.633us 3 3 100.00
chip_sw_otp_ctrl_lc_signals_dev 881.280s 7641.308us 3 3 100.00
chip_sw_otp_ctrl_lc_signals_prod 798.830s 7669.732us 3 3 100.00
chip_sw_otp_ctrl_lc_signals_rma 704.550s 8672.322us 0 3 0.00
chip_sw_lc_ctrl_transition 1208.870s 14836.353us 15 15 100.00
chip_sw_keymgr_key_derivation 2060.570s 13587.624us 3 3 100.00
chip_sw_rom_ctrl_integrity_check 573.080s 10310.787us 3 3 100.00
chip_sw_sram_ctrl_execution_main 1065.730s 13220.143us 3 3 100.00
chip_prim_tl_access 526.930s 12423.942us 3 3 100.00
chip_sw_clkmgr_external_clk_src_for_lc 1105.780s 26179.108us 2 3 66.67
chip_sw_clkmgr_external_clk_src_for_sw_fast_test_unlocked0 579.900s 5031.789us 3 3 100.00
chip_sw_clkmgr_external_clk_src_for_sw_slow_test_unlocked0 555.170s 6020.765us 3 3 100.00
chip_sw_clkmgr_external_clk_src_for_sw_fast_dev 570.210s 4897.433us 3 3 100.00
chip_sw_clkmgr_external_clk_src_for_sw_slow_dev 564.290s 5426.912us 3 3 100.00
chip_sw_clkmgr_external_clk_src_for_sw_fast_rma 553.400s 4805.993us 3 3 100.00
chip_sw_clkmgr_external_clk_src_for_sw_slow_rma 536.290s 5336.793us 3 3 100.00
chip_tap_straps_dev 1372.470s 16220.821us 5 5 100.00
chip_tap_straps_rma 455.380s 6094.364us 5 5 100.00
chip_tap_straps_prod 1147.540s 14605.708us 5 5 100.00
chip_rv_dm_lc_disabled 1357.410s 28478.946us 1 3 33.33
chip_lc_scrap 6 6 100.00
chip_sw_lc_ctrl_rma_to_scrap 282.470s 4037.557us 1 1 100.00
chip_sw_lc_ctrl_raw_to_scrap 154.270s 4148.719us 1 1 100.00
chip_sw_lc_ctrl_test_locked0_to_scrap 139.790s 3379.265us 1 1 100.00
chip_sw_lc_ctrl_rand_to_scrap 276.730s 4288.659us 3 3 100.00
chip_lc_test_locked 4 6 66.67
chip_sw_lc_walkthrough_testunlocks 2683.000s 33721.679us 3 3 100.00
chip_rv_dm_lc_disabled 1357.410s 28478.946us 1 3 33.33
chip_sw_lc_walkthrough 6 15 40.00
chip_sw_lc_walkthrough_dev 1063.460s 14457.498us 0 3 0.00
chip_sw_lc_walkthrough_prod 1279.840s 12532.632us 0 3 0.00
chip_sw_lc_walkthrough_prodend 1156.960s 16467.630us 3 3 100.00
chip_sw_lc_walkthrough_rma 591.020s 7510.258us 0 3 0.00
chip_sw_lc_walkthrough_testunlocks 2683.000s 33721.679us 3 3 100.00
chip_sw_lc_ctrl_volatile_raw_unlock 5 9 55.56
chip_sw_lc_ctrl_volatile_raw_unlock 108.180s 3066.498us 3 3 100.00
chip_sw_lc_ctrl_volatile_raw_unlock_ext_clk_48mhz 908.770s 27260.367us 2 3 66.67
rom_volatile_raw_unlock 24.267s 0.000us 0 3 0.00
chip_sw_otbn_op 6 6 100.00
chip_sw_otbn_ecdsa_op_irq 4990.850s 17429.545us 3 3 100.00
chip_sw_otbn_ecdsa_op_irq_jitter_en 4997.760s 18705.633us 3 3 100.00
chip_sw_otbn_rnd_entropy 3 3 100.00
chip_sw_otbn_randomness 833.060s 6310.383us 3 3 100.00
chip_sw_otbn_urnd_entropy 3 3 100.00
chip_sw_otbn_randomness 833.060s 6310.383us 3 3 100.00
chip_sw_otbn_idle 3 3 100.00
chip_sw_otbn_randomness 833.060s 6310.383us 3 3 100.00
chip_sw_otbn_mem_scramble 3 3 100.00
chip_sw_otbn_mem_scramble 474.280s 4978.546us 3 3 100.00
chip_otp_ctrl_init 15 15 100.00
chip_sw_lc_ctrl_transition 1208.870s 14836.353us 15 15 100.00
chip_sw_otp_ctrl_keys 15 15 100.00
chip_sw_flash_init 2149.750s 30357.136us 3 3 100.00
chip_sw_otbn_mem_scramble 474.280s 4978.546us 3 3 100.00
chip_sw_keymgr_key_derivation 2060.570s 13587.624us 3 3 100.00
chip_sw_sram_ctrl_scrambled_access 561.720s 6369.721us 3 3 100.00
chip_sw_rv_core_ibex_icache_invalidate 230.990s 3107.863us 3 3 100.00
chip_sw_otp_ctrl_entropy 15 15 100.00
chip_sw_flash_init 2149.750s 30357.136us 3 3 100.00
chip_sw_otbn_mem_scramble 474.280s 4978.546us 3 3 100.00
chip_sw_keymgr_key_derivation 2060.570s 13587.624us 3 3 100.00
chip_sw_sram_ctrl_scrambled_access 561.720s 6369.721us 3 3 100.00
chip_sw_rv_core_ibex_icache_invalidate 230.990s 3107.863us 3 3 100.00
chip_sw_otp_ctrl_program 15 15 100.00
chip_sw_lc_ctrl_transition 1208.870s 14836.353us 15 15 100.00
chip_sw_otp_ctrl_program_error 3 3 100.00
chip_sw_lc_ctrl_program_error 627.040s 6874.270us 3 3 100.00
chip_sw_otp_ctrl_hw_cfg0 3 3 100.00
chip_sw_lc_ctrl_otp_hw_cfg0 288.040s 4233.910us 3 3 100.00
chip_sw_otp_ctrl_lc_signals 27 30 90.00
chip_sw_otp_ctrl_lc_signals_test_unlocked0 353.280s 4435.633us 3 3 100.00
chip_sw_otp_ctrl_lc_signals_dev 881.280s 7641.308us 3 3 100.00
chip_sw_otp_ctrl_lc_signals_prod 798.830s 7669.732us 3 3 100.00
chip_sw_otp_ctrl_lc_signals_rma 704.550s 8672.322us 0 3 0.00
chip_sw_lc_ctrl_transition 1208.870s 14836.353us 15 15 100.00
chip_prim_tl_access 526.930s 12423.942us 3 3 100.00
chip_sw_otp_prim_tl_access 3 3 100.00
chip_prim_tl_access 526.930s 12423.942us 3 3 100.00
chip_sw_otp_ctrl_dai_lock 1 1 100.00
chip_sw_otp_ctrl_dai_lock 1101.290s 9092.076us 1 1 100.00
chip_sw_pwrmgr_external_full_reset 0 3 0.00
chip_sw_pwrmgr_full_aon_reset 280.040s 6638.325us 0 3 0.00
chip_sw_pwrmgr_random_sleep_all_wake_ups 3 3 100.00
chip_sw_pwrmgr_random_sleep_all_wake_ups 1713.580s 29036.945us 3 3 100.00
chip_sw_pwrmgr_normal_sleep_all_wake_ups 3 3 100.00
chip_sw_pwrmgr_normal_sleep_all_wake_ups 395.960s 8281.591us 3 3 100.00
chip_sw_pwrmgr_deep_sleep_por_reset 0 3 0.00
chip_sw_pwrmgr_deep_sleep_por_reset 468.820s 7683.095us 0 3 0.00
chip_sw_pwrmgr_normal_sleep_por_reset 3 3 100.00
chip_sw_pwrmgr_normal_sleep_por_reset 654.130s 10112.645us 3 3 100.00
chip_sw_pwrmgr_deep_sleep_all_wake_ups 3 3 100.00
chip_sw_pwrmgr_deep_sleep_all_wake_ups 1690.940s 29691.578us 3 3 100.00
chip_sw_pwrmgr_deep_sleep_all_reset_reqs 1 6 16.67
chip_sw_pwrmgr_deep_sleep_all_reset_reqs 632.040s 10018.293us 0 3 0.00
chip_sw_aon_timer_wdog_bite_reset 784.880s 8748.639us 1 3 33.33
chip_sw_pwrmgr_normal_sleep_all_reset_reqs 3 3 100.00
chip_sw_pwrmgr_normal_sleep_all_reset_reqs 1200.530s 17051.062us 3 3 100.00
chip_sw_pwrmgr_wdog_reset 3 3 100.00
chip_sw_pwrmgr_wdog_reset 475.940s 5818.670us 3 3 100.00
chip_sw_pwrmgr_power_glitch_reset 0 3 0.00
chip_sw_pwrmgr_full_aon_reset 280.040s 6638.325us 0 3 0.00
chip_sw_pwrmgr_main_power_glitch_reset 3 3 100.00
chip_sw_pwrmgr_main_power_glitch_reset 491.330s 6470.615us 3 3 100.00
chip_sw_pwrmgr_random_sleep_power_glitch_reset 0 3 0.00
chip_sw_pwrmgr_random_sleep_power_glitch_reset 677.640s 10074.700us 0 3 0.00
chip_sw_pwrmgr_deep_sleep_power_glitch_reset 3 3 100.00
chip_sw_pwrmgr_deep_sleep_power_glitch_reset 506.350s 9381.836us 3 3 100.00
chip_sw_pwrmgr_sleep_power_glitch_reset 0 3 0.00
chip_sw_pwrmgr_sleep_power_glitch_reset 254.620s 3181.155us 0 3 0.00
chip_sw_pwrmgr_random_sleep_all_reset_reqs 0 3 0.00
chip_sw_pwrmgr_random_sleep_all_reset_reqs 304.420s 6693.552us 0 3 0.00
chip_sw_pwrmgr_sysrst_ctrl_reset 6 6 100.00
chip_sw_pwrmgr_sysrst_ctrl_reset 1162.760s 10548.769us 3 3 100.00
chip_sw_pwrmgr_all_reset_reqs 1705.740s 17630.197us 3 3 100.00
chip_sw_pwrmgr_b2b_sleep_reset_req 3 3 100.00
chip_sw_pwrmgr_b2b_sleep_reset_req 2835.600s 37225.597us 3 3 100.00
chip_sw_pwrmgr_sleep_disabled 3 3 100.00
chip_sw_pwrmgr_sleep_disabled 276.070s 3225.542us 3 3 100.00
chip_sw_pwrmgr_escalation_reset 95 100 95.00
chip_sw_all_escalation_resets 735.240s 8051.887us 95 100 95.00
chip_sw_rom_access 3 3 100.00
chip_sw_rom_ctrl_integrity_check 573.080s 10310.787us 3 3 100.00
chip_sw_rom_ctrl_integrity_check 3 3 100.00
chip_sw_rom_ctrl_integrity_check 573.080s 10310.787us 3 3 100.00
chip_sw_rstmgr_non_sys_reset_info 9 12 75.00
chip_sw_pwrmgr_all_reset_reqs 1705.740s 17630.197us 3 3 100.00
chip_sw_pwrmgr_random_sleep_all_reset_reqs 304.420s 6693.552us 0 3 0.00
chip_sw_pwrmgr_wdog_reset 475.940s 5818.670us 3 3 100.00
chip_sw_pwrmgr_smoketest 540.530s 8049.698us 3 3 100.00
chip_sw_rstmgr_sys_reset_info 3 3 100.00
chip_rv_dm_ndm_reset_req 479.290s 5095.024us 3 3 100.00
chip_sw_rstmgr_cpu_info 3 3 100.00
chip_sw_rstmgr_cpu_info 704.240s 10314.011us 3 3 100.00
chip_sw_rstmgr_sw_req_reset 3 3 100.00
chip_sw_rstmgr_sw_req 471.130s 5836.815us 3 3 100.00
chip_sw_rstmgr_alert_info 3 3 100.00
chip_sw_rstmgr_alert_info 1638.970s 17376.411us 3 3 100.00
chip_sw_rstmgr_sw_rst 3 3 100.00
chip_sw_rstmgr_sw_rst 264.030s 3126.782us 3 3 100.00
chip_sw_rstmgr_escalation_reset 95 100 95.00
chip_sw_all_escalation_resets 735.240s 8051.887us 95 100 95.00
chip_sw_rstmgr_alert_handler_reset_enables 3 3 100.00
chip_sw_alert_handler_lpg_reset_toggle 1323.370s 8065.182us 3 3 100.00
chip_sw_nmi_irq 3 3 100.00
chip_sw_rv_core_ibex_nmi_irq 633.870s 5147.895us 3 3 100.00
chip_sw_rv_core_ibex_rnd 3 3 100.00
chip_sw_rv_core_ibex_rnd 698.760s 6212.198us 3 3 100.00
chip_sw_rv_core_ibex_address_translation 3 3 100.00
chip_sw_rv_core_ibex_address_translation 303.630s 3181.661us 3 3 100.00
chip_sw_rv_core_ibex_icache_scrambled_access 3 3 100.00
chip_sw_rv_core_ibex_icache_invalidate 230.990s 3107.863us 3 3 100.00
chip_sw_rv_core_ibex_fault_dump 3 3 100.00
chip_sw_rstmgr_cpu_info 704.240s 10314.011us 3 3 100.00
chip_sw_rv_core_ibex_double_fault 3 3 100.00
chip_sw_rstmgr_cpu_info 704.240s 10314.011us 3 3 100.00
chip_sw_rv_core_ibex_mcounteren_writable 3 3 100.00
chip_sw_rv_core_ibex_mcounteren_writable 222.790s 3164.393us 3 3 100.00
chip_jtag_csr_rw 3 3 100.00
chip_jtag_csr_rw 1551.200s 18284.396us 3 3 100.00
chip_jtag_mem_access 3 3 100.00
chip_jtag_mem_access 1293.020s 14270.540us 3 3 100.00
chip_rv_dm_ndm_reset_req 3 3 100.00
chip_rv_dm_ndm_reset_req 479.290s 5095.024us 3 3 100.00
chip_sw_rv_dm_ndm_reset_req_when_cpu_halted 0 3 0.00
chip_sw_rv_dm_ndm_reset_req_when_cpu_halted 264.830s 3018.661us 0 3 0.00
chip_rv_dm_access_after_wakeup 0 3 0.00
chip_sw_rv_dm_access_after_wakeup 1750.460s 13474.494us 0 3 0.00
chip_sw_rv_dm_jtag_tap_sel 5 5 100.00
chip_tap_straps_rma 455.380s 6094.364us 5 5 100.00
chip_rv_dm_lc_disabled 1 3 33.33
chip_rv_dm_lc_disabled 1357.410s 28478.946us 1 3 33.33
chip_sw_plic_all_irqs 9 9 100.00
chip_plic_all_irqs_0 783.430s 6347.831us 3 3 100.00
chip_plic_all_irqs_10 379.980s 4038.274us 3 3 100.00
chip_plic_all_irqs_20 470.300s 5209.203us 3 3 100.00
chip_sw_plic_sw_irq 3 3 100.00
chip_sw_plic_sw_irq 281.130s 3464.594us 3 3 100.00
chip_sw_timer 3 3 100.00
chip_sw_rv_timer_irq 244.460s 3813.017us 3 3 100.00
chip_sw_spi_device_flash_mode 3 3 100.00
rom_e2e_smoke 4041.620s 15339.259us 3 3 100.00
chip_sw_spi_device_pass_through 3 3 100.00
chip_sw_spi_device_pass_through 553.470s 6531.411us 3 3 100.00
chip_sw_spi_device_pass_through_collision 0 3 0.00
chip_sw_spi_device_pass_through_collision 296.570s 4208.504us 0 3 0.00
chip_sw_spi_device_tpm 3 3 100.00
chip_sw_spi_device_tpm 303.060s 4974.422us 3 3 100.00
chip_sw_spi_host_tx_rx 3 3 100.00
chip_sw_spi_host_tx_rx 334.690s 4397.145us 3 3 100.00
chip_sw_sram_scrambled_access 6 6 100.00
chip_sw_sram_ctrl_scrambled_access 561.720s 6369.721us 3 3 100.00
chip_sw_sram_ctrl_scrambled_access_jitter_en 581.340s 6263.304us 3 3 100.00
chip_sw_sleep_sram_ret_contents 6 6 100.00
chip_sw_sleep_sram_ret_contents_no_scramble 732.790s 11198.985us 3 3 100.00
chip_sw_sleep_sram_ret_contents_scramble 695.410s 10093.900us 3 3 100.00
chip_sw_sram_execution 3 3 100.00
chip_sw_sram_ctrl_execution_main 1065.730s 13220.143us 3 3 100.00
chip_sw_sram_lc_escalation 101 106 95.28
chip_sw_all_escalation_resets 735.240s 8051.887us 95 100 95.00
chip_sw_data_integrity_escalation 688.340s 5737.758us 6 6 100.00
chip_sw_sysrst_ctrl_reset 5 6 83.33
chip_sw_pwrmgr_sysrst_ctrl_reset 1162.760s 10548.769us 3 3 100.00
chip_sw_sysrst_ctrl_reset 1584.370s 23288.333us 2 3 66.67
chip_sw_sysrst_ctrl_inputs 3 3 100.00
chip_sw_sysrst_ctrl_inputs 270.370s 3863.821us 3 3 100.00
chip_sw_sysrst_ctrl_outputs 3 3 100.00
chip_sw_sysrst_ctrl_outputs 347.090s 5008.093us 3 3 100.00
chip_sw_sysrst_ctrl_in_irq 3 3 100.00
chip_sw_sysrst_ctrl_in_irq 459.290s 4712.559us 3 3 100.00
chip_sw_sysrst_ctrl_sleep_wakeup 2 3 66.67
chip_sw_sysrst_ctrl_reset 1584.370s 23288.333us 2 3 66.67
chip_sw_sysrst_ctrl_sleep_reset 2 3 66.67
chip_sw_sysrst_ctrl_reset 1584.370s 23288.333us 2 3 66.67
chip_sw_sysrst_ctrl_ec_rst_l 2 3 66.67
chip_sw_sysrst_ctrl_ec_rst_l 3236.600s 20735.217us 2 3 66.67
chip_sw_sysrst_ctrl_flash_wp_l 2 3 66.67
chip_sw_sysrst_ctrl_ec_rst_l 3236.600s 20735.217us 2 3 66.67
chip_sw_sysrst_ctrl_ulp_z3_wakeup 3 6 50.00
chip_sw_sysrst_ctrl_ulp_z3_wakeup 463.460s 6467.165us 3 3 100.00
chip_sw_adc_ctrl_sleep_debug_cable_wakeup 3600.170s 0.000us 0 3 0.00
chip_sw_usbdev_vbus 1 1 100.00
chip_sw_usbdev_vbus 203.140s 3091.642us 1 1 100.00
chip_sw_usbdev_pullup 1 1 100.00
chip_sw_usbdev_pullup 224.890s 3220.574us 1 1 100.00
chip_sw_usbdev_aon_pullup 1 1 100.00
chip_sw_usbdev_aon_pullup 337.170s 4373.137us 1 1 100.00
chip_sw_usbdev_setup_rx 1 1 100.00
chip_sw_usbdev_setuprx 468.150s 5092.181us 1 1 100.00
chip_sw_usbdev_config_host 1 1 100.00
chip_sw_usbdev_config_host 1338.800s 9175.306us 1 1 100.00
chip_sw_usbdev_pincfg 1 1 100.00
chip_sw_usbdev_pincfg 7332.330s 33086.770us 1 1 100.00
chip_sw_usbdev_tx_rx 1 1 100.00
chip_sw_usbdev_dpi 2290.420s 12327.231us 1 1 100.00
chip_sw_usbdev_toggle_restore 1 1 100.00
chip_sw_usbdev_toggle_restore 214.550s 3514.261us 1 1 100.00
Testpoint Test Max Runtime Sim Time Pass Total %
chip_sw_aes_masking_off 3 3 100.00
chip_sw_aes_masking_off 282.670s 4159.098us 3 3 100.00
chip_sw_rv_core_ibex_lockstep_glitch 3 3 100.00
chip_sw_rv_core_ibex_lockstep_glitch 276.390s 2653.367us 3 3 100.00
Testpoint Test Max Runtime Sim Time Pass Total %
chip_sw_coremark 1 1 100.00
chip_sw_coremark 16108.780s 68637.985us 1 1 100.00
chip_sw_power_max_load 3 3 100.00
chip_sw_power_virus 1543.460s 7023.340us 3 3 100.00
rom_e2e_debug 0 3 0.00
rom_e2e_jtag_debug_test_unlocked0 314.620s 4412.754us 0 1 0.00
rom_e2e_jtag_debug_dev 293.430s 4830.228us 0 1 0.00
rom_e2e_jtag_debug_rma 331.240s 5635.912us 0 1 0.00
rom_e2e_jtag_inject 0 3 0.00
rom_e2e_jtag_inject_test_unlocked0 132.650s 2878.833us 0 1 0.00
rom_e2e_jtag_inject_dev 124.160s 3023.677us 0 1 0.00
rom_e2e_jtag_inject_rma 132.920s 3028.633us 0 1 0.00
rom_e2e_self_hash 0 3 0.00
rom_e2e_self_hash 103.319s 0.000us 0 3 0.00
chip_sw_clkmgr_jitter_cycle_measurements 0 3 0.00
chip_sw_clkmgr_jitter_frequency 400.870s 3660.677us 0 3 0.00
chip_sw_edn_boot_mode 3 3 100.00
chip_sw_edn_boot_mode 440.490s 3882.506us 3 3 100.00
chip_sw_edn_auto_mode 3 3 100.00
chip_sw_edn_auto_mode 1295.210s 7352.896us 3 3 100.00
chip_sw_edn_sw_mode 3 3 100.00
chip_sw_edn_sw_mode 1552.350s 10076.093us 3 3 100.00
chip_sw_edn_kat 3 3 100.00
chip_sw_edn_kat 347.090s 3140.988us 3 3 100.00
chip_sw_flash_memory_protection 3 3 100.00
chip_sw_flash_ctrl_mem_protection 831.210s 5940.730us 3 3 100.00
chip_sw_otp_ctrl_vendor_test_csr_access 3 3 100.00
chip_sw_otp_ctrl_vendor_test_csr_access 227.470s 3270.182us 3 3 100.00
chip_sw_otp_ctrl_escalation 0 1 0.00
chip_sw_otp_ctrl_escalation 330.230s 4171.573us 0 1 0.00
chip_sw_sensor_ctrl_deep_sleep_wake_up 3 3 100.00
chip_sw_pwrmgr_sensor_ctrl_deep_sleep_wake_up 495.250s 7236.150us 3 3 100.00
chip_sw_pwrmgr_usb_clk_disabled_when_active 3 3 100.00
chip_sw_pwrmgr_usb_clk_disabled_when_active 470.700s 7473.708us 3 3 100.00
chip_sw_all_resets 3 3 100.00
chip_sw_pwrmgr_all_reset_reqs 1705.740s 17630.197us 3 3 100.00
chip_rv_dm_perform_debug 0 3 0.00
rom_e2e_jtag_debug_test_unlocked0 314.620s 4412.754us 0 1 0.00
rom_e2e_jtag_debug_dev 293.430s 4830.228us 0 1 0.00
rom_e2e_jtag_debug_rma 331.240s 5635.912us 0 1 0.00
chip_sw_rv_dm_access_after_hw_reset 1 3 33.33
chip_sw_rv_dm_access_after_escalation_reset 522.590s 7591.261us 1 3 33.33
chip_sw_plic_alerts 95 100 95.00
chip_sw_all_escalation_resets 735.240s 8051.887us 95 100 95.00
tick_configuration 0 3 0.00
chip_sw_rv_timer_systick_test 7200.240s 0.000us 0 3 0.00
counter_wrap 0 3 0.00
chip_sw_rv_timer_systick_test 7200.240s 0.000us 0 3 0.00
chip_sw_spi_device_output_when_disabled_or_sleeping 3 3 100.00
chip_sw_spi_device_pinmux_sleep_retention 254.650s 4171.306us 3 3 100.00
chip_sw_uart_watermarks 5 5 100.00
chip_sw_uart_tx_rx 522.130s 5562.416us 5 5 100.00
chip_sw_usbdev_stream 1 1 100.00
chip_sw_usbdev_stream 3820.900s 19753.928us 1 1 100.00
Testpoint Test Max Runtime Sim Time Pass Total %
Unmapped 17 31 54.84
chip_sival_flash_info_access 300.390s 2862.117us 3 3 100.00
chip_sw_rstmgr_rst_cnsty_escalation 31.620s 10.100us 0 3 0.00
chip_sw_otp_ctrl_rot_auth_config 6.570s 0.000us 0 1 0.00
chip_sw_otp_ctrl_ecc_error_vendor_test 265.820s 3743.030us 3 3 100.00
chip_sw_otp_ctrl_descrambling 240.430s 3599.758us 3 3 100.00
chip_sw_pwrmgr_lowpower_cancel 330.850s 4315.437us 2 3 66.67
chip_sw_pwrmgr_sleep_wake_5_bug 12.172s 0.000us 0 3 0.00
chip_sw_flash_ctrl_write_clear 293.970s 4308.214us 3 3 100.00
ate_bootstrap_flash_erase 966.130s 10010.340us 0 3 0.00
ate_bootstrap_one_frame 9649.070s 44370.477us 3 3 100.00
ate_bootstrap_disjoint 10800.189s 0.000us 0 3 0.00

Error Messages

   Test seed line log context
UVM_ERROR @ * us: (sw_logger_if.sv:526) [alert_handler_lpg_sleep_mode_alerts_test_sim_dv(sw/device/lib/testing/ret_sram_testutils.c:67)] CHECK-fail: testing_utilities != ((void*)0) 90 test runs
chip_sw_alert_handler_lpg_sleep_mode_alerts 26236057740978421318865546255235925270921215891793541177496157733838988490326 308
UVM_INFO @ 4256.459120 us: (uvm_report_catcher.svh:705) [UVM/REPORT/CATCHER]
--- UVM Report catcher Summary ---
chip_sw_alert_handler_lpg_sleep_mode_alerts 73569438273651861778119930712177754919349335158702405141600511107861695020583 308
UVM_INFO @ 3280.808151 us: (uvm_report_catcher.svh:705) [UVM/REPORT/CATCHER]
--- UVM Report catcher Summary ---
chip_sw_alert_handler_lpg_sleep_mode_alerts 97929894971900895572229627786282877796424023092690486627561990953828696474312 308
UVM_INFO @ 3781.234940 us: (uvm_report_catcher.svh:705) [UVM/REPORT/CATCHER]
--- UVM Report catcher Summary ---
chip_sw_alert_handler_lpg_sleep_mode_alerts 97381271374790065981570760969158981816601233669374865228049782609349519853144 308
UVM_INFO @ 4361.011000 us: (uvm_report_catcher.svh:705) [UVM/REPORT/CATCHER]
--- UVM Report catcher Summary ---
chip_sw_alert_handler_lpg_sleep_mode_alerts 105662381953780229431239324849322557856645579983993416616862315779044011029274 308
UVM_INFO @ 3027.695640 us: (uvm_report_catcher.svh:705) [UVM/REPORT/CATCHER]
--- UVM Report catcher Summary ---
chip_sw_alert_handler_lpg_sleep_mode_alerts 114272057181951663421303407165720064995343107011129542691169437327568463785599 308
UVM_INFO @ 3770.676280 us: (uvm_report_catcher.svh:705) [UVM/REPORT/CATCHER]
--- UVM Report catcher Summary ---
chip_sw_alert_handler_lpg_sleep_mode_alerts 25335765216460413671198486449350105167254278112973445350145249506781320045041 308
UVM_INFO @ 3233.361875 us: (uvm_report_catcher.svh:705) [UVM/REPORT/CATCHER]
--- UVM Report catcher Summary ---
chip_sw_alert_handler_lpg_sleep_mode_alerts 39338323794806585919433647050883588012395508170847673662255411589695118241660 308
UVM_INFO @ 2881.649680 us: (uvm_report_catcher.svh:705) [UVM/REPORT/CATCHER]
--- UVM Report catcher Summary ---
chip_sw_alert_handler_lpg_sleep_mode_alerts 103526544234663083605583029466824418590643611184502410154946445367907519072569 308
UVM_INFO @ 3146.921328 us: (uvm_report_catcher.svh:705) [UVM/REPORT/CATCHER]
--- UVM Report catcher Summary ---
chip_sw_alert_handler_lpg_sleep_mode_alerts 55458572698533321114186446310715878595969434020729801960857320778056053441413 308
UVM_INFO @ 2615.564388 us: (uvm_report_catcher.svh:705) [UVM/REPORT/CATCHER]
--- UVM Report catcher Summary ---
chip_sw_alert_handler_lpg_sleep_mode_alerts 67963945595253581921417122972542679434029674583187219285299217438791920128637 308
UVM_INFO @ 3575.684875 us: (uvm_report_catcher.svh:705) [UVM/REPORT/CATCHER]
--- UVM Report catcher Summary ---
chip_sw_alert_handler_lpg_sleep_mode_alerts 47706760594254813266425480189573840997042191007714612329713792004860691048066 308
UVM_INFO @ 3448.630187 us: (uvm_report_catcher.svh:705) [UVM/REPORT/CATCHER]
--- UVM Report catcher Summary ---
chip_sw_alert_handler_lpg_sleep_mode_alerts 14723035198186311469586048844326651725481512948060406815007737740944033686683 308
UVM_INFO @ 3538.549051 us: (uvm_report_catcher.svh:705) [UVM/REPORT/CATCHER]
--- UVM Report catcher Summary ---
chip_sw_alert_handler_lpg_sleep_mode_alerts 97689395452815636392173540909018059501319041151119248730543238734240180813299 308
UVM_INFO @ 3615.633466 us: (uvm_report_catcher.svh:705) [UVM/REPORT/CATCHER]
--- UVM Report catcher Summary ---
chip_sw_alert_handler_lpg_sleep_mode_alerts 89332895378870968511527055353645607325731242483333202564474971686324762663237 308
UVM_INFO @ 4210.504036 us: (uvm_report_catcher.svh:705) [UVM/REPORT/CATCHER]
--- UVM Report catcher Summary ---
chip_sw_alert_handler_lpg_sleep_mode_alerts 86964212191208565725870463859617864720373484509036181773083998230389785568864 308
UVM_INFO @ 4296.568630 us: (uvm_report_catcher.svh:705) [UVM/REPORT/CATCHER]
--- UVM Report catcher Summary ---
chip_sw_alert_handler_lpg_sleep_mode_alerts 56283297153891318800351459091452298659239634866852316524847945747254733311336 308
UVM_INFO @ 3038.967840 us: (uvm_report_catcher.svh:705) [UVM/REPORT/CATCHER]
--- UVM Report catcher Summary ---
chip_sw_alert_handler_lpg_sleep_mode_alerts 64176314684452051950242533370958986043042321741263521377593908404557670363249 308
UVM_INFO @ 2457.212429 us: (uvm_report_catcher.svh:705) [UVM/REPORT/CATCHER]
--- UVM Report catcher Summary ---
chip_sw_alert_handler_lpg_sleep_mode_alerts 75161919641158220127804963789376702016986409203534041520944911003217752885183 308
UVM_INFO @ 3245.811760 us: (uvm_report_catcher.svh:705) [UVM/REPORT/CATCHER]
--- UVM Report catcher Summary ---
chip_sw_alert_handler_lpg_sleep_mode_alerts 26326909712684834833580127997455060340796089946770576845281220330615504506862 308
UVM_INFO @ 2605.682722 us: (uvm_report_catcher.svh:705) [UVM/REPORT/CATCHER]
--- UVM Report catcher Summary ---
chip_sw_alert_handler_lpg_sleep_mode_alerts 72891625534410633726183009990320654066324255780450008603454228170977032522111 308
UVM_INFO @ 2586.756070 us: (uvm_report_catcher.svh:705) [UVM/REPORT/CATCHER]
--- UVM Report catcher Summary ---
chip_sw_alert_handler_lpg_sleep_mode_alerts 34920620805497933554461168251719677233165740401407733062649222181139042284613 308
UVM_INFO @ 3202.128640 us: (uvm_report_catcher.svh:705) [UVM/REPORT/CATCHER]
--- UVM Report catcher Summary ---
chip_sw_alert_handler_lpg_sleep_mode_alerts 22545962432468061637431480585387344762487127936009484065358127776078676782889 308
UVM_INFO @ 3929.582600 us: (uvm_report_catcher.svh:705) [UVM/REPORT/CATCHER]
--- UVM Report catcher Summary ---
chip_sw_alert_handler_lpg_sleep_mode_alerts 50578047409641274039965390948454660400973135789272737222845294749613271533642 308
UVM_INFO @ 2538.035715 us: (uvm_report_catcher.svh:705) [UVM/REPORT/CATCHER]
--- UVM Report catcher Summary ---
chip_sw_alert_handler_lpg_sleep_mode_alerts 31271872997746659958297676645048433152580468602276455492793623621971457968477 308
UVM_INFO @ 3182.182150 us: (uvm_report_catcher.svh:705) [UVM/REPORT/CATCHER]
--- UVM Report catcher Summary ---
chip_sw_alert_handler_lpg_sleep_mode_alerts 98082408488461326094241178339898885427625312069563304099056137301276845149697 308
UVM_INFO @ 3312.421816 us: (uvm_report_catcher.svh:705) [UVM/REPORT/CATCHER]
--- UVM Report catcher Summary ---
chip_sw_alert_handler_lpg_sleep_mode_alerts 38178841582344827554365123825159375398048976737826232779582431553294245435654 308
UVM_INFO @ 3136.210310 us: (uvm_report_catcher.svh:705) [UVM/REPORT/CATCHER]
--- UVM Report catcher Summary ---
chip_sw_alert_handler_lpg_sleep_mode_alerts 51031486665246076820219609605646168714915412736390544616546612425415347896873 308
UVM_INFO @ 4364.892840 us: (uvm_report_catcher.svh:705) [UVM/REPORT/CATCHER]
--- UVM Report catcher Summary ---
chip_sw_alert_handler_lpg_sleep_mode_alerts 91657314455469456601344410983813009412922239908699148274861441616174887406404 308
UVM_INFO @ 2801.575804 us: (uvm_report_catcher.svh:705) [UVM/REPORT/CATCHER]
--- UVM Report catcher Summary ---
chip_sw_alert_handler_lpg_sleep_mode_alerts 80725860678955682181054430366378874036078896103949229489264314703062590498606 308
UVM_INFO @ 2894.821618 us: (uvm_report_catcher.svh:705) [UVM/REPORT/CATCHER]
--- UVM Report catcher Summary ---
chip_sw_alert_handler_lpg_sleep_mode_alerts 84375950519958398933718769046794329276448902055270988356051783024583973974901 308
UVM_INFO @ 2993.364924 us: (uvm_report_catcher.svh:705) [UVM/REPORT/CATCHER]
--- UVM Report catcher Summary ---
chip_sw_alert_handler_lpg_sleep_mode_alerts 30910512281307329336182380307046628096508547073274563702451217567713681362127 308
UVM_INFO @ 3976.326423 us: (uvm_report_catcher.svh:705) [UVM/REPORT/CATCHER]
--- UVM Report catcher Summary ---
chip_sw_alert_handler_lpg_sleep_mode_alerts 75966627907564330994657232323900452971515851941851659936204620002502941019303 308
UVM_INFO @ 3939.180129 us: (uvm_report_catcher.svh:705) [UVM/REPORT/CATCHER]
--- UVM Report catcher Summary ---
chip_sw_alert_handler_lpg_sleep_mode_alerts 61531750399948314061303073695571272403644175529652147991062026458897050328382 308
UVM_INFO @ 3063.446799 us: (uvm_report_catcher.svh:705) [UVM/REPORT/CATCHER]
--- UVM Report catcher Summary ---
chip_sw_alert_handler_lpg_sleep_mode_alerts 91499828576956220657223182880933074623505539314165656709938375606066053048621 308
UVM_INFO @ 3033.613358 us: (uvm_report_catcher.svh:705) [UVM/REPORT/CATCHER]
--- UVM Report catcher Summary ---
chip_sw_alert_handler_lpg_sleep_mode_alerts 108317255877605691374993653274435895157920236635263828006771575876051912950094 308
UVM_INFO @ 3047.974256 us: (uvm_report_catcher.svh:705) [UVM/REPORT/CATCHER]
--- UVM Report catcher Summary ---
chip_sw_alert_handler_lpg_sleep_mode_alerts 86365076671011302371677922633366161816117236222755227221324372894311292282339 308
UVM_INFO @ 3159.312694 us: (uvm_report_catcher.svh:705) [UVM/REPORT/CATCHER]
--- UVM Report catcher Summary ---
chip_sw_alert_handler_lpg_sleep_mode_alerts 19855192070454016441724656778383575332662146196838581540315840469514600088096 308
UVM_INFO @ 2972.796118 us: (uvm_report_catcher.svh:705) [UVM/REPORT/CATCHER]
--- UVM Report catcher Summary ---
chip_sw_alert_handler_lpg_sleep_mode_alerts 40446109306375786821532753251666046455819240756860501373513913791285703930694 308
UVM_INFO @ 3113.778360 us: (uvm_report_catcher.svh:705) [UVM/REPORT/CATCHER]
--- UVM Report catcher Summary ---
chip_sw_alert_handler_lpg_sleep_mode_alerts 40435181791265994875052530004938047889860290599367895599730793071194968123136 308
UVM_INFO @ 3791.379992 us: (uvm_report_catcher.svh:705) [UVM/REPORT/CATCHER]
--- UVM Report catcher Summary ---
chip_sw_alert_handler_lpg_sleep_mode_alerts 88422975274710485021057239193222013430832882082793504858377767045431895984431 308
UVM_INFO @ 3214.443924 us: (uvm_report_catcher.svh:705) [UVM/REPORT/CATCHER]
--- UVM Report catcher Summary ---
chip_sw_alert_handler_lpg_sleep_mode_alerts 82473334169561856960587064843397268182501447819464473850114377977428836468442 308
UVM_INFO @ 3215.653327 us: (uvm_report_catcher.svh:705) [UVM/REPORT/CATCHER]
--- UVM Report catcher Summary ---
chip_sw_alert_handler_lpg_sleep_mode_alerts 53709567894409731130615876502345283714927568500515537427551830963515451050652 308
UVM_INFO @ 4215.869108 us: (uvm_report_catcher.svh:705) [UVM/REPORT/CATCHER]
--- UVM Report catcher Summary ---
chip_sw_alert_handler_lpg_sleep_mode_alerts 43039921693297935327403710660708306064596448645062657755816040491671960667722 308
UVM_INFO @ 4351.920405 us: (uvm_report_catcher.svh:705) [UVM/REPORT/CATCHER]
--- UVM Report catcher Summary ---
chip_sw_alert_handler_lpg_sleep_mode_alerts 27335190940817898540336744911541669052841129920433107297878662898786729257781 308
UVM_INFO @ 4342.591592 us: (uvm_report_catcher.svh:705) [UVM/REPORT/CATCHER]
--- UVM Report catcher Summary ---
chip_sw_alert_handler_lpg_sleep_mode_alerts 12591773212669134395255408040984382391068066070357956176771146589250897438717 308
UVM_INFO @ 3184.734787 us: (uvm_report_catcher.svh:705) [UVM/REPORT/CATCHER]
--- UVM Report catcher Summary ---
chip_sw_alert_handler_lpg_sleep_mode_alerts 109225811521115959640748813526761872472432049788958981490093853256449500248494 308
UVM_INFO @ 3430.441400 us: (uvm_report_catcher.svh:705) [UVM/REPORT/CATCHER]
--- UVM Report catcher Summary ---
chip_sw_alert_handler_lpg_sleep_mode_alerts 27265440939265490109103201914604717515130350951373720562980860824633692219012 308
UVM_INFO @ 2984.243844 us: (uvm_report_catcher.svh:705) [UVM/REPORT/CATCHER]
--- UVM Report catcher Summary ---
chip_sw_alert_handler_lpg_sleep_mode_alerts 8624437971617115123418159297638292493753327759237123426125376694645435874302 308
UVM_INFO @ 3167.213578 us: (uvm_report_catcher.svh:705) [UVM/REPORT/CATCHER]
--- UVM Report catcher Summary ---
chip_sw_alert_handler_lpg_sleep_mode_alerts 92986886047785945958599806795406085348528095442499437527704058106043934969802 308
UVM_INFO @ 3793.656544 us: (uvm_report_catcher.svh:705) [UVM/REPORT/CATCHER]
--- UVM Report catcher Summary ---
chip_sw_alert_handler_lpg_sleep_mode_alerts 24363684578001874060882231785011085998777825402433409660027816387778526574633 308
UVM_INFO @ 3721.726686 us: (uvm_report_catcher.svh:705) [UVM/REPORT/CATCHER]
--- UVM Report catcher Summary ---
chip_sw_alert_handler_lpg_sleep_mode_alerts 113356951550331484282256117363555898745852181776302584247992666467844472866560 308
UVM_INFO @ 3406.013480 us: (uvm_report_catcher.svh:705) [UVM/REPORT/CATCHER]
--- UVM Report catcher Summary ---
chip_sw_alert_handler_lpg_sleep_mode_alerts 43573056958988727022011123848232537670794630529892739898459535714528720102291 308
UVM_INFO @ 3654.985764 us: (uvm_report_catcher.svh:705) [UVM/REPORT/CATCHER]
--- UVM Report catcher Summary ---
chip_sw_alert_handler_lpg_sleep_mode_alerts 28370653803833997840012364232982890185952500258786349700258192851997748620286 308
UVM_INFO @ 3425.512162 us: (uvm_report_catcher.svh:705) [UVM/REPORT/CATCHER]
--- UVM Report catcher Summary ---
chip_sw_alert_handler_lpg_sleep_mode_alerts 77788984891034890533245154317630371821871210932087926853669650621062098254557 308
UVM_INFO @ 3813.409808 us: (uvm_report_catcher.svh:705) [UVM/REPORT/CATCHER]
--- UVM Report catcher Summary ---
chip_sw_alert_handler_lpg_sleep_mode_alerts 84803042699008634099534110286758941240739243092608408318266891860350344171701 308
UVM_INFO @ 3734.632428 us: (uvm_report_catcher.svh:705) [UVM/REPORT/CATCHER]
--- UVM Report catcher Summary ---
chip_sw_alert_handler_lpg_sleep_mode_alerts 66001904400552385457911097920826510888980572072207884299403990255719759968288 308
UVM_INFO @ 3282.614118 us: (uvm_report_catcher.svh:705) [UVM/REPORT/CATCHER]
--- UVM Report catcher Summary ---
chip_sw_alert_handler_lpg_sleep_mode_alerts 79985584208973357691535678626661663049131835239965947223345457887216067895755 308
UVM_INFO @ 3069.171388 us: (uvm_report_catcher.svh:705) [UVM/REPORT/CATCHER]
--- UVM Report catcher Summary ---
chip_sw_alert_handler_lpg_sleep_mode_alerts 15678387963801394029071356264349206027651771659662726211392869433403738768908 308
UVM_INFO @ 3152.832834 us: (uvm_report_catcher.svh:705) [UVM/REPORT/CATCHER]
--- UVM Report catcher Summary ---
chip_sw_alert_handler_lpg_sleep_mode_alerts 11582111015352073056322742759862649903106501612751439949291381436609333282190 308
UVM_INFO @ 3875.151001 us: (uvm_report_catcher.svh:705) [UVM/REPORT/CATCHER]
--- UVM Report catcher Summary ---
chip_sw_alert_handler_lpg_sleep_mode_alerts 15411251548271425484655686371577663424951412470521343534328167236799137627974 308
UVM_INFO @ 3054.016764 us: (uvm_report_catcher.svh:705) [UVM/REPORT/CATCHER]
--- UVM Report catcher Summary ---
chip_sw_alert_handler_lpg_sleep_mode_alerts 10296083211221991840674899779036210420787515592016695746323982025753230093589 308
UVM_INFO @ 3945.964524 us: (uvm_report_catcher.svh:705) [UVM/REPORT/CATCHER]
--- UVM Report catcher Summary ---
chip_sw_alert_handler_lpg_sleep_mode_alerts 85011234263427704747594347045262619813870784406963734699223431886515355509841 308
UVM_INFO @ 3404.376724 us: (uvm_report_catcher.svh:705) [UVM/REPORT/CATCHER]
--- UVM Report catcher Summary ---
chip_sw_alert_handler_lpg_sleep_mode_alerts 70592741490432837302444475124314903963418195203846153896133684858059667871405 308
UVM_INFO @ 3928.836475 us: (uvm_report_catcher.svh:705) [UVM/REPORT/CATCHER]
--- UVM Report catcher Summary ---
chip_sw_alert_handler_lpg_sleep_mode_alerts 40934980104171932472589922137140480684427153559429298534423839273942372641645 308
UVM_INFO @ 3255.041002 us: (uvm_report_catcher.svh:705) [UVM/REPORT/CATCHER]
--- UVM Report catcher Summary ---
chip_sw_alert_handler_lpg_sleep_mode_alerts 11065759115211954950100414790577625881284600002582182084549914848032342306240 308
UVM_INFO @ 3804.385272 us: (uvm_report_catcher.svh:705) [UVM/REPORT/CATCHER]
--- UVM Report catcher Summary ---
chip_sw_alert_handler_lpg_sleep_mode_alerts 90691863093788361964682928222311352260177950917824383879231598468446761458847 308
UVM_INFO @ 4493.351715 us: (uvm_report_catcher.svh:705) [UVM/REPORT/CATCHER]
--- UVM Report catcher Summary ---
chip_sw_alert_handler_lpg_sleep_mode_alerts 13560866898877817068379610039574180865170555859415755931537134919567297615943 308
UVM_INFO @ 3224.671912 us: (uvm_report_catcher.svh:705) [UVM/REPORT/CATCHER]
--- UVM Report catcher Summary ---
chip_sw_alert_handler_lpg_sleep_mode_alerts 6091204407435185022098556647714098112779717180178114938437561834045705619892 308
UVM_INFO @ 3103.414840 us: (uvm_report_catcher.svh:705) [UVM/REPORT/CATCHER]
--- UVM Report catcher Summary ---
chip_sw_alert_handler_lpg_sleep_mode_alerts 10410728789083209055878234940606202380328698595017122595904632903187059990594 308
UVM_INFO @ 2610.127372 us: (uvm_report_catcher.svh:705) [UVM/REPORT/CATCHER]
--- UVM Report catcher Summary ---
chip_sw_alert_handler_lpg_sleep_mode_alerts 6272050447137083781568152989883509299755589688859827999035041881933032771566 308
UVM_INFO @ 3940.563049 us: (uvm_report_catcher.svh:705) [UVM/REPORT/CATCHER]
--- UVM Report catcher Summary ---
chip_sw_alert_handler_lpg_sleep_mode_alerts 54119684141933817736434858638486817218766892135793955297374417962498117861479 308
UVM_INFO @ 3529.611092 us: (uvm_report_catcher.svh:705) [UVM/REPORT/CATCHER]
--- UVM Report catcher Summary ---
chip_sw_alert_handler_lpg_sleep_mode_alerts 56070506425870294155258085980341382385844164583196752907454751225070709062161 308
UVM_INFO @ 4022.446337 us: (uvm_report_catcher.svh:705) [UVM/REPORT/CATCHER]
--- UVM Report catcher Summary ---
chip_sw_alert_handler_lpg_sleep_mode_alerts 108357174380310872649931113212448324700911147937523612692202712239360680387650 308
UVM_INFO @ 3903.583706 us: (uvm_report_catcher.svh:705) [UVM/REPORT/CATCHER]
--- UVM Report catcher Summary ---
chip_sw_alert_handler_lpg_sleep_mode_alerts 85042558101652482386374122617991778604969625616655833924191838356223217970274 308
UVM_INFO @ 2991.576925 us: (uvm_report_catcher.svh:705) [UVM/REPORT/CATCHER]
--- UVM Report catcher Summary ---
chip_sw_alert_handler_lpg_sleep_mode_alerts 103037244271031187733756254598129989497996036127335508931861282557674726226309 308
UVM_INFO @ 3946.671262 us: (uvm_report_catcher.svh:705) [UVM/REPORT/CATCHER]
--- UVM Report catcher Summary ---
chip_sw_alert_handler_lpg_sleep_mode_alerts 25697574231738267679127094380050128273128317776463492066238059508432371338869 308
UVM_INFO @ 3595.814204 us: (uvm_report_catcher.svh:705) [UVM/REPORT/CATCHER]
--- UVM Report catcher Summary ---
chip_sw_alert_handler_lpg_sleep_mode_alerts 7475143809516120886074926063868548703563325080905704006158686931649998220981 308
UVM_INFO @ 3508.614340 us: (uvm_report_catcher.svh:705) [UVM/REPORT/CATCHER]
--- UVM Report catcher Summary ---
chip_sw_alert_handler_lpg_sleep_mode_alerts 3612270140243878253030586038084252868478860897489716962195498665057112453347 308
UVM_INFO @ 3599.887124 us: (uvm_report_catcher.svh:705) [UVM/REPORT/CATCHER]
--- UVM Report catcher Summary ---
chip_sw_alert_handler_lpg_sleep_mode_alerts 46164008424099293821291008589637244316963271552673841125567967918685579412666 308
UVM_INFO @ 3446.829940 us: (uvm_report_catcher.svh:705) [UVM/REPORT/CATCHER]
--- UVM Report catcher Summary ---
chip_sw_alert_handler_lpg_sleep_mode_alerts 114137552787971692596212954265279356762655655004368930447731949343789572060863 308
UVM_INFO @ 2977.992514 us: (uvm_report_catcher.svh:705) [UVM/REPORT/CATCHER]
--- UVM Report catcher Summary ---
chip_sw_alert_handler_lpg_sleep_mode_alerts 60860376496973805841180304178557874438200744553468437507309017029789229491444 308
UVM_INFO @ 3598.376239 us: (uvm_report_catcher.svh:705) [UVM/REPORT/CATCHER]
--- UVM Report catcher Summary ---
chip_sw_alert_handler_lpg_sleep_mode_alerts 10876807567606279059026554567992979110191618053044453959950825412040011665788 308
UVM_INFO @ 3206.247033 us: (uvm_report_catcher.svh:705) [UVM/REPORT/CATCHER]
--- UVM Report catcher Summary ---
chip_sw_alert_handler_lpg_sleep_mode_alerts 22295323508322927473903100583547325766647839415113453567959766983312632296096 308
UVM_INFO @ 3222.140212 us: (uvm_report_catcher.svh:705) [UVM/REPORT/CATCHER]
--- UVM Report catcher Summary ---
chip_sw_alert_handler_lpg_sleep_mode_alerts 101815011878601998340972831637782135551515321671870040336273003862123178669441 308
UVM_INFO @ 3220.944936 us: (uvm_report_catcher.svh:705) [UVM/REPORT/CATCHER]
--- UVM Report catcher Summary ---
chip_sw_alert_handler_lpg_sleep_mode_alerts 110347490059901243372699556035996372097389335555717049022461309693393248964709 308
UVM_INFO @ 3371.780612 us: (uvm_report_catcher.svh:705) [UVM/REPORT/CATCHER]
--- UVM Report catcher Summary ---
chip_sw_alert_handler_lpg_sleep_mode_alerts 16328800572852113562675322614654359131462903427769253927746507768285934801097 308
UVM_INFO @ 2786.476185 us: (uvm_report_catcher.svh:705) [UVM/REPORT/CATCHER]
--- UVM Report catcher Summary ---
chip_sw_alert_handler_lpg_sleep_mode_alerts 107538605213852952737507950320035074762117945120362641321733171903721575716120 308
UVM_INFO @ 3886.126056 us: (uvm_report_catcher.svh:705) [UVM/REPORT/CATCHER]
--- UVM Report catcher Summary ---
chip_sw_alert_handler_lpg_sleep_mode_alerts 74237175039181854542099593662129781305687188080361134135422284361400783346048 308
UVM_INFO @ 3267.130280 us: (uvm_report_catcher.svh:705) [UVM/REPORT/CATCHER]
--- UVM Report catcher Summary ---
chip_sw_alert_handler_lpg_sleep_mode_alerts 71993239828625149590590903327421465009479134313442248973628752407583475649199 308
UVM_INFO @ 3296.894788 us: (uvm_report_catcher.svh:705) [UVM/REPORT/CATCHER]
--- UVM Report catcher Summary ---
Some pass patterns missing: ['^TEST PASSED (UVM_)?CHECKS$'] 42 test runs
chip_sw_pwrmgr_sleep_wake_5_bug 2026888168303627211640042192202087250328094432609523126508793930142533259471 None
---- STDERR ----
Another command (pid=3229137) is running. Waiting for it to complete on the server (server_pid=254362)...
Another command (pid=3230458) is running. Waiting for it to complete on the server (server_pid=254362)...
WARNING: Target pattern parsing failed.
ERROR: Skipping '//sw/device/tests:pwrmgr_sleep_wake_5_bug_test_sim_dv': no such target '//sw/device/tests:pwrmgr_sleep_wake_5_bug_test_sim_dv': target 'pwrmgr_sleep_wake_5_bug_test_sim_dv' not declared in package 'sw/device/tests' defined by /nightly/current_run/opentitan/sw/device/tests/BUILD
ERROR: no such target '//sw/device/tests:pwrmgr_sleep_wake_5_bug_test_sim_dv': target 'pwrmgr_sleep_wake_5_bug_test_sim_dv' not declared in package 'sw/device/tests' defined by /nightly/current_run/opentitan/sw/device/tests/BUILD
ERROR: Build did NOT complete successfully
_run_cmd -> had a non-zero return code of 1.
make: *** [/nightly/current_run/opentitan/hw/dv/tools/dvsim/sim.mk:58: sw_build] Error 1
rom_e2e_boot_policy_valid_a_good_b_good_test_unlocked0 49609007080227241422845285238873648337898224861576843747128787343037623800012 None
---- STDERR ----
Another command (pid=257534) is running. Waiting for it to complete on the server (server_pid=254362)...
Another command (pid=255460) is running. Waiting for it to complete on the server (server_pid=254362)...
WARNING: Target pattern parsing failed.
ERROR: Skipping '//sw/device/silicon_creator/rom/e2e:empty_test_slot_a_fake_ecdsa_prod_key_0_sim_dv': no such target '//sw/device/silicon_creator/rom/e2e:empty_test_slot_a_fake_ecdsa_prod_key_0_sim_dv': target 'empty_test_slot_a_fake_ecdsa_prod_key_0_sim_dv' not declared in package 'sw/device/silicon_creator/rom/e2e' defined by /nightly/current_run/opentitan/sw/device/silicon_creator/rom/e2e/BUILD
ERROR: no such target '//sw/device/silicon_creator/rom/e2e:empty_test_slot_a_fake_ecdsa_prod_key_0_sim_dv': target 'empty_test_slot_a_fake_ecdsa_prod_key_0_sim_dv' not declared in package 'sw/device/silicon_creator/rom/e2e' defined by /nightly/current_run/opentitan/sw/device/silicon_creator/rom/e2e/BUILD
ERROR: Build did NOT complete successfully
_run_cmd -> had a non-zero return code of 1.
make: *** [/nightly/current_run/opentitan/hw/dv/tools/dvsim/sim.mk:58: sw_build] Error 1
rom_e2e_boot_policy_valid_a_good_b_good_dev 64861625963674857342448010228908746121489475309667096145197861167252102567411 None
---- STDOUT ----
---- STDERR ----
WARNING: Target pattern parsing failed.
ERROR: Skipping '//sw/device/silicon_creator/rom/e2e:empty_test_slot_a_fake_ecdsa_prod_key_0_sim_dv': no such target '//sw/device/silicon_creator/rom/e2e:empty_test_slot_a_fake_ecdsa_prod_key_0_sim_dv': target 'empty_test_slot_a_fake_ecdsa_prod_key_0_sim_dv' not declared in package 'sw/device/silicon_creator/rom/e2e' defined by /nightly/current_run/opentitan/sw/device/silicon_creator/rom/e2e/BUILD
ERROR: no such target '//sw/device/silicon_creator/rom/e2e:empty_test_slot_a_fake_ecdsa_prod_key_0_sim_dv': target 'empty_test_slot_a_fake_ecdsa_prod_key_0_sim_dv' not declared in package 'sw/device/silicon_creator/rom/e2e' defined by /nightly/current_run/opentitan/sw/device/silicon_creator/rom/e2e/BUILD
ERROR: Build did NOT complete successfully
_run_cmd -> had a non-zero return code of 1.
make: *** [/nightly/current_run/opentitan/hw/dv/tools/dvsim/sim.mk:58: sw_build] Error 1
rom_e2e_boot_policy_valid_a_good_b_good_prod 81743364158465955368817974681912006470994260605677855189848716546036635471017 None
---- STDOUT ----
---- STDERR ----
WARNING: Target pattern parsing failed.
ERROR: Skipping '//sw/device/silicon_creator/rom/e2e:empty_test_slot_a_fake_ecdsa_prod_key_0_sim_dv': no such target '//sw/device/silicon_creator/rom/e2e:empty_test_slot_a_fake_ecdsa_prod_key_0_sim_dv': target 'empty_test_slot_a_fake_ecdsa_prod_key_0_sim_dv' not declared in package 'sw/device/silicon_creator/rom/e2e' defined by /nightly/current_run/opentitan/sw/device/silicon_creator/rom/e2e/BUILD
ERROR: no such target '//sw/device/silicon_creator/rom/e2e:empty_test_slot_a_fake_ecdsa_prod_key_0_sim_dv': target 'empty_test_slot_a_fake_ecdsa_prod_key_0_sim_dv' not declared in package 'sw/device/silicon_creator/rom/e2e' defined by /nightly/current_run/opentitan/sw/device/silicon_creator/rom/e2e/BUILD
ERROR: Build did NOT complete successfully
_run_cmd -> had a non-zero return code of 1.
make: *** [/nightly/current_run/opentitan/hw/dv/tools/dvsim/sim.mk:58: sw_build] Error 1
rom_e2e_boot_policy_valid_a_good_b_good_prod_end 1721243073262042983918966895552205928955681734317844325142092548557171981053 None
---- STDERR ----
Another command (pid=433136) is running. Waiting for it to complete on the server (server_pid=254362)...
WARNING: Target pattern parsing failed.
ERROR: Skipping '//sw/device/silicon_creator/rom/e2e:empty_test_slot_a_fake_ecdsa_prod_key_0_sim_dv': no such target '//sw/device/silicon_creator/rom/e2e:empty_test_slot_a_fake_ecdsa_prod_key_0_sim_dv': target 'empty_test_slot_a_fake_ecdsa_prod_key_0_sim_dv' not declared in package 'sw/device/silicon_creator/rom/e2e' defined by /nightly/current_run/opentitan/sw/device/silicon_creator/rom/e2e/BUILD
ERROR: no such target '//sw/device/silicon_creator/rom/e2e:empty_test_slot_a_fake_ecdsa_prod_key_0_sim_dv': target 'empty_test_slot_a_fake_ecdsa_prod_key_0_sim_dv' not declared in package 'sw/device/silicon_creator/rom/e2e' defined by /nightly/current_run/opentitan/sw/device/silicon_creator/rom/e2e/BUILD
ERROR: Build did NOT complete successfully
_run_cmd -> had a non-zero return code of 1.
make: *** [/nightly/current_run/opentitan/hw/dv/tools/dvsim/sim.mk:58: sw_build] Error 1
rom_e2e_boot_policy_valid_a_good_b_good_rma 83764853454277639233376868238646576636020459889911098940525775982611226266749 None
---- STDOUT ----
---- STDERR ----
WARNING: Target pattern parsing failed.
ERROR: Skipping '//sw/device/silicon_creator/rom/e2e:empty_test_slot_a_fake_ecdsa_prod_key_0_sim_dv': no such target '//sw/device/silicon_creator/rom/e2e:empty_test_slot_a_fake_ecdsa_prod_key_0_sim_dv': target 'empty_test_slot_a_fake_ecdsa_prod_key_0_sim_dv' not declared in package 'sw/device/silicon_creator/rom/e2e' defined by /nightly/current_run/opentitan/sw/device/silicon_creator/rom/e2e/BUILD
ERROR: no such target '//sw/device/silicon_creator/rom/e2e:empty_test_slot_a_fake_ecdsa_prod_key_0_sim_dv': target 'empty_test_slot_a_fake_ecdsa_prod_key_0_sim_dv' not declared in package 'sw/device/silicon_creator/rom/e2e' defined by /nightly/current_run/opentitan/sw/device/silicon_creator/rom/e2e/BUILD
ERROR: Build did NOT complete successfully
_run_cmd -> had a non-zero return code of 1.
make: *** [/nightly/current_run/opentitan/hw/dv/tools/dvsim/sim.mk:58: sw_build] Error 1
rom_e2e_boot_policy_valid_a_good_b_bad_test_unlocked0 7079139954009205747907982513013871635253051542304070117392091824858721986763 None
Another command (pid=289103) is running. Waiting for it to complete on the server (server_pid=254362)...
Another command (pid=288226) is running. Waiting for it to complete on the server (server_pid=254362)...
Another command (pid=257210) is running. Waiting for it to complete on the server (server_pid=254362)...
WARNING: Target pattern parsing failed.
ERROR: Skipping '//sw/device/silicon_creator/rom/e2e:empty_test_slot_a_fake_ecdsa_prod_key_0_sim_dv': no such target '//sw/device/silicon_creator/rom/e2e:empty_test_slot_a_fake_ecdsa_prod_key_0_sim_dv': target 'empty_test_slot_a_fake_ecdsa_prod_key_0_sim_dv' not declared in package 'sw/device/silicon_creator/rom/e2e' defined by /nightly/current_run/opentitan/sw/device/silicon_creator/rom/e2e/BUILD
ERROR: no such target '//sw/device/silicon_creator/rom/e2e:empty_test_slot_a_fake_ecdsa_prod_key_0_sim_dv': target 'empty_test_slot_a_fake_ecdsa_prod_key_0_sim_dv' not declared in package 'sw/device/silicon_creator/rom/e2e' defined by /nightly/current_run/opentitan/sw/device/silicon_creator/rom/e2e/BUILD
ERROR: Build did NOT complete successfully
_run_cmd -> had a non-zero return code of 1.
make: *** [/nightly/current_run/opentitan/hw/dv/tools/dvsim/sim.mk:58: sw_build] Error 1
rom_e2e_boot_policy_valid_a_good_b_bad_dev 55637879950096739533154568490199694606741537965254989837152793737386983032984 None
---- STDOUT ----
---- STDERR ----
WARNING: Target pattern parsing failed.
ERROR: Skipping '//sw/device/silicon_creator/rom/e2e:empty_test_slot_a_fake_ecdsa_prod_key_0_sim_dv': no such target '//sw/device/silicon_creator/rom/e2e:empty_test_slot_a_fake_ecdsa_prod_key_0_sim_dv': target 'empty_test_slot_a_fake_ecdsa_prod_key_0_sim_dv' not declared in package 'sw/device/silicon_creator/rom/e2e' defined by /nightly/current_run/opentitan/sw/device/silicon_creator/rom/e2e/BUILD
ERROR: no such target '//sw/device/silicon_creator/rom/e2e:empty_test_slot_a_fake_ecdsa_prod_key_0_sim_dv': target 'empty_test_slot_a_fake_ecdsa_prod_key_0_sim_dv' not declared in package 'sw/device/silicon_creator/rom/e2e' defined by /nightly/current_run/opentitan/sw/device/silicon_creator/rom/e2e/BUILD
ERROR: Build did NOT complete successfully
_run_cmd -> had a non-zero return code of 1.
make: *** [/nightly/current_run/opentitan/hw/dv/tools/dvsim/sim.mk:58: sw_build] Error 1
rom_e2e_boot_policy_valid_a_good_b_bad_prod 32603289487654488323716935299275784051730877963967035763323978912624547788762 None
---- STDOUT ----
---- STDERR ----
WARNING: Target pattern parsing failed.
ERROR: Skipping '//sw/device/silicon_creator/rom/e2e:empty_test_slot_a_fake_ecdsa_prod_key_0_sim_dv': no such target '//sw/device/silicon_creator/rom/e2e:empty_test_slot_a_fake_ecdsa_prod_key_0_sim_dv': target 'empty_test_slot_a_fake_ecdsa_prod_key_0_sim_dv' not declared in package 'sw/device/silicon_creator/rom/e2e' defined by /nightly/current_run/opentitan/sw/device/silicon_creator/rom/e2e/BUILD
ERROR: no such target '//sw/device/silicon_creator/rom/e2e:empty_test_slot_a_fake_ecdsa_prod_key_0_sim_dv': target 'empty_test_slot_a_fake_ecdsa_prod_key_0_sim_dv' not declared in package 'sw/device/silicon_creator/rom/e2e' defined by /nightly/current_run/opentitan/sw/device/silicon_creator/rom/e2e/BUILD
ERROR: Build did NOT complete successfully
_run_cmd -> had a non-zero return code of 1.
make: *** [/nightly/current_run/opentitan/hw/dv/tools/dvsim/sim.mk:58: sw_build] Error 1
rom_e2e_boot_policy_valid_a_good_b_bad_prod_end 88385663852452625834763832141085569285301170636523105307290670929623635094 None
---- STDOUT ----
---- STDERR ----
WARNING: Target pattern parsing failed.
ERROR: Skipping '//sw/device/silicon_creator/rom/e2e:empty_test_slot_a_fake_ecdsa_prod_key_0_sim_dv': no such target '//sw/device/silicon_creator/rom/e2e:empty_test_slot_a_fake_ecdsa_prod_key_0_sim_dv': target 'empty_test_slot_a_fake_ecdsa_prod_key_0_sim_dv' not declared in package 'sw/device/silicon_creator/rom/e2e' defined by /nightly/current_run/opentitan/sw/device/silicon_creator/rom/e2e/BUILD
ERROR: no such target '//sw/device/silicon_creator/rom/e2e:empty_test_slot_a_fake_ecdsa_prod_key_0_sim_dv': target 'empty_test_slot_a_fake_ecdsa_prod_key_0_sim_dv' not declared in package 'sw/device/silicon_creator/rom/e2e' defined by /nightly/current_run/opentitan/sw/device/silicon_creator/rom/e2e/BUILD
ERROR: Build did NOT complete successfully
_run_cmd -> had a non-zero return code of 1.
make: *** [/nightly/current_run/opentitan/hw/dv/tools/dvsim/sim.mk:58: sw_build] Error 1
rom_e2e_boot_policy_valid_a_good_b_bad_rma 84242010310345402234090437917259155509337480144452710555032155943554029014818 None
---- STDOUT ----
---- STDERR ----
WARNING: Target pattern parsing failed.
ERROR: Skipping '//sw/device/silicon_creator/rom/e2e:empty_test_slot_a_fake_ecdsa_prod_key_0_sim_dv': no such target '//sw/device/silicon_creator/rom/e2e:empty_test_slot_a_fake_ecdsa_prod_key_0_sim_dv': target 'empty_test_slot_a_fake_ecdsa_prod_key_0_sim_dv' not declared in package 'sw/device/silicon_creator/rom/e2e' defined by /nightly/current_run/opentitan/sw/device/silicon_creator/rom/e2e/BUILD
ERROR: no such target '//sw/device/silicon_creator/rom/e2e:empty_test_slot_a_fake_ecdsa_prod_key_0_sim_dv': target 'empty_test_slot_a_fake_ecdsa_prod_key_0_sim_dv' not declared in package 'sw/device/silicon_creator/rom/e2e' defined by /nightly/current_run/opentitan/sw/device/silicon_creator/rom/e2e/BUILD
ERROR: Build did NOT complete successfully
_run_cmd -> had a non-zero return code of 1.
make: *** [/nightly/current_run/opentitan/hw/dv/tools/dvsim/sim.mk:58: sw_build] Error 1
rom_e2e_boot_policy_valid_a_bad_b_good_test_unlocked0 7446894893545987286501723211869802602880641649567652231280954580962285622308 None
Another command (pid=254753) is running. Waiting for it to complete on the server (server_pid=254362)...
Another command (pid=254508) is running. Waiting for it to complete on the server (server_pid=254362)...
Another command (pid=261506) is running. Waiting for it to complete on the server (server_pid=254362)...
WARNING: Target pattern parsing failed.
ERROR: Skipping '//sw/device/silicon_creator/rom/e2e:empty_test_slot_b_fake_ecdsa_prod_key_0_sim_dv': no such target '//sw/device/silicon_creator/rom/e2e:empty_test_slot_b_fake_ecdsa_prod_key_0_sim_dv': target 'empty_test_slot_b_fake_ecdsa_prod_key_0_sim_dv' not declared in package 'sw/device/silicon_creator/rom/e2e' defined by /nightly/current_run/opentitan/sw/device/silicon_creator/rom/e2e/BUILD
ERROR: no such target '//sw/device/silicon_creator/rom/e2e:empty_test_slot_b_fake_ecdsa_prod_key_0_sim_dv': target 'empty_test_slot_b_fake_ecdsa_prod_key_0_sim_dv' not declared in package 'sw/device/silicon_creator/rom/e2e' defined by /nightly/current_run/opentitan/sw/device/silicon_creator/rom/e2e/BUILD
ERROR: Build did NOT complete successfully
_run_cmd -> had a non-zero return code of 1.
make: *** [/nightly/current_run/opentitan/hw/dv/tools/dvsim/sim.mk:58: sw_build] Error 1
rom_e2e_boot_policy_valid_a_bad_b_good_dev 113300569382161726137712521536425001146130594018113798187823185001039315570279 None
---- STDOUT ----
---- STDERR ----
WARNING: Target pattern parsing failed.
ERROR: Skipping '//sw/device/silicon_creator/rom/e2e:empty_test_slot_b_fake_ecdsa_prod_key_0_sim_dv': no such target '//sw/device/silicon_creator/rom/e2e:empty_test_slot_b_fake_ecdsa_prod_key_0_sim_dv': target 'empty_test_slot_b_fake_ecdsa_prod_key_0_sim_dv' not declared in package 'sw/device/silicon_creator/rom/e2e' defined by /nightly/current_run/opentitan/sw/device/silicon_creator/rom/e2e/BUILD
ERROR: no such target '//sw/device/silicon_creator/rom/e2e:empty_test_slot_b_fake_ecdsa_prod_key_0_sim_dv': target 'empty_test_slot_b_fake_ecdsa_prod_key_0_sim_dv' not declared in package 'sw/device/silicon_creator/rom/e2e' defined by /nightly/current_run/opentitan/sw/device/silicon_creator/rom/e2e/BUILD
ERROR: Build did NOT complete successfully
_run_cmd -> had a non-zero return code of 1.
make: *** [/nightly/current_run/opentitan/hw/dv/tools/dvsim/sim.mk:58: sw_build] Error 1
rom_e2e_boot_policy_valid_a_bad_b_good_prod 115625365426611645677490105772553499549611615152197776532320504924403610273829 None
---- STDOUT ----
---- STDERR ----
WARNING: Target pattern parsing failed.
ERROR: Skipping '//sw/device/silicon_creator/rom/e2e:empty_test_slot_b_fake_ecdsa_prod_key_0_sim_dv': no such target '//sw/device/silicon_creator/rom/e2e:empty_test_slot_b_fake_ecdsa_prod_key_0_sim_dv': target 'empty_test_slot_b_fake_ecdsa_prod_key_0_sim_dv' not declared in package 'sw/device/silicon_creator/rom/e2e' defined by /nightly/current_run/opentitan/sw/device/silicon_creator/rom/e2e/BUILD
ERROR: no such target '//sw/device/silicon_creator/rom/e2e:empty_test_slot_b_fake_ecdsa_prod_key_0_sim_dv': target 'empty_test_slot_b_fake_ecdsa_prod_key_0_sim_dv' not declared in package 'sw/device/silicon_creator/rom/e2e' defined by /nightly/current_run/opentitan/sw/device/silicon_creator/rom/e2e/BUILD
ERROR: Build did NOT complete successfully
_run_cmd -> had a non-zero return code of 1.
make: *** [/nightly/current_run/opentitan/hw/dv/tools/dvsim/sim.mk:58: sw_build] Error 1
rom_e2e_boot_policy_valid_a_bad_b_good_prod_end 98659923939688605268735903699140703789096204996006660422790749615535289591048 None
---- STDOUT ----
---- STDERR ----
WARNING: Target pattern parsing failed.
ERROR: Skipping '//sw/device/silicon_creator/rom/e2e:empty_test_slot_b_fake_ecdsa_prod_key_0_sim_dv': no such target '//sw/device/silicon_creator/rom/e2e:empty_test_slot_b_fake_ecdsa_prod_key_0_sim_dv': target 'empty_test_slot_b_fake_ecdsa_prod_key_0_sim_dv' not declared in package 'sw/device/silicon_creator/rom/e2e' defined by /nightly/current_run/opentitan/sw/device/silicon_creator/rom/e2e/BUILD
ERROR: no such target '//sw/device/silicon_creator/rom/e2e:empty_test_slot_b_fake_ecdsa_prod_key_0_sim_dv': target 'empty_test_slot_b_fake_ecdsa_prod_key_0_sim_dv' not declared in package 'sw/device/silicon_creator/rom/e2e' defined by /nightly/current_run/opentitan/sw/device/silicon_creator/rom/e2e/BUILD
ERROR: Build did NOT complete successfully
_run_cmd -> had a non-zero return code of 1.
make: *** [/nightly/current_run/opentitan/hw/dv/tools/dvsim/sim.mk:58: sw_build] Error 1
rom_e2e_boot_policy_valid_a_bad_b_good_rma 63399745829525008319524234154612181202553318085630771576951950354741436146381 None
---- STDOUT ----
---- STDERR ----
WARNING: Target pattern parsing failed.
ERROR: Skipping '//sw/device/silicon_creator/rom/e2e:empty_test_slot_b_fake_ecdsa_prod_key_0_sim_dv': no such target '//sw/device/silicon_creator/rom/e2e:empty_test_slot_b_fake_ecdsa_prod_key_0_sim_dv': target 'empty_test_slot_b_fake_ecdsa_prod_key_0_sim_dv' not declared in package 'sw/device/silicon_creator/rom/e2e' defined by /nightly/current_run/opentitan/sw/device/silicon_creator/rom/e2e/BUILD
ERROR: no such target '//sw/device/silicon_creator/rom/e2e:empty_test_slot_b_fake_ecdsa_prod_key_0_sim_dv': target 'empty_test_slot_b_fake_ecdsa_prod_key_0_sim_dv' not declared in package 'sw/device/silicon_creator/rom/e2e' defined by /nightly/current_run/opentitan/sw/device/silicon_creator/rom/e2e/BUILD
ERROR: Build did NOT complete successfully
_run_cmd -> had a non-zero return code of 1.
make: *** [/nightly/current_run/opentitan/hw/dv/tools/dvsim/sim.mk:58: sw_build] Error 1
rom_e2e_asm_init_test_unlocked0 90457632222923498954411513569598743988850403678348883204139718225974269124983 None
---- STDERR ----
Another command (pid=254354) is running. Waiting for it to complete on the server (server_pid=254362)...
WARNING: Target pattern parsing failed.
ERROR: Skipping '//sw/device/silicon_creator/rom/e2e:empty_test_slot_a_fake_ecdsa_prod_key_0_sim_dv': no such target '//sw/device/silicon_creator/rom/e2e:empty_test_slot_a_fake_ecdsa_prod_key_0_sim_dv': target 'empty_test_slot_a_fake_ecdsa_prod_key_0_sim_dv' not declared in package 'sw/device/silicon_creator/rom/e2e' defined by /nightly/current_run/opentitan/sw/device/silicon_creator/rom/e2e/BUILD
ERROR: no such target '//sw/device/silicon_creator/rom/e2e:empty_test_slot_a_fake_ecdsa_prod_key_0_sim_dv': target 'empty_test_slot_a_fake_ecdsa_prod_key_0_sim_dv' not declared in package 'sw/device/silicon_creator/rom/e2e' defined by /nightly/current_run/opentitan/sw/device/silicon_creator/rom/e2e/BUILD
ERROR: Build did NOT complete successfully
_run_cmd -> had a non-zero return code of 1.
make: *** [/nightly/current_run/opentitan/hw/dv/tools/dvsim/sim.mk:58: sw_build] Error 1
rom_e2e_asm_init_dev 40533194473331744828518269409916883852198692965279460890058361550069349349511 None
Waiting for it to complete...
Another command (pid=418999) is running. Waiting for it to complete on the server (server_pid=254362)...
WARNING: Target pattern parsing failed.
ERROR: Skipping '//sw/device/silicon_creator/rom/e2e:empty_test_slot_a_fake_ecdsa_prod_key_0_sim_dv': no such target '//sw/device/silicon_creator/rom/e2e:empty_test_slot_a_fake_ecdsa_prod_key_0_sim_dv': target 'empty_test_slot_a_fake_ecdsa_prod_key_0_sim_dv' not declared in package 'sw/device/silicon_creator/rom/e2e' defined by /nightly/current_run/opentitan/sw/device/silicon_creator/rom/e2e/BUILD
ERROR: no such target '//sw/device/silicon_creator/rom/e2e:empty_test_slot_a_fake_ecdsa_prod_key_0_sim_dv': target 'empty_test_slot_a_fake_ecdsa_prod_key_0_sim_dv' not declared in package 'sw/device/silicon_creator/rom/e2e' defined by /nightly/current_run/opentitan/sw/device/silicon_creator/rom/e2e/BUILD
ERROR: Build did NOT complete successfully
_run_cmd -> had a non-zero return code of 1.
make: *** [/nightly/current_run/opentitan/hw/dv/tools/dvsim/sim.mk:58: sw_build] Error 1
rom_e2e_asm_init_prod 113467957740004349249976632555756330661034111412241423073324181116389816647571 None
---- STDOUT ----
---- STDERR ----
WARNING: Target pattern parsing failed.
ERROR: Skipping '//sw/device/silicon_creator/rom/e2e:empty_test_slot_a_fake_ecdsa_prod_key_0_sim_dv': no such target '//sw/device/silicon_creator/rom/e2e:empty_test_slot_a_fake_ecdsa_prod_key_0_sim_dv': target 'empty_test_slot_a_fake_ecdsa_prod_key_0_sim_dv' not declared in package 'sw/device/silicon_creator/rom/e2e' defined by /nightly/current_run/opentitan/sw/device/silicon_creator/rom/e2e/BUILD
ERROR: no such target '//sw/device/silicon_creator/rom/e2e:empty_test_slot_a_fake_ecdsa_prod_key_0_sim_dv': target 'empty_test_slot_a_fake_ecdsa_prod_key_0_sim_dv' not declared in package 'sw/device/silicon_creator/rom/e2e' defined by /nightly/current_run/opentitan/sw/device/silicon_creator/rom/e2e/BUILD
ERROR: Build did NOT complete successfully
_run_cmd -> had a non-zero return code of 1.
make: *** [/nightly/current_run/opentitan/hw/dv/tools/dvsim/sim.mk:58: sw_build] Error 1
rom_e2e_asm_init_prod_end 2926553396855070043333665897356588230493846310838583561215687109994376926549 None
---- STDOUT ----
---- STDERR ----
WARNING: Target pattern parsing failed.
ERROR: Skipping '//sw/device/silicon_creator/rom/e2e:empty_test_slot_a_fake_ecdsa_prod_key_0_sim_dv': no such target '//sw/device/silicon_creator/rom/e2e:empty_test_slot_a_fake_ecdsa_prod_key_0_sim_dv': target 'empty_test_slot_a_fake_ecdsa_prod_key_0_sim_dv' not declared in package 'sw/device/silicon_creator/rom/e2e' defined by /nightly/current_run/opentitan/sw/device/silicon_creator/rom/e2e/BUILD
ERROR: no such target '//sw/device/silicon_creator/rom/e2e:empty_test_slot_a_fake_ecdsa_prod_key_0_sim_dv': target 'empty_test_slot_a_fake_ecdsa_prod_key_0_sim_dv' not declared in package 'sw/device/silicon_creator/rom/e2e' defined by /nightly/current_run/opentitan/sw/device/silicon_creator/rom/e2e/BUILD
ERROR: Build did NOT complete successfully
_run_cmd -> had a non-zero return code of 1.
make: *** [/nightly/current_run/opentitan/hw/dv/tools/dvsim/sim.mk:58: sw_build] Error 1
rom_e2e_asm_init_rma 53834404523270955657747946231042460914318518150532974386585779644602677959708 None
---- STDOUT ----
---- STDERR ----
WARNING: Target pattern parsing failed.
ERROR: Skipping '//sw/device/silicon_creator/rom/e2e:empty_test_slot_a_fake_ecdsa_prod_key_0_sim_dv': no such target '//sw/device/silicon_creator/rom/e2e:empty_test_slot_a_fake_ecdsa_prod_key_0_sim_dv': target 'empty_test_slot_a_fake_ecdsa_prod_key_0_sim_dv' not declared in package 'sw/device/silicon_creator/rom/e2e' defined by /nightly/current_run/opentitan/sw/device/silicon_creator/rom/e2e/BUILD
ERROR: no such target '//sw/device/silicon_creator/rom/e2e:empty_test_slot_a_fake_ecdsa_prod_key_0_sim_dv': target 'empty_test_slot_a_fake_ecdsa_prod_key_0_sim_dv' not declared in package 'sw/device/silicon_creator/rom/e2e' defined by /nightly/current_run/opentitan/sw/device/silicon_creator/rom/e2e/BUILD
ERROR: Build did NOT complete successfully
_run_cmd -> had a non-zero return code of 1.
make: *** [/nightly/current_run/opentitan/hw/dv/tools/dvsim/sim.mk:58: sw_build] Error 1
rom_volatile_raw_unlock 25607199034103718066424191212217984408204308341265758408339071790855513968231 None
Another command (pid=279941) is running. Waiting for it to complete on the server (server_pid=254362)...
Another command (pid=280448) is running. Waiting for it to complete on the server (server_pid=254362)...
Another command (pid=279829) is running. Waiting for it to complete on the server (server_pid=254362)...
WARNING: Target pattern parsing failed.
ERROR: Skipping '//sw/device/silicon_creator/rom/e2e:empty_test_slot_a_fake_ecdsa_test_key_0_sim_dv': no such target '//sw/device/silicon_creator/rom/e2e:empty_test_slot_a_fake_ecdsa_test_key_0_sim_dv': target 'empty_test_slot_a_fake_ecdsa_test_key_0_sim_dv' not declared in package 'sw/device/silicon_creator/rom/e2e' defined by /nightly/current_run/opentitan/sw/device/silicon_creator/rom/e2e/BUILD
ERROR: no such target '//sw/device/silicon_creator/rom/e2e:empty_test_slot_a_fake_ecdsa_test_key_0_sim_dv': target 'empty_test_slot_a_fake_ecdsa_test_key_0_sim_dv' not declared in package 'sw/device/silicon_creator/rom/e2e' defined by /nightly/current_run/opentitan/sw/device/silicon_creator/rom/e2e/BUILD
ERROR: Build did NOT complete successfully
_run_cmd -> had a non-zero return code of 1.
make: *** [/nightly/current_run/opentitan/hw/dv/tools/dvsim/sim.mk:58: sw_build] Error 1
rom_raw_unlock 47365412652776231744365936900030251022496150867615869008202712904725845733221 None
Another command (pid=260820) is running. Waiting for it to complete on the server (server_pid=254362)...
Another command (pid=260640) is running. Waiting for it to complete on the server (server_pid=254362)...
Another command (pid=258954) is running. Waiting for it to complete on the server (server_pid=254362)...
WARNING: Target pattern parsing failed.
ERROR: Skipping '//sw/device/silicon_creator/rom/e2e:empty_test_slot_a_fake_ecdsa_test_key_0_sim_dv': no such target '//sw/device/silicon_creator/rom/e2e:empty_test_slot_a_fake_ecdsa_test_key_0_sim_dv': target 'empty_test_slot_a_fake_ecdsa_test_key_0_sim_dv' not declared in package 'sw/device/silicon_creator/rom/e2e' defined by /nightly/current_run/opentitan/sw/device/silicon_creator/rom/e2e/BUILD
ERROR: no such target '//sw/device/silicon_creator/rom/e2e:empty_test_slot_a_fake_ecdsa_test_key_0_sim_dv': target 'empty_test_slot_a_fake_ecdsa_test_key_0_sim_dv' not declared in package 'sw/device/silicon_creator/rom/e2e' defined by /nightly/current_run/opentitan/sw/device/silicon_creator/rom/e2e/BUILD
ERROR: Build did NOT complete successfully
_run_cmd -> had a non-zero return code of 1.
make: *** [/nightly/current_run/opentitan/hw/dv/tools/dvsim/sim.mk:58: sw_build] Error 1
rom_e2e_self_hash 90008286236895298139374666929872528863743042625311862164012569010260250853208 None
Another command (pid=254508) is running. Waiting for it to complete on the server (server_pid=254362)...
Another command (pid=261506) is running. Waiting for it to complete on the server (server_pid=254362)...
Another command (pid=260820) is running. Waiting for it to complete on the server (server_pid=254362)...
WARNING: Target pattern parsing failed.
ERROR: Skipping '//sw/device/silicon_creator/rom/e2e/release:rom_e2e_self_hash_test_sim_dv': no such target '//sw/device/silicon_creator/rom/e2e/release:rom_e2e_self_hash_test_sim_dv': target 'rom_e2e_self_hash_test_sim_dv' not declared in package 'sw/device/silicon_creator/rom/e2e/release' defined by /nightly/current_run/opentitan/sw/device/silicon_creator/rom/e2e/release/BUILD
ERROR: no such target '//sw/device/silicon_creator/rom/e2e/release:rom_e2e_self_hash_test_sim_dv': target 'rom_e2e_self_hash_test_sim_dv' not declared in package 'sw/device/silicon_creator/rom/e2e/release' defined by /nightly/current_run/opentitan/sw/device/silicon_creator/rom/e2e/release/BUILD
ERROR: Build did NOT complete successfully
_run_cmd -> had a non-zero return code of 1.
make: *** [/nightly/current_run/opentitan/hw/dv/tools/dvsim/sim.mk:58: sw_build] Error 1
chip_sw_pwrmgr_sleep_wake_5_bug 2342190066028538969313734531013539036883572470420421220529591855989798979981 None
---- STDOUT ----
---- STDERR ----
WARNING: Target pattern parsing failed.
ERROR: Skipping '//sw/device/tests:pwrmgr_sleep_wake_5_bug_test_sim_dv': no such target '//sw/device/tests:pwrmgr_sleep_wake_5_bug_test_sim_dv': target 'pwrmgr_sleep_wake_5_bug_test_sim_dv' not declared in package 'sw/device/tests' defined by /nightly/current_run/opentitan/sw/device/tests/BUILD
ERROR: no such target '//sw/device/tests:pwrmgr_sleep_wake_5_bug_test_sim_dv': target 'pwrmgr_sleep_wake_5_bug_test_sim_dv' not declared in package 'sw/device/tests' defined by /nightly/current_run/opentitan/sw/device/tests/BUILD
ERROR: Build did NOT complete successfully
_run_cmd -> had a non-zero return code of 1.
make: *** [/nightly/current_run/opentitan/hw/dv/tools/dvsim/sim.mk:58: sw_build] Error 1
rom_e2e_asm_init_test_unlocked0 14993032235527542488984253255051848611788023939341567710976785246130803199770 None
---- STDERR ----
Another command (pid=282979) is running. Waiting for it to complete on the server (server_pid=254362)...
Another command (pid=281810) is running. Waiting for it to complete on the server (server_pid=254362)...
WARNING: Target pattern parsing failed.
ERROR: Skipping '//sw/device/silicon_creator/rom/e2e:empty_test_slot_a_fake_ecdsa_prod_key_0_sim_dv': no such target '//sw/device/silicon_creator/rom/e2e:empty_test_slot_a_fake_ecdsa_prod_key_0_sim_dv': target 'empty_test_slot_a_fake_ecdsa_prod_key_0_sim_dv' not declared in package 'sw/device/silicon_creator/rom/e2e' defined by /nightly/current_run/opentitan/sw/device/silicon_creator/rom/e2e/BUILD
ERROR: no such target '//sw/device/silicon_creator/rom/e2e:empty_test_slot_a_fake_ecdsa_prod_key_0_sim_dv': target 'empty_test_slot_a_fake_ecdsa_prod_key_0_sim_dv' not declared in package 'sw/device/silicon_creator/rom/e2e' defined by /nightly/current_run/opentitan/sw/device/silicon_creator/rom/e2e/BUILD
ERROR: Build did NOT complete successfully
_run_cmd -> had a non-zero return code of 1.
make: *** [/nightly/current_run/opentitan/hw/dv/tools/dvsim/sim.mk:58: sw_build] Error 1
rom_e2e_asm_init_dev 49430400044066760020015359980336897060476311298767114675843040046791858923226 None
---- STDERR ----
Another command (pid=434035) is running. Waiting for it to complete on the server (server_pid=254362)...
WARNING: Target pattern parsing failed.
ERROR: Skipping '//sw/device/silicon_creator/rom/e2e:empty_test_slot_a_fake_ecdsa_prod_key_0_sim_dv': no such target '//sw/device/silicon_creator/rom/e2e:empty_test_slot_a_fake_ecdsa_prod_key_0_sim_dv': target 'empty_test_slot_a_fake_ecdsa_prod_key_0_sim_dv' not declared in package 'sw/device/silicon_creator/rom/e2e' defined by /nightly/current_run/opentitan/sw/device/silicon_creator/rom/e2e/BUILD
ERROR: no such target '//sw/device/silicon_creator/rom/e2e:empty_test_slot_a_fake_ecdsa_prod_key_0_sim_dv': target 'empty_test_slot_a_fake_ecdsa_prod_key_0_sim_dv' not declared in package 'sw/device/silicon_creator/rom/e2e' defined by /nightly/current_run/opentitan/sw/device/silicon_creator/rom/e2e/BUILD
ERROR: Build did NOT complete successfully
_run_cmd -> had a non-zero return code of 1.
make: *** [/nightly/current_run/opentitan/hw/dv/tools/dvsim/sim.mk:58: sw_build] Error 1
rom_e2e_asm_init_prod 21592214365194635309660493196075612217089432197596864603386649025208595616847 None
---- STDERR ----
Another command (pid=434289) is running. Waiting for it to complete on the server (server_pid=254362)...
WARNING: Target pattern parsing failed.
ERROR: Skipping '//sw/device/silicon_creator/rom/e2e:empty_test_slot_a_fake_ecdsa_prod_key_0_sim_dv': no such target '//sw/device/silicon_creator/rom/e2e:empty_test_slot_a_fake_ecdsa_prod_key_0_sim_dv': target 'empty_test_slot_a_fake_ecdsa_prod_key_0_sim_dv' not declared in package 'sw/device/silicon_creator/rom/e2e' defined by /nightly/current_run/opentitan/sw/device/silicon_creator/rom/e2e/BUILD
ERROR: no such target '//sw/device/silicon_creator/rom/e2e:empty_test_slot_a_fake_ecdsa_prod_key_0_sim_dv': target 'empty_test_slot_a_fake_ecdsa_prod_key_0_sim_dv' not declared in package 'sw/device/silicon_creator/rom/e2e' defined by /nightly/current_run/opentitan/sw/device/silicon_creator/rom/e2e/BUILD
ERROR: Build did NOT complete successfully
_run_cmd -> had a non-zero return code of 1.
make: *** [/nightly/current_run/opentitan/hw/dv/tools/dvsim/sim.mk:58: sw_build] Error 1
rom_e2e_asm_init_prod_end 76099897845218218962862884170833339504351884137147253954742847207751612000220 None
---- STDOUT ----
---- STDERR ----
WARNING: Target pattern parsing failed.
ERROR: Skipping '//sw/device/silicon_creator/rom/e2e:empty_test_slot_a_fake_ecdsa_prod_key_0_sim_dv': no such target '//sw/device/silicon_creator/rom/e2e:empty_test_slot_a_fake_ecdsa_prod_key_0_sim_dv': target 'empty_test_slot_a_fake_ecdsa_prod_key_0_sim_dv' not declared in package 'sw/device/silicon_creator/rom/e2e' defined by /nightly/current_run/opentitan/sw/device/silicon_creator/rom/e2e/BUILD
ERROR: no such target '//sw/device/silicon_creator/rom/e2e:empty_test_slot_a_fake_ecdsa_prod_key_0_sim_dv': target 'empty_test_slot_a_fake_ecdsa_prod_key_0_sim_dv' not declared in package 'sw/device/silicon_creator/rom/e2e' defined by /nightly/current_run/opentitan/sw/device/silicon_creator/rom/e2e/BUILD
ERROR: Build did NOT complete successfully
_run_cmd -> had a non-zero return code of 1.
make: *** [/nightly/current_run/opentitan/hw/dv/tools/dvsim/sim.mk:58: sw_build] Error 1
rom_e2e_asm_init_rma 61132086366600241023150451179748489848549358732246970289297853090093562278893 None
---- STDOUT ----
---- STDERR ----
WARNING: Target pattern parsing failed.
ERROR: Skipping '//sw/device/silicon_creator/rom/e2e:empty_test_slot_a_fake_ecdsa_prod_key_0_sim_dv': no such target '//sw/device/silicon_creator/rom/e2e:empty_test_slot_a_fake_ecdsa_prod_key_0_sim_dv': target 'empty_test_slot_a_fake_ecdsa_prod_key_0_sim_dv' not declared in package 'sw/device/silicon_creator/rom/e2e' defined by /nightly/current_run/opentitan/sw/device/silicon_creator/rom/e2e/BUILD
ERROR: no such target '//sw/device/silicon_creator/rom/e2e:empty_test_slot_a_fake_ecdsa_prod_key_0_sim_dv': target 'empty_test_slot_a_fake_ecdsa_prod_key_0_sim_dv' not declared in package 'sw/device/silicon_creator/rom/e2e' defined by /nightly/current_run/opentitan/sw/device/silicon_creator/rom/e2e/BUILD
ERROR: Build did NOT complete successfully
_run_cmd -> had a non-zero return code of 1.
make: *** [/nightly/current_run/opentitan/hw/dv/tools/dvsim/sim.mk:58: sw_build] Error 1
rom_volatile_raw_unlock 32545486581829444109516467185954799015223469774671104224022309455016028724321 None
Another command (pid=295396) is running. Waiting for it to complete on the server (server_pid=254362)...
Another command (pid=284018) is running. Waiting for it to complete on the server (server_pid=254362)...
Another command (pid=294835) is running. Waiting for it to complete on the server (server_pid=254362)...
WARNING: Target pattern parsing failed.
ERROR: Skipping '//sw/device/silicon_creator/rom/e2e:empty_test_slot_a_fake_ecdsa_test_key_0_sim_dv': no such target '//sw/device/silicon_creator/rom/e2e:empty_test_slot_a_fake_ecdsa_test_key_0_sim_dv': target 'empty_test_slot_a_fake_ecdsa_test_key_0_sim_dv' not declared in package 'sw/device/silicon_creator/rom/e2e' defined by /nightly/current_run/opentitan/sw/device/silicon_creator/rom/e2e/BUILD
ERROR: no such target '//sw/device/silicon_creator/rom/e2e:empty_test_slot_a_fake_ecdsa_test_key_0_sim_dv': target 'empty_test_slot_a_fake_ecdsa_test_key_0_sim_dv' not declared in package 'sw/device/silicon_creator/rom/e2e' defined by /nightly/current_run/opentitan/sw/device/silicon_creator/rom/e2e/BUILD
ERROR: Build did NOT complete successfully
_run_cmd -> had a non-zero return code of 1.
make: *** [/nightly/current_run/opentitan/hw/dv/tools/dvsim/sim.mk:58: sw_build] Error 1
rom_raw_unlock 47225683194511804820722958023460479637688485144299594392013900484096684917297 None
Another command (pid=287196) is running. Waiting for it to complete on the server (server_pid=254362)...
Another command (pid=269388) is running. Waiting for it to complete on the server (server_pid=254362)...
Another command (pid=289103) is running. Waiting for it to complete on the server (server_pid=254362)...
WARNING: Target pattern parsing failed.
ERROR: Skipping '//sw/device/silicon_creator/rom/e2e:empty_test_slot_a_fake_ecdsa_test_key_0_sim_dv': no such target '//sw/device/silicon_creator/rom/e2e:empty_test_slot_a_fake_ecdsa_test_key_0_sim_dv': target 'empty_test_slot_a_fake_ecdsa_test_key_0_sim_dv' not declared in package 'sw/device/silicon_creator/rom/e2e' defined by /nightly/current_run/opentitan/sw/device/silicon_creator/rom/e2e/BUILD
ERROR: no such target '//sw/device/silicon_creator/rom/e2e:empty_test_slot_a_fake_ecdsa_test_key_0_sim_dv': target 'empty_test_slot_a_fake_ecdsa_test_key_0_sim_dv' not declared in package 'sw/device/silicon_creator/rom/e2e' defined by /nightly/current_run/opentitan/sw/device/silicon_creator/rom/e2e/BUILD
ERROR: Build did NOT complete successfully
_run_cmd -> had a non-zero return code of 1.
make: *** [/nightly/current_run/opentitan/hw/dv/tools/dvsim/sim.mk:58: sw_build] Error 1
rom_e2e_self_hash 8890721969460126323126230312280597153707820882714460535839072290822191890622 None
Another command (pid=297024) is running. Waiting for it to complete on the server (server_pid=254362)...
Another command (pid=294414) is running. Waiting for it to complete on the server (server_pid=254362)...
Another command (pid=299156) is running. Waiting for it to complete on the server (server_pid=254362)...
WARNING: Target pattern parsing failed.
ERROR: Skipping '//sw/device/silicon_creator/rom/e2e/release:rom_e2e_self_hash_test_sim_dv': no such target '//sw/device/silicon_creator/rom/e2e/release:rom_e2e_self_hash_test_sim_dv': target 'rom_e2e_self_hash_test_sim_dv' not declared in package 'sw/device/silicon_creator/rom/e2e/release' defined by /nightly/current_run/opentitan/sw/device/silicon_creator/rom/e2e/release/BUILD
ERROR: no such target '//sw/device/silicon_creator/rom/e2e/release:rom_e2e_self_hash_test_sim_dv': target 'rom_e2e_self_hash_test_sim_dv' not declared in package 'sw/device/silicon_creator/rom/e2e/release' defined by /nightly/current_run/opentitan/sw/device/silicon_creator/rom/e2e/release/BUILD
ERROR: Build did NOT complete successfully
_run_cmd -> had a non-zero return code of 1.
make: *** [/nightly/current_run/opentitan/hw/dv/tools/dvsim/sim.mk:58: sw_build] Error 1
chip_sw_pwrmgr_sleep_wake_5_bug 40451306949442054525448962730684153977538378101891877028259287375300265621311 None
---- STDERR ----
Another command (pid=932056) is running. Waiting for it to complete on the server (server_pid=254362)...
WARNING: Target pattern parsing failed.
ERROR: Skipping '//sw/device/tests:pwrmgr_sleep_wake_5_bug_test_sim_dv': no such target '//sw/device/tests:pwrmgr_sleep_wake_5_bug_test_sim_dv': target 'pwrmgr_sleep_wake_5_bug_test_sim_dv' not declared in package 'sw/device/tests' defined by /nightly/current_run/opentitan/sw/device/tests/BUILD
ERROR: no such target '//sw/device/tests:pwrmgr_sleep_wake_5_bug_test_sim_dv': target 'pwrmgr_sleep_wake_5_bug_test_sim_dv' not declared in package 'sw/device/tests' defined by /nightly/current_run/opentitan/sw/device/tests/BUILD
ERROR: Build did NOT complete successfully
_run_cmd -> had a non-zero return code of 1.
make: *** [/nightly/current_run/opentitan/hw/dv/tools/dvsim/sim.mk:58: sw_build] Error 1
rom_e2e_asm_init_test_unlocked0 80666875522942608992269201329058460794425499715600748279571358668090692729293 None
Another command (pid=311934) is running. Waiting for it to complete on the server (server_pid=254362)...
Another command (pid=313009) is running. Waiting for it to complete on the server (server_pid=254362)...
Another command (pid=299080) is running. Waiting for it to complete on the server (server_pid=254362)...
WARNING: Target pattern parsing failed.
ERROR: Skipping '//sw/device/silicon_creator/rom/e2e:empty_test_slot_a_fake_ecdsa_prod_key_0_sim_dv': no such target '//sw/device/silicon_creator/rom/e2e:empty_test_slot_a_fake_ecdsa_prod_key_0_sim_dv': target 'empty_test_slot_a_fake_ecdsa_prod_key_0_sim_dv' not declared in package 'sw/device/silicon_creator/rom/e2e' defined by /nightly/current_run/opentitan/sw/device/silicon_creator/rom/e2e/BUILD
ERROR: no such target '//sw/device/silicon_creator/rom/e2e:empty_test_slot_a_fake_ecdsa_prod_key_0_sim_dv': target 'empty_test_slot_a_fake_ecdsa_prod_key_0_sim_dv' not declared in package 'sw/device/silicon_creator/rom/e2e' defined by /nightly/current_run/opentitan/sw/device/silicon_creator/rom/e2e/BUILD
ERROR: Build did NOT complete successfully
_run_cmd -> had a non-zero return code of 1.
make: *** [/nightly/current_run/opentitan/hw/dv/tools/dvsim/sim.mk:58: sw_build] Error 1
rom_e2e_asm_init_dev 83171225168552315881885715388150375111744589061907721941201610310837233427043 None
---- STDOUT ----
---- STDERR ----
WARNING: Target pattern parsing failed.
ERROR: Skipping '//sw/device/silicon_creator/rom/e2e:empty_test_slot_a_fake_ecdsa_prod_key_0_sim_dv': no such target '//sw/device/silicon_creator/rom/e2e:empty_test_slot_a_fake_ecdsa_prod_key_0_sim_dv': target 'empty_test_slot_a_fake_ecdsa_prod_key_0_sim_dv' not declared in package 'sw/device/silicon_creator/rom/e2e' defined by /nightly/current_run/opentitan/sw/device/silicon_creator/rom/e2e/BUILD
ERROR: no such target '//sw/device/silicon_creator/rom/e2e:empty_test_slot_a_fake_ecdsa_prod_key_0_sim_dv': target 'empty_test_slot_a_fake_ecdsa_prod_key_0_sim_dv' not declared in package 'sw/device/silicon_creator/rom/e2e' defined by /nightly/current_run/opentitan/sw/device/silicon_creator/rom/e2e/BUILD
ERROR: Build did NOT complete successfully
_run_cmd -> had a non-zero return code of 1.
make: *** [/nightly/current_run/opentitan/hw/dv/tools/dvsim/sim.mk:58: sw_build] Error 1
rom_e2e_asm_init_prod 89127271668068924889626242987351714768904162500817770977800532535226024639933 None
---- STDOUT ----
---- STDERR ----
WARNING: Target pattern parsing failed.
ERROR: Skipping '//sw/device/silicon_creator/rom/e2e:empty_test_slot_a_fake_ecdsa_prod_key_0_sim_dv': no such target '//sw/device/silicon_creator/rom/e2e:empty_test_slot_a_fake_ecdsa_prod_key_0_sim_dv': target 'empty_test_slot_a_fake_ecdsa_prod_key_0_sim_dv' not declared in package 'sw/device/silicon_creator/rom/e2e' defined by /nightly/current_run/opentitan/sw/device/silicon_creator/rom/e2e/BUILD
ERROR: no such target '//sw/device/silicon_creator/rom/e2e:empty_test_slot_a_fake_ecdsa_prod_key_0_sim_dv': target 'empty_test_slot_a_fake_ecdsa_prod_key_0_sim_dv' not declared in package 'sw/device/silicon_creator/rom/e2e' defined by /nightly/current_run/opentitan/sw/device/silicon_creator/rom/e2e/BUILD
ERROR: Build did NOT complete successfully
_run_cmd -> had a non-zero return code of 1.
make: *** [/nightly/current_run/opentitan/hw/dv/tools/dvsim/sim.mk:58: sw_build] Error 1
rom_e2e_asm_init_prod_end 72309647002235824954571661290995235356695173050500814228889095489598138958316 None
---- STDOUT ----
---- STDERR ----
WARNING: Target pattern parsing failed.
ERROR: Skipping '//sw/device/silicon_creator/rom/e2e:empty_test_slot_a_fake_ecdsa_prod_key_0_sim_dv': no such target '//sw/device/silicon_creator/rom/e2e:empty_test_slot_a_fake_ecdsa_prod_key_0_sim_dv': target 'empty_test_slot_a_fake_ecdsa_prod_key_0_sim_dv' not declared in package 'sw/device/silicon_creator/rom/e2e' defined by /nightly/current_run/opentitan/sw/device/silicon_creator/rom/e2e/BUILD
ERROR: no such target '//sw/device/silicon_creator/rom/e2e:empty_test_slot_a_fake_ecdsa_prod_key_0_sim_dv': target 'empty_test_slot_a_fake_ecdsa_prod_key_0_sim_dv' not declared in package 'sw/device/silicon_creator/rom/e2e' defined by /nightly/current_run/opentitan/sw/device/silicon_creator/rom/e2e/BUILD
ERROR: Build did NOT complete successfully
_run_cmd -> had a non-zero return code of 1.
make: *** [/nightly/current_run/opentitan/hw/dv/tools/dvsim/sim.mk:58: sw_build] Error 1
rom_e2e_asm_init_rma 56315912951218077801993204970307195029799958648353669541808825546605939714172 None
---- STDOUT ----
---- STDERR ----
WARNING: Target pattern parsing failed.
ERROR: Skipping '//sw/device/silicon_creator/rom/e2e:empty_test_slot_a_fake_ecdsa_prod_key_0_sim_dv': no such target '//sw/device/silicon_creator/rom/e2e:empty_test_slot_a_fake_ecdsa_prod_key_0_sim_dv': target 'empty_test_slot_a_fake_ecdsa_prod_key_0_sim_dv' not declared in package 'sw/device/silicon_creator/rom/e2e' defined by /nightly/current_run/opentitan/sw/device/silicon_creator/rom/e2e/BUILD
ERROR: no such target '//sw/device/silicon_creator/rom/e2e:empty_test_slot_a_fake_ecdsa_prod_key_0_sim_dv': target 'empty_test_slot_a_fake_ecdsa_prod_key_0_sim_dv' not declared in package 'sw/device/silicon_creator/rom/e2e' defined by /nightly/current_run/opentitan/sw/device/silicon_creator/rom/e2e/BUILD
ERROR: Build did NOT complete successfully
_run_cmd -> had a non-zero return code of 1.
make: *** [/nightly/current_run/opentitan/hw/dv/tools/dvsim/sim.mk:58: sw_build] Error 1
rom_volatile_raw_unlock 24665058651814559772600003934902231821253236370301771966328641639088585660474 None
Another command (pid=311934) is running. Waiting for it to complete on the server (server_pid=254362)...
Another command (pid=313009) is running. Waiting for it to complete on the server (server_pid=254362)...
Another command (pid=299080) is running. Waiting for it to complete on the server (server_pid=254362)...
WARNING: Target pattern parsing failed.
ERROR: Skipping '//sw/device/silicon_creator/rom/e2e:empty_test_slot_a_fake_ecdsa_test_key_0_sim_dv': no such target '//sw/device/silicon_creator/rom/e2e:empty_test_slot_a_fake_ecdsa_test_key_0_sim_dv': target 'empty_test_slot_a_fake_ecdsa_test_key_0_sim_dv' not declared in package 'sw/device/silicon_creator/rom/e2e' defined by /nightly/current_run/opentitan/sw/device/silicon_creator/rom/e2e/BUILD
ERROR: no such target '//sw/device/silicon_creator/rom/e2e:empty_test_slot_a_fake_ecdsa_test_key_0_sim_dv': target 'empty_test_slot_a_fake_ecdsa_test_key_0_sim_dv' not declared in package 'sw/device/silicon_creator/rom/e2e' defined by /nightly/current_run/opentitan/sw/device/silicon_creator/rom/e2e/BUILD
ERROR: Build did NOT complete successfully
_run_cmd -> had a non-zero return code of 1.
make: *** [/nightly/current_run/opentitan/hw/dv/tools/dvsim/sim.mk:58: sw_build] Error 1
rom_raw_unlock 14203534481752822761346378663395987043890846992855518380050456249079673272598 None
Another command (pid=312853) is running. Waiting for it to complete on the server (server_pid=254362)...
Another command (pid=311934) is running. Waiting for it to complete on the server (server_pid=254362)...
Another command (pid=313009) is running. Waiting for it to complete on the server (server_pid=254362)...
WARNING: Target pattern parsing failed.
ERROR: Skipping '//sw/device/silicon_creator/rom/e2e:empty_test_slot_a_fake_ecdsa_test_key_0_sim_dv': no such target '//sw/device/silicon_creator/rom/e2e:empty_test_slot_a_fake_ecdsa_test_key_0_sim_dv': target 'empty_test_slot_a_fake_ecdsa_test_key_0_sim_dv' not declared in package 'sw/device/silicon_creator/rom/e2e' defined by /nightly/current_run/opentitan/sw/device/silicon_creator/rom/e2e/BUILD
ERROR: no such target '//sw/device/silicon_creator/rom/e2e:empty_test_slot_a_fake_ecdsa_test_key_0_sim_dv': target 'empty_test_slot_a_fake_ecdsa_test_key_0_sim_dv' not declared in package 'sw/device/silicon_creator/rom/e2e' defined by /nightly/current_run/opentitan/sw/device/silicon_creator/rom/e2e/BUILD
ERROR: Build did NOT complete successfully
_run_cmd -> had a non-zero return code of 1.
make: *** [/nightly/current_run/opentitan/hw/dv/tools/dvsim/sim.mk:58: sw_build] Error 1
rom_e2e_self_hash 113826766343767454571593547744349373879980680860637553127495347322347910987931 None
Another command (pid=303242) is running. Waiting for it to complete on the server (server_pid=254362)...
Another command (pid=286726) is running. Waiting for it to complete on the server (server_pid=254362)...
Another command (pid=304945) is running. Waiting for it to complete on the server (server_pid=254362)...
WARNING: Target pattern parsing failed.
ERROR: Skipping '//sw/device/silicon_creator/rom/e2e/release:rom_e2e_self_hash_test_sim_dv': no such target '//sw/device/silicon_creator/rom/e2e/release:rom_e2e_self_hash_test_sim_dv': target 'rom_e2e_self_hash_test_sim_dv' not declared in package 'sw/device/silicon_creator/rom/e2e/release' defined by /nightly/current_run/opentitan/sw/device/silicon_creator/rom/e2e/release/BUILD
ERROR: no such target '//sw/device/silicon_creator/rom/e2e/release:rom_e2e_self_hash_test_sim_dv': target 'rom_e2e_self_hash_test_sim_dv' not declared in package 'sw/device/silicon_creator/rom/e2e/release' defined by /nightly/current_run/opentitan/sw/device/silicon_creator/rom/e2e/release/BUILD
ERROR: Build did NOT complete successfully
_run_cmd -> had a non-zero return code of 1.
make: *** [/nightly/current_run/opentitan/hw/dv/tools/dvsim/sim.mk:58: sw_build] Error 1
UVM_ERROR @ * us: (cip_base_scoreboard.sv:575) scoreboard [scoreboard] On interface chip_reg_block, item had unexpected d_error value(predicted *, but saw *). 33 test runs
chip_tl_errors 84660663880931683896029437506678388164817985429600304310262569524317094871782 217
TL item was: req: (cip_tl_seq_item@34303) { a_addr: 'h10350 a_data: 'h10e2485e a_mask: 'hf a_size: 'h2 a_param: 'h0 a_source: 'h18 a_opcode: 'h4 a_user: 'h186f3 d_param: 'h0 d_source: 'h18 d_data: 'h13 d_size: 'h2 d_opcode: 'h1 d_error: 'h0 d_sink: 'h0 d_user: 'hd7d a_valid_delay: 'h0 d_valid_delay: 'h0 a_valid_len: 'h0 d_valid_len: 'h0 req_abort_after_a_valid_len: 'h0 rsp_abort_after_d_valid_len: 'h0 req_completed: 'h0 rsp_completed: 'h0 tl_intg_err_type: TlIntgErrNone max_ecc_errors: 'h3 }
Reasons for predicted error: '{"Fetch from CSR"} .
UVM_INFO @ 2373.788897 us: (uvm_report_catcher.svh:705) [UVM/REPORT/CATCHER]
--- UVM Report catcher Summary ---
chip_csr_mem_rw_with_rand_reset 80189174544156957725153717916431873537140814397740713384020277261317312694496 224
TL item was: req: (cip_tl_seq_item@30793) { a_addr: 'h10788 a_data: 'ha402b168 a_mask: 'hf a_size: 'h2 a_param: 'h0 a_source: 'h29 a_opcode: 'h4 a_user: 'h1bdd0 d_param: 'h0 d_source: 'h29 d_data: 'h0 d_size: 'h2 d_opcode: 'h1 d_error: 'h0 d_sink: 'h0 d_user: 'hd2a a_valid_delay: 'h0 d_valid_delay: 'h0 a_valid_len: 'h0 d_valid_len: 'h0 req_abort_after_a_valid_len: 'h0 rsp_abort_after_d_valid_len: 'h0 req_completed: 'h0 rsp_completed: 'h0 tl_intg_err_type: TlIntgErrNone max_ecc_errors: 'h3 }
Reasons for predicted error: '{"Fetch from CSR"} .
UVM_INFO @ 1930.778824 us: (uvm_report_catcher.svh:705) [UVM/REPORT/CATCHER]
--- UVM Report catcher Summary ---
chip_tl_errors 27066677199530370209915689559579182755052424335757628594270368416293681292658 217
TL item was: req: (cip_tl_seq_item@31041) { a_addr: 'h1077c a_data: 'hc549969 a_mask: 'hf a_size: 'h2 a_param: 'h0 a_source: 'h1c a_opcode: 'h4 a_user: 'h19574 d_param: 'h0 d_source: 'h1c d_data: 'h0 d_size: 'h2 d_opcode: 'h1 d_error: 'h0 d_sink: 'h0 d_user: 'hd2a a_valid_delay: 'h0 d_valid_delay: 'h0 a_valid_len: 'h0 d_valid_len: 'h0 req_abort_after_a_valid_len: 'h0 rsp_abort_after_d_valid_len: 'h0 req_completed: 'h0 rsp_completed: 'h0 tl_intg_err_type: TlIntgErrNone max_ecc_errors: 'h3 }
Reasons for predicted error: '{"Fetch from CSR"} .
UVM_INFO @ 2469.077261 us: (uvm_report_catcher.svh:705) [UVM/REPORT/CATCHER]
--- UVM Report catcher Summary ---
chip_csr_mem_rw_with_rand_reset 2186499332797769466166449881311184303110884634391840802874707560972078189962 224
TL item was: req: (cip_tl_seq_item@31115) { a_addr: 'h107b4 a_data: 'h39b8ff10 a_mask: 'hf a_size: 'h2 a_param: 'h0 a_source: 'h32 a_opcode: 'h4 a_user: 'h199f7 d_param: 'h0 d_source: 'h32 d_data: 'h0 d_size: 'h2 d_opcode: 'h1 d_error: 'h0 d_sink: 'h0 d_user: 'hd2a a_valid_delay: 'h0 d_valid_delay: 'h0 a_valid_len: 'h0 d_valid_len: 'h0 req_abort_after_a_valid_len: 'h0 rsp_abort_after_d_valid_len: 'h0 req_completed: 'h0 rsp_completed: 'h0 tl_intg_err_type: TlIntgErrNone max_ecc_errors: 'h3 }
Reasons for predicted error: '{"Fetch from CSR"} .
UVM_INFO @ 2510.980340 us: (uvm_report_catcher.svh:705) [UVM/REPORT/CATCHER]
--- UVM Report catcher Summary ---
chip_tl_errors 57246121989329280103174775848403509365944945172063364062619119648053647567172 217
TL item was: req: (cip_tl_seq_item@31769) { a_addr: 'h10588 a_data: 'hb89ecb12 a_mask: 'hf a_size: 'h2 a_param: 'h0 a_source: 'hd a_opcode: 'h4 a_user: 'h1b6d4 d_param: 'h0 d_source: 'hd d_data: 'h0 d_size: 'h2 d_opcode: 'h1 d_error: 'h0 d_sink: 'h0 d_user: 'hd2a a_valid_delay: 'h0 d_valid_delay: 'h0 a_valid_len: 'h0 d_valid_len: 'h0 req_abort_after_a_valid_len: 'h0 rsp_abort_after_d_valid_len: 'h0 req_completed: 'h0 rsp_completed: 'h0 tl_intg_err_type: TlIntgErrNone max_ecc_errors: 'h3 }
Reasons for predicted error: '{"Fetch from CSR"} .
UVM_INFO @ 2681.087844 us: (uvm_report_catcher.svh:705) [UVM/REPORT/CATCHER]
--- UVM Report catcher Summary ---
chip_csr_mem_rw_with_rand_reset 92445464213306658702529481870563766833012722915963208428637335852251862166910 224
TL item was: req: (cip_tl_seq_item@30869) { a_addr: 'h10474 a_data: 'hb66bec6e a_mask: 'hf a_size: 'h2 a_param: 'h0 a_source: 'h31 a_opcode: 'h4 a_user: 'h18dc0 d_param: 'h0 d_source: 'h31 d_data: 'h0 d_size: 'h2 d_opcode: 'h1 d_error: 'h0 d_sink: 'h0 d_user: 'hd2a a_valid_delay: 'h0 d_valid_delay: 'h0 a_valid_len: 'h0 d_valid_len: 'h0 req_abort_after_a_valid_len: 'h0 rsp_abort_after_d_valid_len: 'h0 req_completed: 'h0 rsp_completed: 'h0 tl_intg_err_type: TlIntgErrNone max_ecc_errors: 'h3 }
Reasons for predicted error: '{"Fetch from CSR"} .
UVM_INFO @ 2517.270075 us: (uvm_report_catcher.svh:705) [UVM/REPORT/CATCHER]
--- UVM Report catcher Summary ---
chip_tl_errors 13715756249858428979870575136093488152606842194084022389746063479757034191126 217
TL item was: req: (cip_tl_seq_item@30309) { a_addr: 'h10514 a_data: 'h34d762a2 a_mask: 'hf a_size: 'h2 a_param: 'h0 a_source: 'h3d a_opcode: 'h4 a_user: 'h1bab0 d_param: 'h0 d_source: 'h3d d_data: 'h0 d_size: 'h2 d_opcode: 'h1 d_error: 'h0 d_sink: 'h0 d_user: 'hd2a a_valid_delay: 'h0 d_valid_delay: 'h0 a_valid_len: 'h0 d_valid_len: 'h0 req_abort_after_a_valid_len: 'h0 rsp_abort_after_d_valid_len: 'h0 req_completed: 'h0 rsp_completed: 'h0 tl_intg_err_type: TlIntgErrNone max_ecc_errors: 'h3 }
Reasons for predicted error: '{"Fetch from CSR"} .
UVM_INFO @ 2641.822126 us: (uvm_report_catcher.svh:705) [UVM/REPORT/CATCHER]
--- UVM Report catcher Summary ---
chip_csr_mem_rw_with_rand_reset 34387015209594741138335701453855234804354159875097321973960673159741544617966 224
TL item was: req: (cip_tl_seq_item@31929) { a_addr: 'h10798 a_data: 'h3bf0dbfe a_mask: 'hf a_size: 'h2 a_param: 'h0 a_source: 'h0 a_opcode: 'h4 a_user: 'h19938 d_param: 'h0 d_source: 'h0 d_data: 'h0 d_size: 'h2 d_opcode: 'h1 d_error: 'h0 d_sink: 'h0 d_user: 'hd2a a_valid_delay: 'h0 d_valid_delay: 'h0 a_valid_len: 'h0 d_valid_len: 'h0 req_abort_after_a_valid_len: 'h0 rsp_abort_after_d_valid_len: 'h0 req_completed: 'h0 rsp_completed: 'h0 tl_intg_err_type: TlIntgErrNone max_ecc_errors: 'h3 }
Reasons for predicted error: '{"Fetch from CSR"} .
UVM_INFO @ 2656.015263 us: (uvm_report_catcher.svh:705) [UVM/REPORT/CATCHER]
--- UVM Report catcher Summary ---
chip_tl_errors 14950464566720320548591036695995859794196007469966294836672201273072763585364 217
TL item was: req: (cip_tl_seq_item@35103) { a_addr: 'h104e4 a_data: 'hff2a6e40 a_mask: 'hf a_size: 'h2 a_param: 'h0 a_source: 'h1f a_opcode: 'h4 a_user: 'h199df d_param: 'h0 d_source: 'h1f d_data: 'h0 d_size: 'h2 d_opcode: 'h1 d_error: 'h0 d_sink: 'h0 d_user: 'hd2a a_valid_delay: 'h0 d_valid_delay: 'h0 a_valid_len: 'h0 d_valid_len: 'h0 req_abort_after_a_valid_len: 'h0 rsp_abort_after_d_valid_len: 'h0 req_completed: 'h0 rsp_completed: 'h0 tl_intg_err_type: TlIntgErrNone max_ecc_errors: 'h3 }
Reasons for predicted error: '{"Fetch from CSR"} .
UVM_INFO @ 2912.750564 us: (uvm_report_catcher.svh:705) [UVM/REPORT/CATCHER]
--- UVM Report catcher Summary ---
chip_csr_mem_rw_with_rand_reset 55687109261152165523526755103238860066105205386261026639774222570283217314063 224
TL item was: req: (cip_tl_seq_item@30233) { a_addr: 'h104cc a_data: 'h1b7962ad a_mask: 'hf a_size: 'h2 a_param: 'h0 a_source: 'hb a_opcode: 'h4 a_user: 'h195cb d_param: 'h0 d_source: 'hb d_data: 'h0 d_size: 'h2 d_opcode: 'h1 d_error: 'h0 d_sink: 'h0 d_user: 'hd2a a_valid_delay: 'h0 d_valid_delay: 'h0 a_valid_len: 'h0 d_valid_len: 'h0 req_abort_after_a_valid_len: 'h0 rsp_abort_after_d_valid_len: 'h0 req_completed: 'h0 rsp_completed: 'h0 tl_intg_err_type: TlIntgErrNone max_ecc_errors: 'h3 }
Reasons for predicted error: '{"Fetch from CSR"} .
UVM_INFO @ 3635.181346 us: (uvm_report_catcher.svh:705) [UVM/REPORT/CATCHER]
--- UVM Report catcher Summary ---
chip_tl_errors 5252840994203334578767079512455436392880811179066101425293599410346853715864 217
TL item was: req: (cip_tl_seq_item@35267) { a_addr: 'h1043c a_data: 'h64fecc81 a_mask: 'hf a_size: 'h2 a_param: 'h0 a_source: 'h1a a_opcode: 'h4 a_user: 'h1b1ca d_param: 'h0 d_source: 'h1a d_data: 'h0 d_size: 'h2 d_opcode: 'h1 d_error: 'h0 d_sink: 'h0 d_user: 'hd2a a_valid_delay: 'h0 d_valid_delay: 'h0 a_valid_len: 'h0 d_valid_len: 'h0 req_abort_after_a_valid_len: 'h0 rsp_abort_after_d_valid_len: 'h0 req_completed: 'h0 rsp_completed: 'h0 tl_intg_err_type: TlIntgErrNone max_ecc_errors: 'h3 }
Reasons for predicted error: '{"Fetch from CSR"} .
UVM_INFO @ 2398.521873 us: (uvm_report_catcher.svh:705) [UVM/REPORT/CATCHER]
--- UVM Report catcher Summary ---
chip_tl_errors 28132374176134062661935015099016402409453430071256544023344909369312391187263 217
TL item was: req: (cip_tl_seq_item@30249) { a_addr: 'h10558 a_data: 'he0939665 a_mask: 'hf a_size: 'h2 a_param: 'h0 a_source: 'h2b a_opcode: 'h4 a_user: 'h18a44 d_param: 'h0 d_source: 'h2b d_data: 'h0 d_size: 'h2 d_opcode: 'h1 d_error: 'h0 d_sink: 'h0 d_user: 'hd2a a_valid_delay: 'h0 d_valid_delay: 'h0 a_valid_len: 'h0 d_valid_len: 'h0 req_abort_after_a_valid_len: 'h0 rsp_abort_after_d_valid_len: 'h0 req_completed: 'h0 rsp_completed: 'h0 tl_intg_err_type: TlIntgErrNone max_ecc_errors: 'h3 }
Reasons for predicted error: '{"Fetch from CSR"} .
UVM_INFO @ 2849.328479 us: (uvm_report_catcher.svh:705) [UVM/REPORT/CATCHER]
--- UVM Report catcher Summary ---
chip_tl_errors 5845218932011241846295239601583481860316735173364047835204726512043536628112 217
TL item was: req: (cip_tl_seq_item@34827) { a_addr: 'h10604 a_data: 'h4c3e2417 a_mask: 'hf a_size: 'h2 a_param: 'h0 a_source: 'h32 a_opcode: 'h4 a_user: 'h19273 d_param: 'h0 d_source: 'h32 d_data: 'h0 d_size: 'h2 d_opcode: 'h1 d_error: 'h0 d_sink: 'h0 d_user: 'hd2a a_valid_delay: 'h0 d_valid_delay: 'h0 a_valid_len: 'h0 d_valid_len: 'h0 req_abort_after_a_valid_len: 'h0 rsp_abort_after_d_valid_len: 'h0 req_completed: 'h0 rsp_completed: 'h0 tl_intg_err_type: TlIntgErrNone max_ecc_errors: 'h3 }
Reasons for predicted error: '{"Fetch from CSR"} .
UVM_INFO @ 2982.555840 us: (uvm_report_catcher.svh:705) [UVM/REPORT/CATCHER]
--- UVM Report catcher Summary ---
chip_tl_errors 59856771655107587683958340654156454751162211158202589636603265269897190344529 217
TL item was: req: (cip_tl_seq_item@31911) { a_addr: 'h105d0 a_data: 'hde95c8f2 a_mask: 'hf a_size: 'h2 a_param: 'h0 a_source: 'h38 a_opcode: 'h4 a_user: 'h1ae64 d_param: 'h0 d_source: 'h38 d_data: 'h0 d_size: 'h2 d_opcode: 'h1 d_error: 'h0 d_sink: 'h0 d_user: 'hd2a a_valid_delay: 'h0 d_valid_delay: 'h0 a_valid_len: 'h0 d_valid_len: 'h0 req_abort_after_a_valid_len: 'h0 rsp_abort_after_d_valid_len: 'h0 req_completed: 'h0 rsp_completed: 'h0 tl_intg_err_type: TlIntgErrNone max_ecc_errors: 'h3 }
Reasons for predicted error: '{"Fetch from CSR"} .
UVM_INFO @ 3151.289351 us: (uvm_report_catcher.svh:705) [UVM/REPORT/CATCHER]
--- UVM Report catcher Summary ---
chip_tl_errors 96405629518780984872261546128653533841755079438074511281108172552903557759559 217
TL item was: req: (cip_tl_seq_item@32093) { a_addr: 'h10464 a_data: 'hf3b33918 a_mask: 'hf a_size: 'h2 a_param: 'h0 a_source: 'h30 a_opcode: 'h4 a_user: 'h1a959 d_param: 'h0 d_source: 'h30 d_data: 'h0 d_size: 'h2 d_opcode: 'h1 d_error: 'h0 d_sink: 'h0 d_user: 'hd2a a_valid_delay: 'h0 d_valid_delay: 'h0 a_valid_len: 'h0 d_valid_len: 'h0 req_abort_after_a_valid_len: 'h0 rsp_abort_after_d_valid_len: 'h0 req_completed: 'h0 rsp_completed: 'h0 tl_intg_err_type: TlIntgErrNone max_ecc_errors: 'h3 }
Reasons for predicted error: '{"Fetch from CSR"} .
UVM_INFO @ 3078.494172 us: (uvm_report_catcher.svh:705) [UVM/REPORT/CATCHER]
--- UVM Report catcher Summary ---
chip_tl_errors 1106461928481412833638299555908955421078603606198659872045790783936834960808 217
TL item was: req: (cip_tl_seq_item@35307) { a_addr: 'h10794 a_data: 'ha48fc07c a_mask: 'hf a_size: 'h2 a_param: 'h0 a_source: 'h33 a_opcode: 'h4 a_user: 'h1814b d_param: 'h0 d_source: 'h33 d_data: 'h0 d_size: 'h2 d_opcode: 'h1 d_error: 'h0 d_sink: 'h0 d_user: 'hd2a a_valid_delay: 'h0 d_valid_delay: 'h0 a_valid_len: 'h0 d_valid_len: 'h0 req_abort_after_a_valid_len: 'h0 rsp_abort_after_d_valid_len: 'h0 req_completed: 'h0 rsp_completed: 'h0 tl_intg_err_type: TlIntgErrNone max_ecc_errors: 'h3 }
Reasons for predicted error: '{"Fetch from CSR"} .
UVM_INFO @ 2914.230716 us: (uvm_report_catcher.svh:705) [UVM/REPORT/CATCHER]
--- UVM Report catcher Summary ---
chip_tl_errors 103837323526637138455347297946803566432090601745615859700195750284149814758341 217
TL item was: req: (cip_tl_seq_item@32013) { a_addr: 'h107e8 a_data: 'ha5406e7b a_mask: 'hf a_size: 'h2 a_param: 'h0 a_source: 'h18 a_opcode: 'h4 a_user: 'h18dd7 d_param: 'h0 d_source: 'h18 d_data: 'h0 d_size: 'h2 d_opcode: 'h1 d_error: 'h0 d_sink: 'h0 d_user: 'hd2a a_valid_delay: 'h0 d_valid_delay: 'h0 a_valid_len: 'h0 d_valid_len: 'h0 req_abort_after_a_valid_len: 'h0 rsp_abort_after_d_valid_len: 'h0 req_completed: 'h0 rsp_completed: 'h0 tl_intg_err_type: TlIntgErrNone max_ecc_errors: 'h3 }
Reasons for predicted error: '{"Fetch from CSR"} .
UVM_INFO @ 3539.987701 us: (uvm_report_catcher.svh:705) [UVM/REPORT/CATCHER]
--- UVM Report catcher Summary ---
chip_tl_errors 532511209741043846945369268905791910907828637216771114829654514183991861123 217
TL item was: req: (cip_tl_seq_item@33573) { a_addr: 'h10750 a_data: 'hd8788777 a_mask: 'hf a_size: 'h2 a_param: 'h0 a_source: 'hf a_opcode: 'h4 a_user: 'h195e2 d_param: 'h0 d_source: 'hf d_data: 'h0 d_size: 'h2 d_opcode: 'h1 d_error: 'h0 d_sink: 'h0 d_user: 'hd2a a_valid_delay: 'h0 d_valid_delay: 'h0 a_valid_len: 'h0 d_valid_len: 'h0 req_abort_after_a_valid_len: 'h0 rsp_abort_after_d_valid_len: 'h0 req_completed: 'h0 rsp_completed: 'h0 tl_intg_err_type: TlIntgErrNone max_ecc_errors: 'h3 }
Reasons for predicted error: '{"Fetch from CSR"} .
UVM_INFO @ 2819.490826 us: (uvm_report_catcher.svh:705) [UVM/REPORT/CATCHER]
--- UVM Report catcher Summary ---
chip_tl_errors 79631087252083980233227274273913923057728049690320508410155965825149432174633 217
TL item was: req: (cip_tl_seq_item@37171) { a_addr: 'h104d0 a_data: 'hde1068ed a_mask: 'hf a_size: 'h2 a_param: 'h0 a_source: 'h13 a_opcode: 'h4 a_user: 'h1a95b d_param: 'h0 d_source: 'h13 d_data: 'h0 d_size: 'h2 d_opcode: 'h1 d_error: 'h0 d_sink: 'h0 d_user: 'hd2a a_valid_delay: 'h0 d_valid_delay: 'h0 a_valid_len: 'h0 d_valid_len: 'h0 req_abort_after_a_valid_len: 'h0 rsp_abort_after_d_valid_len: 'h0 req_completed: 'h0 rsp_completed: 'h0 tl_intg_err_type: TlIntgErrNone max_ecc_errors: 'h3 }
Reasons for predicted error: '{"Fetch from CSR"} .
UVM_INFO @ 3665.679250 us: (uvm_report_catcher.svh:705) [UVM/REPORT/CATCHER]
--- UVM Report catcher Summary ---
chip_tl_errors 79565806130456334731444899434708737252318057500094620618733889444150081932976 217
TL item was: req: (cip_tl_seq_item@30693) { a_addr: 'h10538 a_data: 'ha7e020e5 a_mask: 'hf a_size: 'h2 a_param: 'h0 a_source: 'h14 a_opcode: 'h4 a_user: 'h1ba3b d_param: 'h0 d_source: 'h14 d_data: 'h0 d_size: 'h2 d_opcode: 'h1 d_error: 'h0 d_sink: 'h0 d_user: 'hd2a a_valid_delay: 'h0 d_valid_delay: 'h0 a_valid_len: 'h0 d_valid_len: 'h0 req_abort_after_a_valid_len: 'h0 rsp_abort_after_d_valid_len: 'h0 req_completed: 'h0 rsp_completed: 'h0 tl_intg_err_type: TlIntgErrNone max_ecc_errors: 'h3 }
Reasons for predicted error: '{"Fetch from CSR"} .
UVM_INFO @ 2378.427661 us: (uvm_report_catcher.svh:705) [UVM/REPORT/CATCHER]
--- UVM Report catcher Summary ---
chip_tl_errors 108942954493587619034293900943115127312666985682820732168988600466247560175280 217
TL item was: req: (cip_tl_seq_item@33935) { a_addr: 'h10570 a_data: 'ha9914ce5 a_mask: 'hf a_size: 'h2 a_param: 'h0 a_source: 'h39 a_opcode: 'h4 a_user: 'h18650 d_param: 'h0 d_source: 'h39 d_data: 'h0 d_size: 'h2 d_opcode: 'h1 d_error: 'h0 d_sink: 'h0 d_user: 'hd2a a_valid_delay: 'h0 d_valid_delay: 'h0 a_valid_len: 'h0 d_valid_len: 'h0 req_abort_after_a_valid_len: 'h0 rsp_abort_after_d_valid_len: 'h0 req_completed: 'h0 rsp_completed: 'h0 tl_intg_err_type: TlIntgErrNone max_ecc_errors: 'h3 }
Reasons for predicted error: '{"Fetch from CSR"} .
UVM_INFO @ 3523.350160 us: (uvm_report_catcher.svh:705) [UVM/REPORT/CATCHER]
--- UVM Report catcher Summary ---
chip_tl_errors 106431758781214746000527930699637366053687608277810891838558311743495957972799 217
TL item was: req: (cip_tl_seq_item@33275) { a_addr: 'h10628 a_data: 'h2b9127e7 a_mask: 'hf a_size: 'h2 a_param: 'h0 a_source: 'h29 a_opcode: 'h4 a_user: 'h192ec d_param: 'h0 d_source: 'h29 d_data: 'h0 d_size: 'h2 d_opcode: 'h1 d_error: 'h0 d_sink: 'h0 d_user: 'hd2a a_valid_delay: 'h0 d_valid_delay: 'h0 a_valid_len: 'h0 d_valid_len: 'h0 req_abort_after_a_valid_len: 'h0 rsp_abort_after_d_valid_len: 'h0 req_completed: 'h0 rsp_completed: 'h0 tl_intg_err_type: TlIntgErrNone max_ecc_errors: 'h3 }
Reasons for predicted error: '{"Fetch from CSR"} .
UVM_INFO @ 2883.326470 us: (uvm_report_catcher.svh:705) [UVM/REPORT/CATCHER]
--- UVM Report catcher Summary ---
chip_tl_errors 77369661367234209210944708573368791097624378489482358671303205270100140927984 217
TL item was: req: (cip_tl_seq_item@34887) { a_addr: 'h10670 a_data: 'hb415085e a_mask: 'hf a_size: 'h2 a_param: 'h0 a_source: 'h3a a_opcode: 'h4 a_user: 'h18a7b d_param: 'h0 d_source: 'h3a d_data: 'h0 d_size: 'h2 d_opcode: 'h1 d_error: 'h0 d_sink: 'h0 d_user: 'hd2a a_valid_delay: 'h0 d_valid_delay: 'h0 a_valid_len: 'h0 d_valid_len: 'h0 req_abort_after_a_valid_len: 'h0 rsp_abort_after_d_valid_len: 'h0 req_completed: 'h0 rsp_completed: 'h0 tl_intg_err_type: TlIntgErrNone max_ecc_errors: 'h3 }
Reasons for predicted error: '{"Fetch from CSR"} .
UVM_INFO @ 2626.120800 us: (uvm_report_catcher.svh:705) [UVM/REPORT/CATCHER]
--- UVM Report catcher Summary ---
chip_tl_errors 55864844548882986820677001462571682954966658598977708008381580247881933014201 217
TL item was: req: (cip_tl_seq_item@30283) { a_addr: 'h10768 a_data: 'h2c6234c3 a_mask: 'hf a_size: 'h2 a_param: 'h0 a_source: 'h10 a_opcode: 'h4 a_user: 'h1bd35 d_param: 'h0 d_source: 'h10 d_data: 'h0 d_size: 'h2 d_opcode: 'h1 d_error: 'h0 d_sink: 'h0 d_user: 'hd2a a_valid_delay: 'h0 d_valid_delay: 'h0 a_valid_len: 'h0 d_valid_len: 'h0 req_abort_after_a_valid_len: 'h0 rsp_abort_after_d_valid_len: 'h0 req_completed: 'h0 rsp_completed: 'h0 tl_intg_err_type: TlIntgErrNone max_ecc_errors: 'h3 }
Reasons for predicted error: '{"Fetch from CSR"} .
UVM_INFO @ 2158.722536 us: (uvm_report_catcher.svh:705) [UVM/REPORT/CATCHER]
--- UVM Report catcher Summary ---
chip_tl_errors 77441730420034985002433560784765917918508001353861556680626282970907179913989 217
TL item was: req: (cip_tl_seq_item@33561) { a_addr: 'h10714 a_data: 'h124430c8 a_mask: 'hf a_size: 'h2 a_param: 'h0 a_source: 'h22 a_opcode: 'h4 a_user: 'h1b194 d_param: 'h0 d_source: 'h22 d_data: 'h0 d_size: 'h2 d_opcode: 'h1 d_error: 'h0 d_sink: 'h0 d_user: 'hd2a a_valid_delay: 'h0 d_valid_delay: 'h0 a_valid_len: 'h0 d_valid_len: 'h0 req_abort_after_a_valid_len: 'h0 rsp_abort_after_d_valid_len: 'h0 req_completed: 'h0 rsp_completed: 'h0 tl_intg_err_type: TlIntgErrNone max_ecc_errors: 'h3 }
Reasons for predicted error: '{"Fetch from CSR"} .
UVM_INFO @ 3220.102252 us: (uvm_report_catcher.svh:705) [UVM/REPORT/CATCHER]
--- UVM Report catcher Summary ---
chip_tl_errors 66802754067714030651755939278811931944615653847442207738376165046135154510672 217
TL item was: req: (cip_tl_seq_item@32791) { a_addr: 'h10744 a_data: 'hd8b6cf92 a_mask: 'hf a_size: 'h2 a_param: 'h0 a_source: 'h18 a_opcode: 'h4 a_user: 'h1bdc6 d_param: 'h0 d_source: 'h18 d_data: 'h0 d_size: 'h2 d_opcode: 'h1 d_error: 'h0 d_sink: 'h0 d_user: 'hd2a a_valid_delay: 'h0 d_valid_delay: 'h0 a_valid_len: 'h0 d_valid_len: 'h0 req_abort_after_a_valid_len: 'h0 rsp_abort_after_d_valid_len: 'h0 req_completed: 'h0 rsp_completed: 'h0 tl_intg_err_type: TlIntgErrNone max_ecc_errors: 'h3 }
Reasons for predicted error: '{"Fetch from CSR"} .
UVM_INFO @ 3010.642956 us: (uvm_report_catcher.svh:705) [UVM/REPORT/CATCHER]
--- UVM Report catcher Summary ---
chip_tl_errors 96716930341552427119723291629530267624240850699056590207435291817364919161759 217
TL item was: req: (cip_tl_seq_item@34577) { a_addr: 'h10490 a_data: 'h91b21845 a_mask: 'hf a_size: 'h2 a_param: 'h0 a_source: 'h15 a_opcode: 'h4 a_user: 'h181e1 d_param: 'h0 d_source: 'h15 d_data: 'h0 d_size: 'h2 d_opcode: 'h1 d_error: 'h0 d_sink: 'h0 d_user: 'hd2a a_valid_delay: 'h0 d_valid_delay: 'h0 a_valid_len: 'h0 d_valid_len: 'h0 req_abort_after_a_valid_len: 'h0 rsp_abort_after_d_valid_len: 'h0 req_completed: 'h0 rsp_completed: 'h0 tl_intg_err_type: TlIntgErrNone max_ecc_errors: 'h3 }
Reasons for predicted error: '{"Fetch from CSR"} .
UVM_INFO @ 3477.687868 us: (uvm_report_catcher.svh:705) [UVM/REPORT/CATCHER]
--- UVM Report catcher Summary ---
chip_tl_errors 55763726851229370637615994715357786008944332903186233089816952068116052400815 217
TL item was: req: (cip_tl_seq_item@30229) { a_addr: 'h106d4 a_data: 'h83ff1436 a_mask: 'hf a_size: 'h2 a_param: 'h0 a_source: 'hb a_opcode: 'h4 a_user: 'h1aefb d_param: 'h0 d_source: 'hb d_data: 'h0 d_size: 'h2 d_opcode: 'h1 d_error: 'h0 d_sink: 'h0 d_user: 'hd2a a_valid_delay: 'h0 d_valid_delay: 'h0 a_valid_len: 'h0 d_valid_len: 'h0 req_abort_after_a_valid_len: 'h0 rsp_abort_after_d_valid_len: 'h0 req_completed: 'h0 rsp_completed: 'h0 tl_intg_err_type: TlIntgErrNone max_ecc_errors: 'h3 }
Reasons for predicted error: '{"Fetch from CSR"} .
UVM_INFO @ 2486.072356 us: (uvm_report_catcher.svh:705) [UVM/REPORT/CATCHER]
--- UVM Report catcher Summary ---
chip_tl_errors 109712563267123653054674169124144792054278394693786131270821012072948040850065 217
TL item was: req: (cip_tl_seq_item@37803) { a_addr: 'h10660 a_data: 'h7a9cd674 a_mask: 'hf a_size: 'h2 a_param: 'h0 a_source: 'h18 a_opcode: 'h4 a_user: 'h1aed2 d_param: 'h0 d_source: 'h18 d_data: 'h0 d_size: 'h2 d_opcode: 'h1 d_error: 'h0 d_sink: 'h0 d_user: 'hd2a a_valid_delay: 'h0 d_valid_delay: 'h0 a_valid_len: 'h0 d_valid_len: 'h0 req_abort_after_a_valid_len: 'h0 rsp_abort_after_d_valid_len: 'h0 req_completed: 'h0 rsp_completed: 'h0 tl_intg_err_type: TlIntgErrNone max_ecc_errors: 'h3 }
Reasons for predicted error: '{"Fetch from CSR"} .
UVM_INFO @ 3336.369033 us: (uvm_report_catcher.svh:705) [UVM/REPORT/CATCHER]
--- UVM Report catcher Summary ---
chip_tl_errors 70126271885106427222704917894526088035155634381564862732164897288399357076551 217
TL item was: req: (cip_tl_seq_item@34089) { a_addr: 'h10504 a_data: 'h5fb2e284 a_mask: 'hf a_size: 'h2 a_param: 'h0 a_source: 'h1e a_opcode: 'h4 a_user: 'h19e32 d_param: 'h0 d_source: 'h1e d_data: 'h0 d_size: 'h2 d_opcode: 'h1 d_error: 'h0 d_sink: 'h0 d_user: 'hd2a a_valid_delay: 'h0 d_valid_delay: 'h0 a_valid_len: 'h0 d_valid_len: 'h0 req_abort_after_a_valid_len: 'h0 rsp_abort_after_d_valid_len: 'h0 req_completed: 'h0 rsp_completed: 'h0 tl_intg_err_type: TlIntgErrNone max_ecc_errors: 'h3 }
Reasons for predicted error: '{"Fetch from CSR"} .
UVM_INFO @ 3352.431779 us: (uvm_report_catcher.svh:705) [UVM/REPORT/CATCHER]
--- UVM Report catcher Summary ---
chip_tl_errors 78849357751756543600128791876219217261133787085392638914186233682557911866624 217
TL item was: req: (cip_tl_seq_item@35417) { a_addr: 'h1049c a_data: 'h313f77e7 a_mask: 'hf a_size: 'h2 a_param: 'h0 a_source: 'h27 a_opcode: 'h4 a_user: 'h199da d_param: 'h0 d_source: 'h27 d_data: 'h0 d_size: 'h2 d_opcode: 'h1 d_error: 'h0 d_sink: 'h0 d_user: 'hd2a a_valid_delay: 'h0 d_valid_delay: 'h0 a_valid_len: 'h0 d_valid_len: 'h0 req_abort_after_a_valid_len: 'h0 rsp_abort_after_d_valid_len: 'h0 req_completed: 'h0 rsp_completed: 'h0 tl_intg_err_type: TlIntgErrNone max_ecc_errors: 'h3 }
Reasons for predicted error: '{"Fetch from CSR"} .
UVM_INFO @ 2147.623161 us: (uvm_report_catcher.svh:705) [UVM/REPORT/CATCHER]
--- UVM Report catcher Summary ---
chip_tl_errors 30740890371716956364455213850330441545243689153947166893405271172991658458522 217
TL item was: req: (cip_tl_seq_item@34003) { a_addr: 'h1071c a_data: 'h7dfdb97d a_mask: 'hf a_size: 'h2 a_param: 'h0 a_source: 'h1 a_opcode: 'h4 a_user: 'h1a561 d_param: 'h0 d_source: 'h1 d_data: 'h0 d_size: 'h2 d_opcode: 'h1 d_error: 'h0 d_sink: 'h0 d_user: 'hd2a a_valid_delay: 'h0 d_valid_delay: 'h0 a_valid_len: 'h0 d_valid_len: 'h0 req_abort_after_a_valid_len: 'h0 rsp_abort_after_d_valid_len: 'h0 req_completed: 'h0 rsp_completed: 'h0 tl_intg_err_type: TlIntgErrNone max_ecc_errors: 'h3 }
Reasons for predicted error: '{"Fetch from CSR"} .
UVM_INFO @ 3122.522756 us: (uvm_report_catcher.svh:705) [UVM/REPORT/CATCHER]
--- UVM Report catcher Summary ---
chip_tl_errors 104081076653061501493840550023568875855861691747988067195111200821666021235422 217
TL item was: req: (cip_tl_seq_item@32077) { a_addr: 'h10544 a_data: 'h32842d0a a_mask: 'hf a_size: 'h2 a_param: 'h0 a_source: 'h21 a_opcode: 'h4 a_user: 'h1b69d d_param: 'h0 d_source: 'h21 d_data: 'h0 d_size: 'h2 d_opcode: 'h1 d_error: 'h0 d_sink: 'h0 d_user: 'hd2a a_valid_delay: 'h0 d_valid_delay: 'h0 a_valid_len: 'h0 d_valid_len: 'h0 req_abort_after_a_valid_len: 'h0 rsp_abort_after_d_valid_len: 'h0 req_completed: 'h0 rsp_completed: 'h0 tl_intg_err_type: TlIntgErrNone max_ecc_errors: 'h3 }
Reasons for predicted error: '{"Fetch from CSR"} .
UVM_INFO @ 2485.221076 us: (uvm_report_catcher.svh:705) [UVM/REPORT/CATCHER]
--- UVM Report catcher Summary ---
Offending '(rstreqs[*] && (reset_cause == HwReq))' 14 test runs
chip_sw_pwrmgr_random_sleep_all_reset_reqs 28394653428137768384164829185275344455648826758949492114341260679366104850871 315
UVM_ERROR @ 6458.972500 us: (pwrmgr_rstreqs_sva_if.sv:49) [ASSERT FAILED] HwResetOn_A
UVM_INFO @ 6458.972500 us: (uvm_report_catcher.svh:705) [UVM/REPORT/CATCHER]
--- UVM Report catcher Summary ---
chip_sw_pwrmgr_deep_sleep_all_reset_reqs 4271898399610964494795302490944701665957688377096539823027971078436826235207 314
UVM_ERROR @ 6246.235000 us: (pwrmgr_rstreqs_sva_if.sv:49) [ASSERT FAILED] HwResetOn_A
UVM_INFO @ 6246.235000 us: (uvm_report_catcher.svh:705) [UVM/REPORT/CATCHER]
--- UVM Report catcher Summary ---
chip_sw_pwrmgr_deep_sleep_por_reset 109259433133235834389619737460393162170434982879589074282568358300169489044038 325
UVM_ERROR @ 8060.508000 us: (pwrmgr_rstreqs_sva_if.sv:49) [ASSERT FAILED] HwResetOn_A
UVM_INFO @ 8060.508000 us: (uvm_report_catcher.svh:705) [UVM/REPORT/CATCHER]
--- UVM Report catcher Summary ---
chip_sw_pwrmgr_random_sleep_power_glitch_reset 80801302347797409784820326797862326424944737175793240408599923788485008044136 330
UVM_ERROR @ 9675.802500 us: (pwrmgr_rstreqs_sva_if.sv:49) [ASSERT FAILED] HwResetOn_A
UVM_INFO @ 9675.802500 us: (uvm_report_catcher.svh:705) [UVM/REPORT/CATCHER]
--- UVM Report catcher Summary ---
chip_sw_pwrmgr_random_sleep_all_reset_reqs 34359177225869715421832190621331536381090643931506881639303976780190407922927 315
UVM_ERROR @ 6693.552000 us: (pwrmgr_rstreqs_sva_if.sv:49) [ASSERT FAILED] HwResetOn_A
UVM_INFO @ 6693.552000 us: (uvm_report_catcher.svh:705) [UVM/REPORT/CATCHER]
--- UVM Report catcher Summary ---
chip_sw_pwrmgr_deep_sleep_all_reset_reqs 91683711467251200497434972308513065436324896304843939165416328298185893103945 327
UVM_ERROR @ 10018.293000 us: (pwrmgr_rstreqs_sva_if.sv:49) [ASSERT FAILED] HwResetOn_A
UVM_INFO @ 10018.293000 us: (uvm_report_catcher.svh:705) [UVM/REPORT/CATCHER]
--- UVM Report catcher Summary ---
chip_sw_pwrmgr_deep_sleep_por_reset 84979933491468872576266041937251226299462088690728474871327166333457826760832 330
UVM_ERROR @ 7683.095000 us: (pwrmgr_rstreqs_sva_if.sv:49) [ASSERT FAILED] HwResetOn_A
UVM_INFO @ 7683.095000 us: (uvm_report_catcher.svh:705) [UVM/REPORT/CATCHER]
--- UVM Report catcher Summary ---
chip_sw_aon_timer_wdog_bite_reset 35683519153284235925321387120622664307247556448302264898134535442254204567157 319
UVM_ERROR @ 8009.705000 us: (pwrmgr_rstreqs_sva_if.sv:49) [ASSERT FAILED] HwResetOn_A
UVM_INFO @ 8009.705000 us: (uvm_report_catcher.svh:705) [UVM/REPORT/CATCHER]
--- UVM Report catcher Summary ---
chip_sw_pwrmgr_random_sleep_all_reset_reqs 14931540386100396120438858922940803370694954192228439123701365379525520871301 315
UVM_ERROR @ 5472.716000 us: (pwrmgr_rstreqs_sva_if.sv:49) [ASSERT FAILED] HwResetOn_A
UVM_INFO @ 5472.716000 us: (uvm_report_catcher.svh:705) [UVM/REPORT/CATCHER]
--- UVM Report catcher Summary ---
chip_sw_pwrmgr_deep_sleep_all_reset_reqs 54338398272765405205949059471255036559934311488860182080338233939698226558981 314
UVM_ERROR @ 7166.346000 us: (pwrmgr_rstreqs_sva_if.sv:49) [ASSERT FAILED] HwResetOn_A
UVM_INFO @ 7166.346000 us: (uvm_report_catcher.svh:705) [UVM/REPORT/CATCHER]
--- UVM Report catcher Summary ---
chip_sw_pwrmgr_deep_sleep_por_reset 77387537039993664848545138727480616598602598970965401416552806189924365036715 325
UVM_ERROR @ 7836.429000 us: (pwrmgr_rstreqs_sva_if.sv:49) [ASSERT FAILED] HwResetOn_A
UVM_INFO @ 7836.429000 us: (uvm_report_catcher.svh:705) [UVM/REPORT/CATCHER]
--- UVM Report catcher Summary ---
chip_sw_pwrmgr_random_sleep_power_glitch_reset 77813433646038695654620756441140929180398834095270042834631904707052123062038 316
UVM_ERROR @ 6520.091500 us: (pwrmgr_rstreqs_sva_if.sv:49) [ASSERT FAILED] HwResetOn_A
UVM_INFO @ 6520.091500 us: (uvm_report_catcher.svh:705) [UVM/REPORT/CATCHER]
--- UVM Report catcher Summary ---
chip_sw_sysrst_ctrl_reset 107503986474708668731605030796978704249889551683798954779482627341734923754528 334
UVM_ERROR @ 24920.435000 us: (pwrmgr_rstreqs_sva_if.sv:49) [ASSERT FAILED] HwResetOn_A
UVM_INFO @ 24920.435000 us: (uvm_report_catcher.svh:705) [UVM/REPORT/CATCHER]
--- UVM Report catcher Summary ---
chip_sw_aon_timer_wdog_bite_reset 89981689902858006799363403192797048061569780359568843755768416870979809858024 319
UVM_ERROR @ 9500.494000 us: (pwrmgr_rstreqs_sva_if.sv:49) [ASSERT FAILED] HwResetOn_A
UVM_INFO @ 9500.494000 us: (uvm_report_catcher.svh:705) [UVM/REPORT/CATCHER]
--- UVM Report catcher Summary ---
Job timed out after * minutes 13 test runs
chip_sw_rv_timer_systick_test 8954180348498477429538480285997010866563884089088509707236314551039735598556 None
chip_sw_adc_ctrl_sleep_debug_cable_wakeup 51564956665207505771082142361653282077085171275372562969992633048920400497540 None
chip_sw_alert_handler_reverse_ping_in_deep_sleep 27312861157136240236806481411890553114184032372481765016284755470665259173104 None
chip_sw_alert_handler_lpg_sleep_mode_pings 65230478905610311200110221212673504311797359954385707317778310325356824916598 None
ate_bootstrap_disjoint 609483904248474635258333718270723126691515031256015268388618166346612580684 None
chip_sw_rv_timer_systick_test 38208795093739027698485255537005779476077686733403807956476846153654166709775 None
chip_sw_adc_ctrl_sleep_debug_cable_wakeup 39716545966769391673423084775133874026701708724881614229694705790330690726826 None
chip_sw_alert_handler_lpg_sleep_mode_pings 99210476621466405731038640598102418933413598145377612039471105069130267873496 None
ate_bootstrap_disjoint 113970825254596613822473833007265598278236200832806794677785018291154718275428 None
chip_sw_rv_timer_systick_test 104070064834634550231567784928450482389980304406873548186505459392354156890056 None
chip_sw_adc_ctrl_sleep_debug_cable_wakeup 114298402604023758356864756404705250195862342889137673935865117879509026207229 None
chip_sw_alert_handler_lpg_sleep_mode_pings 106351765849836800700371451588511099632783873810259602794836205584971911850078 None
ate_bootstrap_disjoint 17690510989115895746003372290531207398382387382886155218083988152374761479976 None
Error-[NOA] Null object access 9 test runs
chip_sw_rv_dm_ndm_reset_req_when_cpu_halted 113245743650935624502988771808199977781961562995750865786073525046814920143106 327
src/lowrisc_dv_jtag_dmi_agent_0/jtag_rv_debugger.sv, 1108
The object at dereference depth 1 is being used before it was
constructed/allocated.
Please make sure that the object is allocated before using it.
rom_e2e_jtag_debug_test_unlocked0 51135043949202816210911973861481650151276554972086659887190287220575806161861 319
src/lowrisc_dv_jtag_dmi_agent_0/jtag_rv_debugger.sv, 1078
The object at dereference depth 1 is being used before it was
constructed/allocated.
Please make sure that the object is allocated before using it.
rom_e2e_jtag_debug_dev 11488460482375051922785296737277890884907624621611951948298404445481942695284 319
src/lowrisc_dv_jtag_dmi_agent_0/jtag_rv_debugger.sv, 1078
The object at dereference depth 1 is being used before it was
constructed/allocated.
Please make sure that the object is allocated before using it.
rom_e2e_jtag_debug_rma 98045370161666440655240119918036915090015888381813053840274581908335028202080 319
src/lowrisc_dv_jtag_dmi_agent_0/jtag_rv_debugger.sv, 1078
The object at dereference depth 1 is being used before it was
constructed/allocated.
Please make sure that the object is allocated before using it.
rom_e2e_jtag_inject_test_unlocked0 92878304358561297010938222040550926673065543973083385416961190838290217897651 305
src/lowrisc_dv_jtag_dmi_agent_0/jtag_rv_debugger.sv, 1078
The object at dereference depth 1 is being used before it was
constructed/allocated.
Please make sure that the object is allocated before using it.
rom_e2e_jtag_inject_dev 31087199560446107022428894731757500453871075008240666259129593376276543967253 303
src/lowrisc_dv_jtag_dmi_agent_0/jtag_rv_debugger.sv, 1108
The object at dereference depth 1 is being used before it was
constructed/allocated.
Please make sure that the object is allocated before using it.
rom_e2e_jtag_inject_rma 4072393583709317395939841182550305919465021589032685306296276117798149579879 305
src/lowrisc_dv_jtag_dmi_agent_0/jtag_rv_debugger.sv, 1078
The object at dereference depth 1 is being used before it was
constructed/allocated.
Please make sure that the object is allocated before using it.
chip_sw_rv_dm_ndm_reset_req_when_cpu_halted 101096110896877420873022485806383017961297604255686827082783397559757869450429 327
src/lowrisc_dv_jtag_dmi_agent_0/jtag_rv_debugger.sv, 1108
The object at dereference depth 1 is being used before it was
constructed/allocated.
Please make sure that the object is allocated before using it.
chip_sw_rv_dm_ndm_reset_req_when_cpu_halted 45747970311953751651143359324963607717812080956707345130405539355686681449287 327
src/lowrisc_dv_jtag_dmi_agent_0/jtag_rv_debugger.sv, 1108
The object at dereference depth 1 is being used before it was
constructed/allocated.
Please make sure that the object is allocated before using it.
UVM_ERROR @ * us: (sw_logger_if.sv:526) [lc_walkthrough_test_sim_dv(sw/device/lib/testing/test_framework/ottf_alerts.c:172)] ERROR: Alert * is asserted but not expected 8 test runs
chip_sw_lc_walkthrough_dev 71744850981249026117963486186387934226364384549922997849343870018273915658606 369
UVM_INFO @ 14457.497616 us: (uvm_report_catcher.svh:705) [UVM/REPORT/CATCHER]
--- UVM Report catcher Summary ---
chip_sw_lc_walkthrough_prod 79994044276087726415859706828430074331446518332074649177957431668354313039087 369
UVM_INFO @ 12532.632025 us: (uvm_report_catcher.svh:705) [UVM/REPORT/CATCHER]
--- UVM Report catcher Summary ---
chip_sw_lc_walkthrough_rma 12792702769525664641596205406337348654208908910517444223663929998351804928712 341
UVM_INFO @ 7510.258002 us: (uvm_report_catcher.svh:705) [UVM/REPORT/CATCHER]
--- UVM Report catcher Summary ---
chip_sw_lc_walkthrough_dev 32316184309548819752520267168666832998072051202187166123871304471562518732017 369
UVM_INFO @ 10617.578404 us: (uvm_report_catcher.svh:705) [UVM/REPORT/CATCHER]
--- UVM Report catcher Summary ---
chip_sw_lc_walkthrough_prod 20479869882069404368053669864365428478800508638880562518910516595111418053695 369
UVM_INFO @ 10292.655795 us: (uvm_report_catcher.svh:705) [UVM/REPORT/CATCHER]
--- UVM Report catcher Summary ---
chip_sw_lc_walkthrough_rma 72595357724339713391659259899300314156051284261953942833093034461097882413787 341
UVM_INFO @ 9361.094860 us: (uvm_report_catcher.svh:705) [UVM/REPORT/CATCHER]
--- UVM Report catcher Summary ---
chip_sw_lc_walkthrough_dev 28940885093973082733185265974552612674305305133373776215963414439911747875514 369
UVM_INFO @ 14478.130732 us: (uvm_report_catcher.svh:705) [UVM/REPORT/CATCHER]
--- UVM Report catcher Summary ---
chip_sw_lc_walkthrough_rma 43964662495160956595557241488155862932113063329547257085662516013430623791477 341
UVM_INFO @ 6685.325848 us: (uvm_report_catcher.svh:705) [UVM/REPORT/CATCHER]
--- UVM Report catcher Summary ---
UVM_ERROR @ * us: (chip_sw_base_vseq.sv:322) virtual_sequencer [chip_sw_base_vseq] SW TEST TIMED OUT. STATE: SwTestStatusInTest, TIMEOUT = * ns 7 test runs
chip_sw_hmac_multistream 155390726334082349699288062288039928918262508438126607145797377954007621586 348
UVM_INFO @ 12018.622772 us: (uvm_report_catcher.svh:705) [UVM/REPORT/CATCHER]
--- UVM Report catcher Summary ---
chip_sw_keymgr_sideload_otbn 45320483600169022618696709131014381452888268504308539880363770044000494408190 336
UVM_INFO @ 20026.886164 us: (uvm_report_catcher.svh:705) [UVM/REPORT/CATCHER]
--- UVM Report catcher Summary ---
chip_sw_hmac_multistream 103100941180294584972530565248522742354800762907125297012416649426507902417997 367
UVM_INFO @ 12026.914142 us: (uvm_report_catcher.svh:705) [UVM/REPORT/CATCHER]
--- UVM Report catcher Summary ---
chip_sw_keymgr_sideload_otbn 98209433562915046287581973631644636363042970706788553907799426408687613422919 336
UVM_INFO @ 20018.360848 us: (uvm_report_catcher.svh:705) [UVM/REPORT/CATCHER]
--- UVM Report catcher Summary ---
chip_sw_hmac_oneshot 77356061416023922490221577447338880550055779730593237340001429541721810640137 325
UVM_INFO @ 12026.776066 us: (uvm_report_catcher.svh:705) [UVM/REPORT/CATCHER]
--- UVM Report catcher Summary ---
chip_sw_hmac_multistream 80366138349833745434869147479823308911698092199337087318416244173980306194430 344
UVM_INFO @ 12018.593596 us: (uvm_report_catcher.svh:705) [UVM/REPORT/CATCHER]
--- UVM Report catcher Summary ---
chip_sw_keymgr_sideload_otbn 30027187085815980683222077591264099268429546291240265119436092944860601587965 336
UVM_INFO @ 20018.550600 us: (uvm_report_catcher.svh:705) [UVM/REPORT/CATCHER]
--- UVM Report catcher Summary ---
UVM_FATAL @ * us: (mem_bkdr_util.sv:658) [mem_bkdr_util[FlashBank0Data]] file empty_test_slot_a_corrupted_sim_dv.fake_ecdsa_prod_key_*.signed.*.scr.vmem could not be opened for r mode 6 test runs
rom_e2e_sigverify_always_a_bad_b_bad_prod 34493792489643448428659178313236216936195833578061242663546795865094270169094 367
UVM_INFO @ 10.360001 us: (uvm_report_catcher.svh:705) [UVM/REPORT/CATCHER]
--- UVM Report catcher Summary ---
rom_e2e_sigverify_always_a_bad_b_bad_prod_end 97461663164791427413128131098341118876784962033986579603441145533086517209778 366
UVM_INFO @ 10.340001 us: (uvm_report_catcher.svh:705) [UVM/REPORT/CATCHER]
--- UVM Report catcher Summary ---
rom_e2e_sigverify_always_a_bad_b_bad_rma 71604755926875214443294651967902424464573841495676167453460188624566218822741 366
UVM_INFO @ 10.220001 us: (uvm_report_catcher.svh:705) [UVM/REPORT/CATCHER]
--- UVM Report catcher Summary ---
rom_e2e_sigverify_always_a_bad_b_nothing_prod 61893788779228773136586036671316646340950386818438547664399500349802393232060 328
UVM_INFO @ 10.220001 us: (uvm_report_catcher.svh:705) [UVM/REPORT/CATCHER]
--- UVM Report catcher Summary ---
rom_e2e_sigverify_always_a_bad_b_nothing_prod_end 61005951434429151806883858042496487343250419187867488202915986064913454085011 325
UVM_INFO @ 10.360001 us: (uvm_report_catcher.svh:705) [UVM/REPORT/CATCHER]
--- UVM Report catcher Summary ---
rom_e2e_sigverify_always_a_bad_b_nothing_rma 90257900147695069820120089204816926135343407307500460092677984654525144673945 328
UVM_INFO @ 10.260001 us: (uvm_report_catcher.svh:705) [UVM/REPORT/CATCHER]
--- UVM Report catcher Summary ---
UVM_FATAL @ * us: (sec_cm_pkg.sv:48) [sec_cm_pkg::find_sec_cm_if_proxy] no proxy with path *rstmgr.u_d0_spi_host*.leaf_rst_path 3 test runs
chip_sw_rstmgr_rst_cnsty_escalation 76987862729329039668970346383156025214851813434191601966871117632692827425486 301
UVM_INFO @ 10.380001 us: (uvm_report_catcher.svh:705) [UVM/REPORT/CATCHER]
--- UVM Report catcher Summary ---
chip_sw_rstmgr_rst_cnsty_escalation 14501692735242352579249965735214196289291987427494300496928788596799183263093 301
UVM_INFO @ 10.140001 us: (uvm_report_catcher.svh:705) [UVM/REPORT/CATCHER]
--- UVM Report catcher Summary ---
chip_sw_rstmgr_rst_cnsty_escalation 109427075470725283057354251261636515228157626887129787259570475655029346809960 301
UVM_INFO @ 10.100001 us: (uvm_report_catcher.svh:705) [UVM/REPORT/CATCHER]
--- UVM Report catcher Summary ---
UVM_ERROR @ * us: (sw_logger_if.sv:526) [flash_ctrl_lc_rw_en_test_sim_dv(sw/device/lib/testing/test_framework/ottf_alerts.c:172)] ERROR: Alert * is asserted but not expected 3 test runs
chip_sw_flash_ctrl_lc_rw_en 12806602446807803721531931836879559719130295149598619514813799992548716419889 309
UVM_INFO @ 3943.253472 us: (uvm_report_catcher.svh:705) [UVM/REPORT/CATCHER]
--- UVM Report catcher Summary ---
chip_sw_flash_ctrl_lc_rw_en 93950677234436294407885539930319077384104813643809083446362110307706152058640 309
UVM_INFO @ 3363.508289 us: (uvm_report_catcher.svh:705) [UVM/REPORT/CATCHER]
--- UVM Report catcher Summary ---
chip_sw_flash_ctrl_lc_rw_en 16050016171748456491257763650566870032273709108402861351001605445648979464825 309
UVM_INFO @ 4160.981058 us: (uvm_report_catcher.svh:705) [UVM/REPORT/CATCHER]
--- UVM Report catcher Summary ---
UVM_ERROR @ * us: (sw_logger_if.sv:526) [otp_ctrl_lc_signals_test_sim_dv(sw/device/lib/testing/otp_ctrl_testutils.c:39)] Expected a DAI error for access to * 3 test runs
chip_sw_otp_ctrl_lc_signals_rma 26538130621073321097198446418788994346347029657173423744443965261957074458297 342
UVM_INFO @ 8567.555431 us: (uvm_report_catcher.svh:705) [UVM/REPORT/CATCHER]
--- UVM Report catcher Summary ---
chip_sw_otp_ctrl_lc_signals_rma 30128312410107390258614910770496093607888745696470233000788128545473868322158 342
UVM_INFO @ 8982.174060 us: (uvm_report_catcher.svh:705) [UVM/REPORT/CATCHER]
--- UVM Report catcher Summary ---
chip_sw_otp_ctrl_lc_signals_rma 35666901922125067390492943023636633280270330174753152370800840558766742170 342
UVM_INFO @ 8672.322045 us: (uvm_report_catcher.svh:705) [UVM/REPORT/CATCHER]
--- UVM Report catcher Summary ---
Offending '((~rst_ni) === (~seed_en_q))' 3 test runs
chip_sw_pwrmgr_full_aon_reset 95178345778165126177943066793589751715575609859246325369943670579433471758083 303
UVM_ERROR @ 2924.250000 us: (otbn_rnd.sv:233) [ASSERT FAILED] UrndNoReseedOnReset_A
UVM_INFO @ 2924.250000 us: (uvm_report_catcher.svh:705) [UVM/REPORT/CATCHER]
--- UVM Report catcher Summary ---
chip_sw_pwrmgr_full_aon_reset 10387110597038721590281655849369396735184674542625423455904839793195501646491 318
UVM_ERROR @ 6750.606548 us: (otbn_rnd.sv:233) [ASSERT FAILED] UrndNoReseedOnReset_A
UVM_INFO @ 6750.606548 us: (uvm_report_catcher.svh:705) [UVM/REPORT/CATCHER]
--- UVM Report catcher Summary ---
chip_sw_pwrmgr_full_aon_reset 42077981471467998745686352100894120605347249196538026689853156237470173861700 318
UVM_ERROR @ 6638.324634 us: (otbn_rnd.sv:233) [ASSERT FAILED] UrndNoReseedOnReset_A
UVM_INFO @ 6638.324634 us: (uvm_report_catcher.svh:705) [UVM/REPORT/CATCHER]
--- UVM Report catcher Summary ---
Offending '(!$fell((pwrmgr_data_o.done == MuBi4True)))' 3 test runs
chip_sw_pwrmgr_sleep_power_glitch_reset 24779755472422825751383293722022638992308238374174258537558621457228056405456 313
UVM_ERROR @ 3290.647180 us: (rom_ctrl.sv:590) [ASSERT FAILED] PwrmgrDataChk_A
UVM_INFO @ 3290.647180 us: (uvm_report_catcher.svh:705) [UVM/REPORT/CATCHER]
--- UVM Report catcher Summary ---
chip_sw_pwrmgr_sleep_power_glitch_reset 79964125014809637030723018551800529076748697656517738446156368873670978040890 313
UVM_ERROR @ 3181.154750 us: (rom_ctrl.sv:590) [ASSERT FAILED] PwrmgrDataChk_A
UVM_INFO @ 3181.154750 us: (uvm_report_catcher.svh:705) [UVM/REPORT/CATCHER]
--- UVM Report catcher Summary ---
chip_sw_pwrmgr_sleep_power_glitch_reset 11201762976858338538136590579184180810132080441170207993448024830802435034783 313
UVM_ERROR @ 3610.946500 us: (rom_ctrl.sv:590) [ASSERT FAILED] PwrmgrDataChk_A
UVM_INFO @ 3610.946500 us: (uvm_report_catcher.svh:705) [UVM/REPORT/CATCHER]
--- UVM Report catcher Summary ---
UVM_ERROR @ * us: (sw_logger_if.sv:526) [clkmgr_jitter_frequency_test_sim_dv(sw/device/lib/testing/test_framework/ottf_alerts.c:172)] ERROR: Alert * is asserted but not expected 3 test runs
chip_sw_clkmgr_jitter_frequency 46443499375751973698506053511466506370243464711860726176559966475539691217485 348
UVM_INFO @ 4405.251799 us: (uvm_report_catcher.svh:705) [UVM/REPORT/CATCHER]
--- UVM Report catcher Summary ---
chip_sw_clkmgr_jitter_frequency 96162934292577975563821325081942074285627548594294340838394084900798161227493 343
UVM_INFO @ 4120.678412 us: (uvm_report_catcher.svh:705) [UVM/REPORT/CATCHER]
--- UVM Report catcher Summary ---
chip_sw_clkmgr_jitter_frequency 81175818455952484856939088946487354832134523377373888948473417561498794907746 343
UVM_INFO @ 3660.676975 us: (uvm_report_catcher.svh:705) [UVM/REPORT/CATCHER]
--- UVM Report catcher Summary ---
UVM_FATAL @ * us: (chip_sw_rv_dm_access_after_wakeup_vseq.sv:93) [chip_sw_rv_dm_access_after_wakeup_vseq] Timed out waiting for device to wakeup from deep sleep. 3 test runs
chip_sw_rv_dm_access_after_wakeup 98869005625378302636039948392393701662453174099600361338996818116436550970058 329
UVM_INFO @ 13978.476606 us: (uvm_report_catcher.svh:705) [UVM/REPORT/CATCHER]
--- UVM Report catcher Summary ---
chip_sw_rv_dm_access_after_wakeup 115700709690190786809112057143939265244052273874185184660818314142295459030351 329
UVM_INFO @ 13474.494094 us: (uvm_report_catcher.svh:705) [UVM/REPORT/CATCHER]
--- UVM Report catcher Summary ---
chip_sw_rv_dm_access_after_wakeup 98731723450201676260785006476635583625012848991953844261573625671501523208455 329
UVM_INFO @ 14183.632602 us: (uvm_report_catcher.svh:705) [UVM/REPORT/CATCHER]
--- UVM Report catcher Summary ---
UVM_FATAL @ * us: (chip_sw_power_idle_load_vseq.sv:24) [chip_sw_power_idle_load_vseq] timeout waiting for SW sync GPIO (*) 3 test runs
chip_sw_power_idle_load 92700305092634164165459134420141674906522859119729480547697068087852203985524 318
UVM_INFO @ 15273.395444 us: (uvm_report_catcher.svh:705) [UVM/REPORT/CATCHER]
--- UVM Report catcher Summary ---
chip_sw_power_idle_load 36297343828138886237904899486504739964911734489584252225717511049274069888062 318
UVM_INFO @ 15853.837000 us: (uvm_report_catcher.svh:705) [UVM/REPORT/CATCHER]
--- UVM Report catcher Summary ---
chip_sw_power_idle_load 31624591418813427470189846077107970056536374685390948560795703887796147303809 318
UVM_INFO @ 15201.362320 us: (uvm_report_catcher.svh:705) [UVM/REPORT/CATCHER]
--- UVM Report catcher Summary ---
UVM_FATAL @ * us: (chip_sw_power_sleep_load_vseq.sv:47) [chip_sw_power_sleep_load_vseq] timeout waiting for SW sync GPIO (*) 3 test runs
chip_sw_power_sleep_load 79027006165744544972056204278126525081905890029087104843161633280340604359999 329
UVM_INFO @ 15375.078322 us: (uvm_report_catcher.svh:705) [UVM/REPORT/CATCHER]
--- UVM Report catcher Summary ---
chip_sw_power_sleep_load 63598503854242218601222761681716653070390291180729612592524496339626987022053 337
UVM_INFO @ 14898.877122 us: (uvm_report_catcher.svh:705) [UVM/REPORT/CATCHER]
--- UVM Report catcher Summary ---
chip_sw_power_sleep_load 41674524318802418317076849499900523976827799567615229151922561360188192239136 329
UVM_INFO @ 15622.219150 us: (uvm_report_catcher.svh:705) [UVM/REPORT/CATCHER]
--- UVM Report catcher Summary ---
UVM_ERROR @ * us: (sw_logger_if.sv:526) [ast_clk_rst_inputs_sim_dv(sw/device/lib/testing/autogen/isr_testutils.c:41)] CHECK-fail: Only adc_ctrl IRQ * expected to fire. Actual IRQ state = * 3 test runs
chip_sw_ast_clk_rst_inputs 11329342639039283591765148437572224720419867322067392631955993634981516403060 327
UVM_INFO @ 13057.938237 us: (uvm_report_catcher.svh:705) [UVM/REPORT/CATCHER]
--- UVM Report catcher Summary ---
chip_sw_ast_clk_rst_inputs 90171379401174479237443986096642101758678199736163960356115667268621868315878 327
UVM_INFO @ 10956.321277 us: (uvm_report_catcher.svh:705) [UVM/REPORT/CATCHER]
--- UVM Report catcher Summary ---
chip_sw_ast_clk_rst_inputs 34291605401427313669935065248323893870831246840889794732654586395878576654247 327
UVM_INFO @ 17330.420882 us: (uvm_report_catcher.svh:705) [UVM/REPORT/CATCHER]
--- UVM Report catcher Summary ---
UVM_FATAL @ * us: (csr_utils_pkg.sv:614) [csr_utils_pkg::csr_spinwait.isolation_fork] timeout chip_reg_block.spi_device.cmd_info_*.opcode (addr=*, Comparison=CompareOpEq, exp_data=*, call_count=1) 3 test runs
ate_bootstrap_flash_erase 99063545975937865256936347655841934199659219017475404857253734155432456553714 272
UVM_INFO @ 10010.380001 us: (uvm_report_catcher.svh:705) [UVM/REPORT/CATCHER]
--- UVM Report catcher Summary ---
ate_bootstrap_flash_erase 40711062699651886463434287916659367378846429719303947927169830313450859060078 272
UVM_INFO @ 10010.140001 us: (uvm_report_catcher.svh:705) [UVM/REPORT/CATCHER]
--- UVM Report catcher Summary ---
ate_bootstrap_flash_erase 20374440647223404880289388757580546939774501234637341764312418084608926470733 272
UVM_INFO @ 10010.340001 us: (uvm_report_catcher.svh:705) [UVM/REPORT/CATCHER]
--- UVM Report catcher Summary ---
UVM_ERROR @ * us: (chip_sw_rom_e2e_base_vseq.sv:37) [chip_sw_rom_e2e_shutdown_exception_c_vseq] Check failed "OpenTitan:*-*-* 3 test runs
rom_e2e_shutdown_exception_c 14350824262611150662518994500586974264314654796853282780643343737704200324077 319
" == "OpenTitan:4001-0002-01
"
UVM_INFO @ 5518.937289 us: (uvm_report_catcher.svh:705) [UVM/REPORT/CATCHER]
--- UVM Report catcher Summary ---
rom_e2e_shutdown_exception_c 94943919275649159780462553016543616116012308680658118723655112307238943066222 319
" == "OpenTitan:4001-0002-01
"
UVM_INFO @ 6831.062007 us: (uvm_report_catcher.svh:705) [UVM/REPORT/CATCHER]
--- UVM Report catcher Summary ---
rom_e2e_shutdown_exception_c 52063908193097603753574442329405854851470878412619851198385466615245758155720 319
" == "OpenTitan:4001-0002-01
"
UVM_INFO @ 4981.068729 us: (uvm_report_catcher.svh:705) [UVM/REPORT/CATCHER]
--- UVM Report catcher Summary ---
UVM_ERROR @ * us: (chip_sw_rom_e2e_base_vseq.sv:37) [chip_sw_rom_e2e_shutdown_output_vseq] Check failed "OpenTitan:*-*-* 3 test runs
rom_e2e_shutdown_output 103096879048735066342913274945798209587725801194123821324206346083317871770484 312
" == "OpenTitan:4001-0002-01
"
UVM_INFO @ 7872.238425 us: (uvm_report_catcher.svh:705) [UVM/REPORT/CATCHER]
--- UVM Report catcher Summary ---
rom_e2e_shutdown_output 94376151223394772483694842766835380107187553061176614103177430522596456324707 312
" == "OpenTitan:4001-0002-01
"
UVM_INFO @ 7964.137684 us: (uvm_report_catcher.svh:705) [UVM/REPORT/CATCHER]
--- UVM Report catcher Summary ---
rom_e2e_shutdown_output 85849229850032208318912862265500016454148274717889703213467600886121019594116 312
" == "OpenTitan:4001-0002-01
"
UVM_INFO @ 9574.835999 us: (uvm_report_catcher.svh:705) [UVM/REPORT/CATCHER]
--- UVM Report catcher Summary ---
UVM_FATAL @ * us: (mem_bkdr_util.sv:658) [mem_bkdr_util[FlashBank0Data]] file empty_test_slot_b_corrupted_sim_dv.fake_ecdsa_prod_key_*.signed.*.scr.vmem could not be opened for r mode 3 test runs
rom_e2e_sigverify_always_a_nothing_b_bad_prod 2437627548179000694542897729523009826146066039021857299575301320350636394819 325
UVM_INFO @ 10.380001 us: (uvm_report_catcher.svh:705) [UVM/REPORT/CATCHER]
--- UVM Report catcher Summary ---
rom_e2e_sigverify_always_a_nothing_b_bad_prod_end 53806200223775715929687330188268625148453515373140482872797452808278502731396 326
UVM_INFO @ 10.160001 us: (uvm_report_catcher.svh:705) [UVM/REPORT/CATCHER]
--- UVM Report catcher Summary ---
rom_e2e_sigverify_always_a_nothing_b_bad_rma 29133507387478068737337440934505869167593485803508792234175641622961870469518 325
UVM_INFO @ 10.240001 us: (uvm_report_catcher.svh:705) [UVM/REPORT/CATCHER]
--- UVM Report catcher Summary ---
UVM_ERROR @ * us: (sw_logger_if.sv:526) [rom_e2e_keymgr_init_otp_invalid_meas_sim_dv(sw/device/silicon_creator/rom/e2e/keymgr/rom_e2e_keymgr_init_test.c:38)] DIF-fail: dif_otp_ctrl_get_digest( &otp_ctrl, kDifOtpCtrlPartitionCreatorSwCfg, &creator_digest) returns * 3 test runs
rom_e2e_keymgr_init_rom_ext_invalid_meas 92447628171659728327049547570409163130803644900058919560300179516458710399526 319
UVM_INFO @ 17220.030376 us: (uvm_report_catcher.svh:705) [UVM/REPORT/CATCHER]
--- UVM Report catcher Summary ---
rom_e2e_keymgr_init_rom_ext_invalid_meas 37980207314650247918926390295818355599112123282547211888486561895375557333111 319
UVM_INFO @ 16597.188875 us: (uvm_report_catcher.svh:705) [UVM/REPORT/CATCHER]
--- UVM Report catcher Summary ---
rom_e2e_keymgr_init_rom_ext_invalid_meas 45509434926896320304272383539161638156745375771698954795313735192756041670256 319
UVM_INFO @ 15571.123247 us: (uvm_report_catcher.svh:705) [UVM/REPORT/CATCHER]
--- UVM Report catcher Summary ---
Offending '$stable(key_data_i)' 3 test runs
rom_keymgr_functest 108926023499768092422946389309220381561513692223863145962825226057497217985363 327
UVM_ERROR @ 5433.718854 us: (kmac_core.sv:464) [ASSERT FAILED] KeyDataStableWhenValid_M
UVM_INFO @ 5433.718854 us: (uvm_report_catcher.svh:705) [UVM/REPORT/CATCHER]
--- UVM Report catcher Summary ---
rom_keymgr_functest 102796743167049380976583998325230960539970901006475245917105699458194774119672 327
UVM_ERROR @ 6813.036898 us: (kmac_core.sv:464) [ASSERT FAILED] KeyDataStableWhenValid_M
UVM_INFO @ 6813.036898 us: (uvm_report_catcher.svh:705) [UVM/REPORT/CATCHER]
--- UVM Report catcher Summary ---
rom_keymgr_functest 99015778064384310001263916780886004116562565389475850418477917935681656919293 327
UVM_ERROR @ 5338.996640 us: (kmac_core.sv:464) [ASSERT FAILED] KeyDataStableWhenValid_M
UVM_INFO @ 5338.996640 us: (uvm_report_catcher.svh:705) [UVM/REPORT/CATCHER]
--- UVM Report catcher Summary ---
UVM_ERROR @ * us: (sw_logger_if.sv:526) [all_escalation_resets_test_sim_dv(sw/device/tests/sim_dv/all_escalation_resets_test.c:631)] CHECK-fail: Unexpected mtval: expected *, got * 3 test runs
chip_sw_all_escalation_resets 106721238664670947207535470813772720461646329070361644002727839986008508313667 317
UVM_INFO @ 4492.250309 us: (uvm_report_catcher.svh:705) [UVM/REPORT/CATCHER]
--- UVM Report catcher Summary ---
chip_sw_all_escalation_resets 6659458201748650168843695951719736541091128532596689326429222540000389244443 317
UVM_INFO @ 3828.259404 us: (uvm_report_catcher.svh:705) [UVM/REPORT/CATCHER]
--- UVM Report catcher Summary ---
chip_sw_all_escalation_resets 53214842003635578521077827633000741927256142399417214353748764101587755869562 317
UVM_INFO @ 2739.094125 us: (uvm_report_catcher.svh:705) [UVM/REPORT/CATCHER]
--- UVM Report catcher Summary ---
UVM_ERROR @ * us: (sw_logger_if.sv:526) [spi_passthrough_test_sim_dv(sw/device/tests/sim_dv/spi_passthrough_test.c:382)] CHECK-fail: irq == kDtSpiDeviceIrqUploadCmdfifoNotEmpty 2 test runs
chip_sw_spi_device_pass_through_collision 42506771857558751352256939257109898335435123304282578281157002285687114246450 327
UVM_INFO @ 3412.348839 us: (uvm_report_catcher.svh:705) [UVM/REPORT/CATCHER]
--- UVM Report catcher Summary ---
chip_sw_spi_device_pass_through_collision 71961514309621147201278582492117844202182484345978375628032809602166118569905 327
UVM_INFO @ 3535.388792 us: (uvm_report_catcher.svh:705) [UVM/REPORT/CATCHER]
--- UVM Report catcher Summary ---
Offending '(!$fell(lc_ctrl_pkg::lc_tx_test_true_strict(lc_init_done_o)))' 2 test runs
chip_sw_otp_ctrl_escalation 33027739454513107417795914446210589854481337132897170208496324098057753776376 316
UVM_ERROR @ 4171.573156 us: (lc_ctrl.sv:884) [ASSERT FAILED] LcInitDoneSticky_A
UVM_INFO @ 4171.573156 us: (uvm_report_catcher.svh:705) [UVM/REPORT/CATCHER]
--- UVM Report catcher Summary ---
chip_sw_all_escalation_resets 27023429566629477315093084417961997470539259945701118528894435459162265127901 317
UVM_ERROR @ 4174.287932 us: (lc_ctrl.sv:884) [ASSERT FAILED] LcInitDoneSticky_A
UVM_INFO @ 4174.287932 us: (uvm_report_catcher.svh:705) [UVM/REPORT/CATCHER]
--- UVM Report catcher Summary ---
UVM_ERROR @ * us: (cip_base_vseq.sv:660) [chip_rv_dm_lc_disabled_vseq] Check failed masked_data == exp_data (* [*] vs * [*]) addr * read out mismatch 2 test runs
chip_rv_dm_lc_disabled 59026517464479817043718998904929838998402405061836230184084829598243476217180 277
UVM_INFO @ 18000.476175 us: (uvm_report_catcher.svh:705) [UVM/REPORT/CATCHER]
--- UVM Report catcher Summary ---
chip_rv_dm_lc_disabled 63646967751231606634340289093256818055482417776115548788837673753824036795803 225
UVM_INFO @ 5215.280460 us: (uvm_report_catcher.svh:705) [UVM/REPORT/CATCHER]
--- UVM Report catcher Summary ---
UVM_FATAL @ * us: (mem_bkdr_util.sv:658) [mem_bkdr_util[FlashBank0Data]] file empty_test_slot_a_corrupted_sim_dv.fake_ecdsa_test_key_*.signed.*.scr.vmem could not be opened for r mode 2 test runs
rom_e2e_sigverify_always_a_bad_b_bad_test_unlocked0 60680002668295051652144266370990859184929200084551683226355020031348025044116 362
UVM_INFO @ 10.380001 us: (uvm_report_catcher.svh:705) [UVM/REPORT/CATCHER]
--- UVM Report catcher Summary ---
rom_e2e_sigverify_always_a_bad_b_nothing_test_unlocked0 85848670059024174429646893320925003617086355645035032834284782824781980637033 326
UVM_INFO @ 10.300001 us: (uvm_report_catcher.svh:705) [UVM/REPORT/CATCHER]
--- UVM Report catcher Summary ---
UVM_FATAL @ * us: (mem_bkdr_util.sv:658) [mem_bkdr_util[FlashBank0Data]] file empty_test_slot_a_corrupted_sim_dv.fake_ecdsa_dev_key_*.signed.*.scr.vmem could not be opened for r mode 2 test runs
rom_e2e_sigverify_always_a_bad_b_bad_dev 92796276376634142922205339987755312460639498236417133034090738611549184494928 368
UVM_INFO @ 10.240001 us: (uvm_report_catcher.svh:705) [UVM/REPORT/CATCHER]
--- UVM Report catcher Summary ---
rom_e2e_sigverify_always_a_bad_b_nothing_dev 18103878678330431714524323115547311544632293444472141661707390480418574642915 328
UVM_INFO @ 10.400001 us: (uvm_report_catcher.svh:705) [UVM/REPORT/CATCHER]
--- UVM Report catcher Summary ---
Offending '(rv_jtag_o == '0)' 2 test runs
chip_sw_rv_dm_access_after_escalation_reset 55620434287961771261215406992956187233221607832376584644666287189513810290676 311
UVM_ERROR @ 4528.394556 us: (pinmux_strap_sampling.sv:516) [ASSERT FAILED] RvTapOff1_A
UVM_INFO @ 4528.394556 us: (uvm_report_catcher.svh:705) [UVM/REPORT/CATCHER]
--- UVM Report catcher Summary ---
chip_sw_rv_dm_access_after_escalation_reset 88619756275874760693838152000167896978500958971790541190231598454772421869157 311
UVM_ERROR @ 4107.406626 us: (pinmux_strap_sampling.sv:516) [ASSERT FAILED] RvTapOff1_A
UVM_INFO @ 4107.406626 us: (uvm_report_catcher.svh:705) [UVM/REPORT/CATCHER]
--- UVM Report catcher Summary ---
UVM_FATAL @ * us: (mem_bkdr_util.sv:658) [mem_bkdr_util[Otp]] file otp_img_test_unlocked0_manuf_empty.*.vmem could not be opened for r mode 1 test run
chip_sw_otp_ctrl_rot_auth_config 37905648009488457812085372619178079602048088114052759385239437435817166806487 282
UVM_INFO @ 0.000000 us: (uvm_report_catcher.svh:705) [UVM/REPORT/CATCHER]
--- UVM Report catcher Summary ---
UVM_ERROR @ * us: (sw_logger_if.sv:526) [alert_test_sim_dv(hw/top_earlgrey/sw/autogen/tests/alert_test.c:372)] CHECK-fail: Expect alert *! 1 test run
chip_sw_alert_test 84418754272261914869540159517499710564359348680497411141806390649501895530263 307
UVM_INFO @ 3549.434100 us: (uvm_report_catcher.svh:705) [UVM/REPORT/CATCHER]
--- UVM Report catcher Summary ---
UVM_FATAL @ * us: (chip_sw_base_vseq.sv:864) virtual_sequencer [chip_sw_lc_ctrl_transition_vseq] max attempt reached to get lc status LcExtClockSwitched! 1 test run
chip_sw_clkmgr_external_clk_src_for_lc 37300498190536118350346181476171807739869560614330435936942552674292732611094 306
UVM_INFO @ 26179.107975 us: (uvm_report_catcher.svh:705) [UVM/REPORT/CATCHER]
--- UVM Report catcher Summary ---
UVM_ERROR @ * us: (sw_logger_if.sv:526) [pwrmgr_lowpower_cancel_test_sim_dv(sw/device/tests/pwrmgr_lowpower_cancel_test.c:78)] CHECK-fail: Timed out after * usec (* CPU cycles) waiting for !get_wakeup_status() 1 test run
chip_sw_pwrmgr_lowpower_cancel 33679760032296354812508595100033300229587625912330305345093816410501983966009 311
UVM_INFO @ 4507.428671 us: (uvm_report_catcher.svh:705) [UVM/REPORT/CATCHER]
--- UVM Report catcher Summary ---
UVM_FATAL @ * us: (mem_bkdr_util.sv:658) [mem_bkdr_util[FlashBank0Data]] file empty_test_slot_b_corrupted_sim_dv.fake_ecdsa_test_key_*.signed.*.scr.vmem could not be opened for r mode 1 test run
rom_e2e_sigverify_always_a_nothing_b_bad_test_unlocked0 82922453760347981318521089025333543408199196138615156102738485065852678363601 325
UVM_INFO @ 10.140001 us: (uvm_report_catcher.svh:705) [UVM/REPORT/CATCHER]
--- UVM Report catcher Summary ---
UVM_FATAL @ * us: (mem_bkdr_util.sv:658) [mem_bkdr_util[FlashBank0Data]] file empty_test_slot_b_corrupted_sim_dv.fake_ecdsa_dev_key_*.signed.*.scr.vmem could not be opened for r mode 1 test run
rom_e2e_sigverify_always_a_nothing_b_bad_dev 32678138495312616827640873539564084287715964481670084809225024163525922947153 328
UVM_INFO @ 10.260001 us: (uvm_report_catcher.svh:705) [UVM/REPORT/CATCHER]
--- UVM Report catcher Summary ---
UVM_ERROR @ * us: (sw_logger_if.sv:526) [rom_e2e_keymgr_init_otp_no_meas_sim_dv(sw/device/silicon_creator/rom/e2e/keymgr/rom_e2e_keymgr_init_test.c:38)] DIF-fail: dif_otp_ctrl_get_digest( &otp_ctrl, kDifOtpCtrlPartitionCreatorSwCfg, &creator_digest) returns * 1 test run
rom_e2e_keymgr_init_rom_ext_no_meas 99760332010028144586593067560310935260149868399218633475073250886633800674905 319
UVM_INFO @ 17347.093304 us: (uvm_report_catcher.svh:705) [UVM/REPORT/CATCHER]
--- UVM Report catcher Summary ---
UVM_ERROR @ * us: (chip_sw_spi_passthrough_collision_vseq.sv:183) virtual_sequencer [chip_sw_spi_passthrough_collision_vseq] Compare mismatch 1 test run
chip_sw_spi_device_pass_through_collision 19147646661029006423488489550022356610418725995415312400206989849279010006700 329
host_rsp:
-------------------------------------------------------------------------
Name Type Size Value
-------------------------------------------------------------------------
Offending '(!rstreqs[pwrmgr_reg_pkg::ResetMainPwrIdx])' 1 test run
chip_sw_pwrmgr_random_sleep_power_glitch_reset 32886423254688160103319992659196381090547135352871093470966976780128218980059 328
UVM_ERROR @ 10074.700000 us: (pwrmgr_rstreqs_sva_if.sv:79) [ASSERT FAILED] MainPwrRstOff_A
UVM_INFO @ 10074.700000 us: (uvm_report_catcher.svh:705) [UVM/REPORT/CATCHER]
--- UVM Report catcher Summary ---
UVM_FATAL @ * us: (chip_sw_sysrst_ctrl_ec_rst_l_vseq.sv:138) [chip_sw_sysrst_ctrl_ec_rst_l_vseq] Timed out waiting for ec_rst to go high. 1 test run
chip_sw_sysrst_ctrl_ec_rst_l 12213356887135425470072902764583708766813638631153154096886127138516100338606 311
UVM_INFO @ 5010.320001 us: (uvm_report_catcher.svh:705) [UVM/REPORT/CATCHER]
--- UVM Report catcher Summary ---
UVM_ERROR @ * us: (sw_logger_if.sv:526) [alert_test_sim_dv(hw/top_earlgrey/sw/autogen/tests/alert_test.c:402)] CHECK-fail: Expect alert *! 1 test run
chip_sw_alert_test 37028193452341320792674757655042595123593389165471192110907176565507984929857 307
UVM_INFO @ 3385.919195 us: (uvm_report_catcher.svh:705) [UVM/REPORT/CATCHER]
--- UVM Report catcher Summary ---
UVM_ERROR @ * us: (chip_sw_sleep_pin_mio_dio_val_vseq.sv:92) [chip_sw_sleep_pin_mio_dio_val_vseq] Check failed cfg.chip_vif.mios_if.pins[i] === exp (* [*] vs *xz [z]) for MIO[*] 1 test run
chip_sw_sleep_pin_mio_dio_val 41346053004708378209341997510710723736331153897993169973833516300453676948478 451
UVM_INFO @ 3891.340000 us: (uvm_report_catcher.svh:705) [UVM/REPORT/CATCHER]
--- UVM Report catcher Summary ---
UVM_FATAL @ * us: (chip_sw_base_vseq.sv:864) virtual_sequencer [chip_sw_lc_walkthrough_vseq] max attempt reached to get lc status LcExtClockSwitched! 1 test run
chip_sw_lc_walkthrough_prod 97601711546541419148359362269545588386856513595770882929132962914310689175708 308
UVM_INFO @ 27121.583567 us: (uvm_report_catcher.svh:705) [UVM/REPORT/CATCHER]
--- UVM Report catcher Summary ---
UVM_FATAL @ * us: (chip_sw_base_vseq.sv:864) virtual_sequencer [chip_sw_lc_volatile_raw_unlock_vseq] max attempt reached to get lc status LcExtClockSwitched! 1 test run
chip_sw_lc_ctrl_volatile_raw_unlock_ext_clk_48mhz 94720075037484811528711487288459353394573600668675952912663036227722127817680 309
UVM_INFO @ 27260.366675 us: (uvm_report_catcher.svh:705) [UVM/REPORT/CATCHER]
--- UVM Report catcher Summary ---
UVM_ERROR @ * us: (sw_logger_if.sv:526) [alert_test_sim_dv(hw/top_earlgrey/sw/autogen/tests/alert_test.c:342)] CHECK-fail: Expect alert *! 1 test run
chip_sw_alert_test 96492189010144395385578658776261821211396900409549086283029411005629385451968 307
UVM_INFO @ 2947.192239 us: (uvm_report_catcher.svh:705) [UVM/REPORT/CATCHER]
--- UVM Report catcher Summary ---
UVM_ERROR @ * us: (cip_base_vseq.sv:923) virtual_sequencer [chip_sw_all_escalation_resets_vseq] Alert usbdev_fatal_fault fired unexpectedly. 1 test run
chip_sw_all_escalation_resets 21399213350164489028355551134232177655649237023960069859505548410355922113090 316
UVM_INFO @ 3082.343664 us: (uvm_report_catcher.svh:705) [UVM/REPORT/CATCHER]
--- UVM Report catcher Summary ---