Simulation Results: aes/masked

 
08/08/2026 02:25:00 DVSim: v1.49.0 sha: d313c71 json Branch: master Tool: xcelium [unknown]
Coverage statistics
  • Total
  • 97.37 %
  • code
  • 96.59 %
  • assert
  • 98.38 %
  • func
  • 97.13 %
  • block
  • 96.92 %
  • line
  • 97.83 %
  • branch
  • 92.69 %
  • toggle
  • 98.08 %
  • FSM
  • 97.78 %
Validation stages
V1
100.00%
V2
96.33%
V2S
91.43%
V3
0.00%
Testpoint Test Max Runtime Sim Time Pass Total %
wake_up 1 1 100.00
aes_wake_up 2.000s 66.346us 1 1 100.00
smoke 10 10 100.00
aes_smoke 4.000s 365.776us 10 10 100.00
csr_hw_reset 1 1 100.00
aes_csr_hw_reset 2.000s 56.680us 1 1 100.00
csr_rw 5 5 100.00
aes_csr_rw 2.000s 61.910us 5 5 100.00
csr_bit_bash 1 1 100.00
aes_csr_bit_bash 6.000s 3921.821us 1 1 100.00
csr_aliasing 1 1 100.00
aes_csr_aliasing 20.000s 203.343us 1 1 100.00
csr_mem_rw_with_rand_reset 5 5 100.00
aes_csr_mem_rw_with_rand_reset 2.000s 91.483us 5 5 100.00
regwen_csr_and_corresponding_lockable_csr 6 6 100.00
aes_csr_rw 2.000s 61.910us 5 5 100.00
aes_csr_aliasing 20.000s 203.343us 1 1 100.00
Testpoint Test Max Runtime Sim Time Pass Total %
algorithm 70 70 100.00
aes_smoke 4.000s 365.776us 10 10 100.00
aes_config_error 23.000s 119.118us 50 50 100.00
aes_stress 6.000s 339.015us 10 10 100.00
key_length 70 70 100.00
aes_smoke 4.000s 365.776us 10 10 100.00
aes_config_error 23.000s 119.118us 50 50 100.00
aes_stress 6.000s 339.015us 10 10 100.00
back2back 35 35 100.00
aes_stress 6.000s 339.015us 10 10 100.00
aes_b2b 34.000s 169.102us 25 25 100.00
backpressure 10 10 100.00
aes_stress 6.000s 339.015us 10 10 100.00
multi_message 94 95 98.95
aes_smoke 4.000s 365.776us 10 10 100.00
aes_config_error 23.000s 119.118us 50 50 100.00
aes_stress 6.000s 339.015us 10 10 100.00
aes_alert_reset 31.000s 106.227us 24 25 96.00
failure_test 84 85 98.82
aes_man_cfg_err 5.000s 277.675us 10 10 100.00
aes_config_error 23.000s 119.118us 50 50 100.00
aes_alert_reset 31.000s 106.227us 24 25 96.00
trigger_clear_test 10 10 100.00
aes_clear 33.000s 630.089us 10 10 100.00
nist_test_vectors 1 1 100.00
aes_nist_vectors 19.000s 919.510us 1 1 100.00
reset_recovery 24 25 96.00
aes_alert_reset 31.000s 106.227us 24 25 96.00
stress 10 10 100.00
aes_stress 6.000s 339.015us 10 10 100.00
sideload 20 20 100.00
aes_stress 6.000s 339.015us 10 10 100.00
aes_sideload 8.000s 541.160us 10 10 100.00
deinitialization 10 10 100.00
aes_deinit 4.000s 313.638us 10 10 100.00
stress_all 3 10 30.00
aes_stress_all 33.000s 700.001us 3 10 30.00
alert_test 10 10 100.00
aes_alert_test 30.000s 91.059us 10 10 100.00
tl_d_oob_addr_access 25 25 100.00
aes_tl_errors 4.000s 786.680us 25 25 100.00
tl_d_illegal_access 25 25 100.00
aes_tl_errors 4.000s 786.680us 25 25 100.00
tl_d_outstanding_access 12 12 100.00
aes_csr_hw_reset 2.000s 56.680us 1 1 100.00
aes_csr_rw 2.000s 61.910us 5 5 100.00
aes_csr_aliasing 20.000s 203.343us 1 1 100.00
aes_same_csr_outstanding 3.000s 90.507us 5 5 100.00
tl_d_partial_access 12 12 100.00
aes_csr_hw_reset 2.000s 56.680us 1 1 100.00
aes_csr_rw 2.000s 61.910us 5 5 100.00
aes_csr_aliasing 20.000s 203.343us 1 1 100.00
aes_same_csr_outstanding 3.000s 90.507us 5 5 100.00
Testpoint Test Max Runtime Sim Time Pass Total %
reseeding 6 10 60.00
aes_reseed 31.000s 1329.202us 6 10 60.00
fault_inject 585 660 88.64
aes_fi 7.000s 425.555us 1 10 10.00
aes_control_fi 61.000s 0.000us 262 300 87.33
aes_cipher_fi 61.000s 0.000us 322 350 92.00
shadow_reg_update_error 20 20 100.00
aes_shadow_reg_errors 3.000s 327.324us 20 20 100.00
shadow_reg_read_clear_staged_value 20 20 100.00
aes_shadow_reg_errors 3.000s 327.324us 20 20 100.00
shadow_reg_storage_error 20 20 100.00
aes_shadow_reg_errors 3.000s 327.324us 20 20 100.00
shadowed_reset_glitch 20 20 100.00
aes_shadow_reg_errors 3.000s 327.324us 20 20 100.00
shadow_reg_update_error_with_csr_rw 20 20 100.00
aes_shadow_reg_errors_with_csr_rw 4.000s 372.479us 20 20 100.00
tl_intg_err 30 30 100.00
aes_sec_cm 13.000s 1602.405us 5 5 100.00
aes_tl_intg_err 4.000s 323.675us 25 25 100.00
sec_cm_bus_integrity 25 25 100.00
aes_tl_intg_err 4.000s 323.675us 25 25 100.00
sec_cm_lc_escalate_en_intersig_mubi 24 25 96.00
aes_alert_reset 31.000s 106.227us 24 25 96.00
sec_cm_main_config_shadow 20 20 100.00
aes_shadow_reg_errors 3.000s 327.324us 20 20 100.00
sec_cm_gcm_config_shadow 20 20 100.00
aes_shadow_reg_errors 3.000s 327.324us 20 20 100.00
sec_cm_main_config_sparse 140 145 96.55
aes_smoke 4.000s 365.776us 10 10 100.00
aes_stress 6.000s 339.015us 10 10 100.00
aes_alert_reset 31.000s 106.227us 24 25 96.00
aes_core_fi 34.000s 10018.929us 96 100 96.00
sec_cm_gcm_config_sparse 156 160 97.50
aes_config_error 23.000s 119.118us 50 50 100.00
aes_stress 6.000s 339.015us 10 10 100.00
aes_core_fi 34.000s 10018.929us 96 100 96.00
sec_cm_aux_config_shadow 20 20 100.00
aes_shadow_reg_errors 3.000s 327.324us 20 20 100.00
sec_cm_aux_config_regwen 20 20 100.00
aes_readability 3.000s 72.355us 10 10 100.00
aes_stress 6.000s 339.015us 10 10 100.00
sec_cm_key_sideload 20 20 100.00
aes_stress 6.000s 339.015us 10 10 100.00
aes_sideload 8.000s 541.160us 10 10 100.00
sec_cm_key_sw_unreadable 10 10 100.00
aes_readability 3.000s 72.355us 10 10 100.00
sec_cm_data_reg_sw_unreadable 10 10 100.00
aes_readability 3.000s 72.355us 10 10 100.00
sec_cm_key_sec_wipe 10 10 100.00
aes_readability 3.000s 72.355us 10 10 100.00
sec_cm_iv_config_sec_wipe 10 10 100.00
aes_readability 3.000s 72.355us 10 10 100.00
sec_cm_data_reg_sec_wipe 10 10 100.00
aes_readability 3.000s 72.355us 10 10 100.00
sec_cm_data_reg_key_sca 10 10 100.00
aes_stress 6.000s 339.015us 10 10 100.00
sec_cm_key_masking 10 10 100.00
aes_stress 6.000s 339.015us 10 10 100.00
sec_cm_main_fsm_sparse 1 10 10.00
aes_fi 7.000s 425.555us 1 10 10.00
sec_cm_main_fsm_redun 610 685 89.05
aes_fi 7.000s 425.555us 1 10 10.00
aes_control_fi 61.000s 0.000us 262 300 87.33
aes_cipher_fi 61.000s 0.000us 322 350 92.00
aes_ctr_fi 35.000s 59.877us 25 25 100.00
sec_cm_cipher_fsm_sparse 1 10 10.00
aes_fi 7.000s 425.555us 1 10 10.00
sec_cm_cipher_fsm_redun 585 660 88.64
aes_fi 7.000s 425.555us 1 10 10.00
aes_control_fi 61.000s 0.000us 262 300 87.33
aes_cipher_fi 61.000s 0.000us 322 350 92.00
sec_cm_cipher_ctr_redun 322 350 92.00
aes_cipher_fi 61.000s 0.000us 322 350 92.00
sec_cm_ctr_fsm_sparse 1 10 10.00
aes_fi 7.000s 425.555us 1 10 10.00
sec_cm_ctr_fsm_redun 288 335 85.97
aes_fi 7.000s 425.555us 1 10 10.00
aes_control_fi 61.000s 0.000us 262 300 87.33
aes_ctr_fi 35.000s 59.877us 25 25 100.00
sec_cm_ghash_fsm_sparse 1 10 10.00
aes_fi 7.000s 425.555us 1 10 10.00
sec_cm_ctrl_sparse 610 685 89.05
aes_fi 7.000s 425.555us 1 10 10.00
aes_control_fi 61.000s 0.000us 262 300 87.33
aes_cipher_fi 61.000s 0.000us 322 350 92.00
aes_ctr_fi 35.000s 59.877us 25 25 100.00
sec_cm_main_fsm_global_esc 24 25 96.00
aes_alert_reset 31.000s 106.227us 24 25 96.00
sec_cm_main_fsm_local_esc 610 685 89.05
aes_fi 7.000s 425.555us 1 10 10.00
aes_control_fi 61.000s 0.000us 262 300 87.33
aes_cipher_fi 61.000s 0.000us 322 350 92.00
aes_ctr_fi 35.000s 59.877us 25 25 100.00
sec_cm_cipher_fsm_local_esc 610 685 89.05
aes_fi 7.000s 425.555us 1 10 10.00
aes_control_fi 61.000s 0.000us 262 300 87.33
aes_cipher_fi 61.000s 0.000us 322 350 92.00
aes_ctr_fi 35.000s 59.877us 25 25 100.00
sec_cm_ctr_fsm_local_esc 288 335 85.97
aes_fi 7.000s 425.555us 1 10 10.00
aes_control_fi 61.000s 0.000us 262 300 87.33
aes_ctr_fi 35.000s 59.877us 25 25 100.00
sec_cm_ghash_fsm_local_esc 1 10 10.00
aes_fi 7.000s 425.555us 1 10 10.00
sec_cm_data_reg_local_esc 585 660 88.64
aes_fi 7.000s 425.555us 1 10 10.00
aes_control_fi 61.000s 0.000us 262 300 87.33
aes_cipher_fi 61.000s 0.000us 322 350 92.00
Testpoint Test Max Runtime Sim Time Pass Total %
stress_all_with_rand_reset 0 10 0.00
aes_stress_all_with_rand_reset 21.000s 1748.375us 0 10 0.00

Error Messages

   Test seed line log context
UVM_FATAL (aes_cipher_fi_vseq.sv:62) [aes_cipher_fi_vseq] wait timeout occurred! 25 test runs
aes_cipher_fi 92901926119136305675094997741248608863374160606330573420749103682281128078195 146
UVM_INFO @ 10011495487 ps: (uvm_report_catcher.svh:705) [UVM/REPORT/CATCHER]
--- UVM Report catcher Summary ---
aes_cipher_fi 83046814332140417935660060106490376812133369695999305174741458605314800221379 146
UVM_INFO @ 10007623145 ps: (uvm_report_catcher.svh:705) [UVM/REPORT/CATCHER]
--- UVM Report catcher Summary ---
aes_cipher_fi 23369460195636192800119698120744174684457582693767277090461101936099850134875 141
UVM_INFO @ 10024531243 ps: (uvm_report_catcher.svh:705) [UVM/REPORT/CATCHER]
--- UVM Report catcher Summary ---
aes_cipher_fi 62438096506444055213360625956843983547263964405062259718595925645199558882209 142
UVM_INFO @ 10019995848 ps: (uvm_report_catcher.svh:705) [UVM/REPORT/CATCHER]
--- UVM Report catcher Summary ---
aes_cipher_fi 75559946274603574951272560434023381155633818241066623907320671153602019861426 141
UVM_INFO @ 10030743955 ps: (uvm_report_catcher.svh:705) [UVM/REPORT/CATCHER]
--- UVM Report catcher Summary ---
aes_cipher_fi 34203923165414355379039762880302080039437770753722468161292494951004179922976 143
UVM_INFO @ 10189053772 ps: (uvm_report_catcher.svh:705) [UVM/REPORT/CATCHER]
--- UVM Report catcher Summary ---
aes_cipher_fi 33224463523888887825097468170740401274773639303842994681589665867693446486415 151
UVM_INFO @ 10005410843 ps: (uvm_report_catcher.svh:705) [UVM/REPORT/CATCHER]
--- UVM Report catcher Summary ---
aes_cipher_fi 91514156945393779052946968658057420287968046609860327161281337663256405214352 144
UVM_INFO @ 10021914604 ps: (uvm_report_catcher.svh:705) [UVM/REPORT/CATCHER]
--- UVM Report catcher Summary ---
aes_cipher_fi 94581781309944155878428019748433570775787995633222383260144670971615811535595 144
UVM_INFO @ 10029163267 ps: (uvm_report_catcher.svh:705) [UVM/REPORT/CATCHER]
--- UVM Report catcher Summary ---
aes_cipher_fi 72408693316367850221771961473597265345707262526504914199984441929670551484100 154
UVM_INFO @ 10018326790 ps: (uvm_report_catcher.svh:705) [UVM/REPORT/CATCHER]
--- UVM Report catcher Summary ---
aes_cipher_fi 27175555641723562329410194741398421985204996925292679913809797999234077766318 150
UVM_INFO @ 10007394758 ps: (uvm_report_catcher.svh:705) [UVM/REPORT/CATCHER]
--- UVM Report catcher Summary ---
aes_cipher_fi 22638983529138213409679248458384927410195820436040610707340889147206080732440 146
UVM_INFO @ 10022141110 ps: (uvm_report_catcher.svh:705) [UVM/REPORT/CATCHER]
--- UVM Report catcher Summary ---
aes_cipher_fi 45647902134513592884745346992844453954991202984767579641965279654282032029966 147
UVM_INFO @ 10029766394 ps: (uvm_report_catcher.svh:705) [UVM/REPORT/CATCHER]
--- UVM Report catcher Summary ---
aes_cipher_fi 99234918104691313589448228021816028353929388929483642090625677807955634709422 149
UVM_INFO @ 10025772850 ps: (uvm_report_catcher.svh:705) [UVM/REPORT/CATCHER]
--- UVM Report catcher Summary ---
aes_cipher_fi 52140335035237749932840541742401130020989025343302061509768916863992892343025 141
UVM_INFO @ 10030876660 ps: (uvm_report_catcher.svh:705) [UVM/REPORT/CATCHER]
--- UVM Report catcher Summary ---
aes_cipher_fi 92644963513444844870440371052609800101410333981113856588391877162803260422480 151
UVM_INFO @ 10026673021 ps: (uvm_report_catcher.svh:705) [UVM/REPORT/CATCHER]
--- UVM Report catcher Summary ---
aes_cipher_fi 55935093269342950050183209790157896172287645639766772264264520473535549743457 148
UVM_INFO @ 10009641960 ps: (uvm_report_catcher.svh:705) [UVM/REPORT/CATCHER]
--- UVM Report catcher Summary ---
aes_cipher_fi 113869789961829885587308728206903966524361486515462167338944134052377713745925 146
UVM_INFO @ 10016192052 ps: (uvm_report_catcher.svh:705) [UVM/REPORT/CATCHER]
--- UVM Report catcher Summary ---
aes_cipher_fi 99234373443257542497593143067179596349647809643791128140251238154843813049894 146
UVM_INFO @ 10090120214 ps: (uvm_report_catcher.svh:705) [UVM/REPORT/CATCHER]
--- UVM Report catcher Summary ---
aes_cipher_fi 78223834052274297938073010737137754319782742291977227525121660713788540153801 151
UVM_INFO @ 10003303408 ps: (uvm_report_catcher.svh:705) [UVM/REPORT/CATCHER]
--- UVM Report catcher Summary ---
aes_cipher_fi 27103596421063016289104667103031999388251437057884976810910516120927001010905 148
UVM_INFO @ 10009270091 ps: (uvm_report_catcher.svh:705) [UVM/REPORT/CATCHER]
--- UVM Report catcher Summary ---
aes_cipher_fi 99393111109150194541249694953368397050266058291616666551630370984930915500029 141
UVM_INFO @ 10022156823 ps: (uvm_report_catcher.svh:705) [UVM/REPORT/CATCHER]
--- UVM Report catcher Summary ---
aes_cipher_fi 80919053727481349728686977633044872012883522881862221048781411893687731554097 139
UVM_INFO @ 10006345816 ps: (uvm_report_catcher.svh:705) [UVM/REPORT/CATCHER]
--- UVM Report catcher Summary ---
aes_cipher_fi 86928537417335037953451013632124805839574683457995617458019488912239021805373 143
UVM_INFO @ 10016221114 ps: (uvm_report_catcher.svh:705) [UVM/REPORT/CATCHER]
--- UVM Report catcher Summary ---
aes_cipher_fi 76095619310436130659836315260956102230938312037198890031100725628911019993091 146
UVM_INFO @ 10015234805 ps: (uvm_report_catcher.svh:705) [UVM/REPORT/CATCHER]
--- UVM Report catcher Summary ---
UVM_FATAL (aes_control_fi_vseq.sv:62) [aes_control_fi_vseq] wait timeout occurred! 22 test runs
aes_control_fi 101609802279431342987988040160692291731557999327550012859653968432988189112572 150
UVM_INFO @ 10211294838 ps: (uvm_report_catcher.svh:705) [UVM/REPORT/CATCHER]
--- UVM Report catcher Summary ---
aes_control_fi 92772229462931950315893932972421058540445628062667580273834852852763892863797 151
UVM_INFO @ 10006906612 ps: (uvm_report_catcher.svh:705) [UVM/REPORT/CATCHER]
--- UVM Report catcher Summary ---
aes_control_fi 26466245047815097423179937492747534619406095532148157419716764171389319815056 143
UVM_INFO @ 10014255782 ps: (uvm_report_catcher.svh:705) [UVM/REPORT/CATCHER]
--- UVM Report catcher Summary ---
aes_control_fi 98202121789084999051791455662682337616503365565074513783579525522063610107088 140
UVM_INFO @ 10051537120 ps: (uvm_report_catcher.svh:705) [UVM/REPORT/CATCHER]
--- UVM Report catcher Summary ---
aes_control_fi 38691889620635908654710564861927722356466974940118111182897569426264928955634 145
UVM_INFO @ 10013929443 ps: (uvm_report_catcher.svh:705) [UVM/REPORT/CATCHER]
--- UVM Report catcher Summary ---
aes_control_fi 56039183564018319927549457156508699949625318823746710703835319805259735688756 154
UVM_INFO @ 10011655056 ps: (uvm_report_catcher.svh:705) [UVM/REPORT/CATCHER]
--- UVM Report catcher Summary ---
aes_control_fi 55586266206864050741832120817872324315029034846480099822178071700572434609592 148
UVM_INFO @ 10031509009 ps: (uvm_report_catcher.svh:705) [UVM/REPORT/CATCHER]
--- UVM Report catcher Summary ---
aes_control_fi 45423848454161853380931329081782845698146022452607686716444070174642036389356 149
UVM_INFO @ 10024400333 ps: (uvm_report_catcher.svh:705) [UVM/REPORT/CATCHER]
--- UVM Report catcher Summary ---
aes_control_fi 78675657195190656093471250456818038080462528587982611834441363761003377465957 142
UVM_INFO @ 10012043843 ps: (uvm_report_catcher.svh:705) [UVM/REPORT/CATCHER]
--- UVM Report catcher Summary ---
aes_control_fi 14617603362423112248773032076345148428791187605028278495528520658014057356064 147
UVM_INFO @ 10009682464 ps: (uvm_report_catcher.svh:705) [UVM/REPORT/CATCHER]
--- UVM Report catcher Summary ---
aes_control_fi 14098805989040706551598002531797418050644923990364517950826136748133066526797 146
UVM_INFO @ 10008613417 ps: (uvm_report_catcher.svh:705) [UVM/REPORT/CATCHER]
--- UVM Report catcher Summary ---
aes_control_fi 58692511966514518661135563870703019423037006607755045097303220765462726666991 153
UVM_INFO @ 10006229146 ps: (uvm_report_catcher.svh:705) [UVM/REPORT/CATCHER]
--- UVM Report catcher Summary ---
aes_control_fi 91582114357587333417573157271541606919702649275743828813258705175860848910519 140
UVM_INFO @ 10005780302 ps: (uvm_report_catcher.svh:705) [UVM/REPORT/CATCHER]
--- UVM Report catcher Summary ---
aes_control_fi 94839727178444330795910212201731807871432374737164101685770629162066112297697 144
UVM_INFO @ 10015749892 ps: (uvm_report_catcher.svh:705) [UVM/REPORT/CATCHER]
--- UVM Report catcher Summary ---
aes_control_fi 30701563745786681403900011154688073398293922966663068131496191132563713087750 139
UVM_INFO @ 10041516809 ps: (uvm_report_catcher.svh:705) [UVM/REPORT/CATCHER]
--- UVM Report catcher Summary ---
aes_control_fi 63039829228776013275048434557315167774732040506194884163280437958290819085194 144
UVM_INFO @ 10003864598 ps: (uvm_report_catcher.svh:705) [UVM/REPORT/CATCHER]
--- UVM Report catcher Summary ---
aes_control_fi 23377997208167280460737333523541339659944964944174992999970788018235826802544 145
UVM_INFO @ 10016862660 ps: (uvm_report_catcher.svh:705) [UVM/REPORT/CATCHER]
--- UVM Report catcher Summary ---
aes_control_fi 61409985662838557369373214223184092919046688688713259780405575263354934263410 140
UVM_INFO @ 10050776612 ps: (uvm_report_catcher.svh:705) [UVM/REPORT/CATCHER]
--- UVM Report catcher Summary ---
aes_control_fi 44432824412198634745192899789710730022252188493475945490694753653586537514670 145
UVM_INFO @ 10005733119 ps: (uvm_report_catcher.svh:705) [UVM/REPORT/CATCHER]
--- UVM Report catcher Summary ---
aes_control_fi 79234335076068618468476358649727342327866353528591494133876899151327746864616 147
UVM_INFO @ 10037431043 ps: (uvm_report_catcher.svh:705) [UVM/REPORT/CATCHER]
--- UVM Report catcher Summary ---
aes_control_fi 34858903416420989007133102205786580942838531562790033281980476473513985781419 153
UVM_INFO @ 10016495418 ps: (uvm_report_catcher.svh:705) [UVM/REPORT/CATCHER]
--- UVM Report catcher Summary ---
aes_control_fi 102344518282861307400017235365295995537037852129206918170279542575486004425511 154
UVM_INFO @ 10007203778 ps: (uvm_report_catcher.svh:705) [UVM/REPORT/CATCHER]
--- UVM Report catcher Summary ---
Job timed out after * minutes 19 test runs
aes_control_fi 89913640156475786084298182990258514168080504766242092809709638111829544970871 None
aes_control_fi 72380524549260295387009649874157343462939127436052234712763088479335319069035 None
aes_control_fi 9565781295641882950967423121561042817436424786886161364164359484338427895929 None
aes_control_fi 110637048185818922551387726866467143296613878603176264948033761000239960105587 None
aes_cipher_fi 39097751728585246286011049990697223397717268206217448273573336014715697078228 None
aes_control_fi 105058594876653240779313640743421114354615529044106182054039087041079871084919 None
aes_cipher_fi 13486318202111582481401558473576442347786538061255053802766181369388403442308 None
aes_control_fi 20650563673297657651228409956891744183092385831974805649231512090240325512533 None
aes_control_fi 75451835879660714111885122325374010790898457567336492646599072158793080641726 None
aes_control_fi 18213446513409465275818620209607043633023328848070811699317828393936928451054 None
aes_control_fi 19106559817075546251940931758317013733451759114930175421853530810846533976049 None
aes_control_fi 89379040560290333537876236921517610685637966592472492524161707026359963146983 None
aes_cipher_fi 24293673832357652355558254776060139978924717411562552688931494031415075142844 None
aes_control_fi 17054923689901376996625122025404339833603342199839967215776187562615421822234 None
aes_control_fi 93585150898711321609615247351382236895280214823516521505998369273935228988400 None
aes_control_fi 23223834789467007131200853623810750007005117306804277725727371990262217233513 None
aes_control_fi 51098508796081434540748191834286668356210153468196423406033740674168301349237 None
aes_control_fi 112279332350877356405127983718548198487581933996836294034581328769179090282404 None
aes_control_fi 104011698970779056415550522511103324928095869268586384509192803217407728763436 None
UVM_ERROR (uvm_sequencer_base.svh:757) sequencer [SEQREQZMB] The task responsible for requesting a wait_for_grant on sequencer 'sequencer' for sequence 'parent_sequence' has been killed, to avoid a deadlock the sequence will be removed from the arbitration queues 12 test runs
aes_reseed 32340898510254503736015720659848521756862567492536057478942672253660053022821 10706
UVM_INFO @ 340215414 ps: (uvm_report_catcher.svh:705) [UVM/REPORT/CATCHER]
--- UVM Report catcher Summary ---
aes_reseed 100193695474526668341400055115558699875241366078259258345411572058939737435012 17976
UVM_INFO @ 107030912 ps: (uvm_report_catcher.svh:705) [UVM/REPORT/CATCHER]
--- UVM Report catcher Summary ---
aes_stress_all 77748553650338013749880338586681077955348088035277422344802690078597102458586 39366
UVM_INFO @ 2053895686 ps: (uvm_report_catcher.svh:705) [UVM/REPORT/CATCHER]
--- UVM Report catcher Summary ---
aes_stress_all 58824723294020029605579136168180042547413527496798310748646563292139678329909 15382
UVM_INFO @ 761257194 ps: (uvm_report_catcher.svh:705) [UVM/REPORT/CATCHER]
--- UVM Report catcher Summary ---
aes_stress_all 36270307354058299324899420345142528778782340192692960088002680645281196592150 90999
UVM_INFO @ 1490244045 ps: (uvm_report_catcher.svh:705) [UVM/REPORT/CATCHER]
--- UVM Report catcher Summary ---
aes_stress_all 108266107288360072808953742422413807010869220470506173982139608891068366916105 155255
UVM_INFO @ 700001363 ps: (uvm_report_catcher.svh:705) [UVM/REPORT/CATCHER]
--- UVM Report catcher Summary ---
aes_stress_all_with_rand_reset 34999061451391494575167036093908640997448232096293579993339042157349518272303 704
UVM_INFO @ 1748374796 ps: (uvm_report_catcher.svh:705) [UVM/REPORT/CATCHER]
--- UVM Report catcher Summary ---
aes_stress_all 35235745592073543027558895817392058785666430048022399856180411164289221901978 67454
UVM_INFO @ 550449058 ps: (uvm_report_catcher.svh:705) [UVM/REPORT/CATCHER]
--- UVM Report catcher Summary ---
aes_reseed 55654485976077487756620780612363256384907616637287869060725212168277061410498 72365
UVM_INFO @ 1329201711 ps: (uvm_report_catcher.svh:705) [UVM/REPORT/CATCHER]
--- UVM Report catcher Summary ---
aes_reseed 85236050042488713612107963870703008689053188648246269088941917219472342499865 4644
UVM_INFO @ 109596239 ps: (uvm_report_catcher.svh:705) [UVM/REPORT/CATCHER]
--- UVM Report catcher Summary ---
aes_stress_all 112071243335961849086579972554550463600441961141589809126335245931255140261969 21163
UVM_INFO @ 232294629 ps: (uvm_report_catcher.svh:705) [UVM/REPORT/CATCHER]
--- UVM Report catcher Summary ---
aes_stress_all_with_rand_reset 11220597759072229980514984403402118511279509499475685914875496772761333772325 154
UVM_INFO @ 38707332 ps: (uvm_report_catcher.svh:705) [UVM/REPORT/CATCHER]
--- UVM Report catcher Summary ---
UVM_FATAL (aes_scoreboard.sv:926) scoreboard [scoreboard] 9 test runs
aes_fi 97194072942250104265921123133219232876066549014334974747438972305460054230637 13245
----| NO FAILURES BUT NUMBER OF EXPECTED MESSAGES DOES NOT MATCH ACTUAL
----| Expected: 3
----| Seen: 2
----| Expected corrupted: 0
aes_fi 36952547096670504266515640277048091202147655388823735398443643795781651098383 15423
----| NO FAILURES BUT NUMBER OF EXPECTED MESSAGES DOES NOT MATCH ACTUAL
----| Expected: 4
----| Seen: 2
----| Expected corrupted: 0
aes_fi 85714482777641568253335535594865447502035254096040990424625185188912009346998 8783
----| NO FAILURES BUT NUMBER OF EXPECTED MESSAGES DOES NOT MATCH ACTUAL
----| Expected: 6
----| Seen: 5
----| Expected corrupted: 0
aes_fi 57693887247631998465685361710591001520909535784191221606466046252688428274100 16043
----| NO FAILURES BUT NUMBER OF EXPECTED MESSAGES DOES NOT MATCH ACTUAL
----| Expected: 5
----| Seen: 4
----| Expected corrupted: 0
aes_fi 14397144604645448857059269024424720385944366522048867453521307984233834196550 11613
----| NO FAILURES BUT NUMBER OF EXPECTED MESSAGES DOES NOT MATCH ACTUAL
----| Expected: 3
----| Seen: 2
----| Expected corrupted: 0
aes_fi 789925394356402314802645215149485009025558404724134004805140670577928615528 8091
----| NO FAILURES BUT NUMBER OF EXPECTED MESSAGES DOES NOT MATCH ACTUAL
----| Expected: 4
----| Seen: 3
----| Expected corrupted: 0
aes_fi 114712130118289785190996099575709078465479553553676164181258888218993582110399 12561
----| NO FAILURES BUT NUMBER OF EXPECTED MESSAGES DOES NOT MATCH ACTUAL
----| Expected: 4
----| Seen: 3
----| Expected corrupted: 0
aes_fi 68548423963358543013969686066674694716296061997578469822575874490290715415364 10706
----| NO FAILURES BUT NUMBER OF EXPECTED MESSAGES DOES NOT MATCH ACTUAL
----| Expected: 3
----| Seen: 2
----| Expected corrupted: 0
aes_fi 15437386000188195755327408129503419894200144538110969653425626486394869385061 6035
----| NO FAILURES BUT NUMBER OF EXPECTED MESSAGES DOES NOT MATCH ACTUAL
----| Expected: 4
----| Seen: 3
----| Expected corrupted: 0
UVM_FATAL (cip_base_vseq.sv:1220) [aes_common_vseq] Check failed (vseq_done) 6 test runs
aes_stress_all_with_rand_reset 49891291141028490907674477443662892192868255445597842484232519442792374567835 167
UVM_INFO @ 27259171 ps: (uvm_report_catcher.svh:705) [UVM/REPORT/CATCHER]
--- UVM Report catcher Summary ---
aes_stress_all_with_rand_reset 98180884835269173795583969420206347428895602476001322351237234771191262436993 144
UVM_INFO @ 36446692 ps: (uvm_report_catcher.svh:705) [UVM/REPORT/CATCHER]
--- UVM Report catcher Summary ---
aes_stress_all_with_rand_reset 110746807438216071790701294269007894185138063938982622089561091341828933123425 137
UVM_INFO @ 25840553 ps: (uvm_report_catcher.svh:705) [UVM/REPORT/CATCHER]
--- UVM Report catcher Summary ---
aes_stress_all_with_rand_reset 63245676518077055677379396082808777771801689309342172839096261924715980281560 260
UVM_INFO @ 80677884 ps: (uvm_report_catcher.svh:705) [UVM/REPORT/CATCHER]
--- UVM Report catcher Summary ---
aes_stress_all_with_rand_reset 30322654141978340808147217549440460667157669819396649490739539118114377164786 135
UVM_INFO @ 31447345 ps: (uvm_report_catcher.svh:705) [UVM/REPORT/CATCHER]
--- UVM Report catcher Summary ---
aes_stress_all_with_rand_reset 49463774833161358912444404794104383014679881912405452475489655617241323323884 160
UVM_INFO @ 20560544 ps: (uvm_report_catcher.svh:705) [UVM/REPORT/CATCHER]
--- UVM Report catcher Summary ---
UVM_FATAL (aes_core_fi_vseq.sv:70) [aes_core_fi_vseq] wait timeout occurred! 4 test runs
aes_core_fi 4971797506917737168576410756006869973196553109705293903673220322655095011566 146
UVM_INFO @ 10018929048 ps: (uvm_report_catcher.svh:705) [UVM/REPORT/CATCHER]
--- UVM Report catcher Summary ---
aes_core_fi 94922548739762714313200701369618154274330096156468854177834257311233463621010 151
UVM_INFO @ 10047605778 ps: (uvm_report_catcher.svh:705) [UVM/REPORT/CATCHER]
--- UVM Report catcher Summary ---
aes_core_fi 85272139866688143289341032512957605593401575020273255365918930408601066603028 144
UVM_INFO @ 10008817752 ps: (uvm_report_catcher.svh:705) [UVM/REPORT/CATCHER]
--- UVM Report catcher Summary ---
aes_core_fi 96444017786214266740736334005895004373890088146953671396887584241102052527105 144
UVM_INFO @ 10010004215 ps: (uvm_report_catcher.svh:705) [UVM/REPORT/CATCHER]
--- UVM Report catcher Summary ---
UVM_FATAL (aes_base_vseq.sv:87) [aes_stress_all_vseq] Check failed (aes_ctrl_aux[*] == cfg.do_reseed) 2 test runs
aes_stress_all_with_rand_reset 101964175237696799759540354193082134797624914487379966387425195071797762995269 109
UVM_INFO @ 3471350 ps: (uvm_report_catcher.svh:705) [UVM/REPORT/CATCHER]
--- UVM Report catcher Summary ---
aes_stress_all_with_rand_reset 46096508036441247067571349846113368423162054573233817562610058503142656542380 156
UVM_INFO @ 628307052 ps: (uvm_report_catcher.svh:705) [UVM/REPORT/CATCHER]
--- UVM Report catcher Summary ---
UVM_FATAL (aes_scoreboard.sv:785) scoreboard [scoreboard] # * 1 test run
aes_stress_all 113749502566860985850375098211135535885861674893676414922956162839603981945452 140084
TEST FAILED MESSAGES DID NOT MATCH
0 3b 66 66 0
1 00 9f 9f 0
xmsim: *E,ASRTST (/nightly/current_run/scratch/master/aes_masked-sim-xcelium/default/fusesoc-work/src/lowrisc_ip_aes_*/rtl/aes_core.sv,1137): Assertion AesSecCmDataRegLocalEscDataOut has failed (* cycles, starting * PS) 1 test run
aes_alert_reset 23955428750948362575724123244597089427582428773016463588855561563997376604103 541
UVM_ERROR @ 13597197 ps: (aes_core.sv:1137) [ASSERT FAILED] AesSecCmDataRegLocalEscDataOut
UVM_INFO @ 13597197 ps: (uvm_report_catcher.svh:705) [UVM/REPORT/CATCHER]
--- UVM Report catcher Summary ---