Simulation Results: aes/unmasked

 
22/08/2026 09:08:29 DVSim: v1.49.0 sha: 34ceb5e json Branch: master Tool: xcelium [unknown]
Coverage statistics
  • Total
  • 96.08 %
  • code
  • 93.00 %
  • assert
  • 98.11 %
  • func
  • 97.13 %
  • block
  • 93.88 %
  • line
  • 95.11 %
  • branch
  • 87.69 %
  • toggle
  • 98.08 %
  • FSM
  • 91.11 %
Validation stages
V1
100.00%
V2
96.33%
V2S
89.90%
V3
0.00%
Testpoint Test Max Runtime Sim Time Pass Total %
wake_up 1 1 100.00
aes_wake_up 2.000s 69.918us 1 1 100.00
smoke 10 10 100.00
aes_smoke 11.000s 558.992us 10 10 100.00
csr_hw_reset 1 1 100.00
aes_csr_hw_reset 2.000s 91.400us 1 1 100.00
csr_rw 5 5 100.00
aes_csr_rw 3.000s 93.680us 5 5 100.00
csr_bit_bash 1 1 100.00
aes_csr_bit_bash 5.000s 267.918us 1 1 100.00
csr_aliasing 1 1 100.00
aes_csr_aliasing 3.000s 213.803us 1 1 100.00
csr_mem_rw_with_rand_reset 5 5 100.00
aes_csr_mem_rw_with_rand_reset 3.000s 112.715us 5 5 100.00
regwen_csr_and_corresponding_lockable_csr 6 6 100.00
aes_csr_rw 3.000s 93.680us 5 5 100.00
aes_csr_aliasing 3.000s 213.803us 1 1 100.00
Testpoint Test Max Runtime Sim Time Pass Total %
algorithm 70 70 100.00
aes_smoke 11.000s 558.992us 10 10 100.00
aes_config_error 9.000s 361.233us 50 50 100.00
aes_stress 4.000s 73.774us 10 10 100.00
key_length 70 70 100.00
aes_smoke 11.000s 558.992us 10 10 100.00
aes_config_error 9.000s 361.233us 50 50 100.00
aes_stress 4.000s 73.774us 10 10 100.00
back2back 35 35 100.00
aes_stress 4.000s 73.774us 10 10 100.00
aes_b2b 9.000s 848.986us 25 25 100.00
backpressure 10 10 100.00
aes_stress 4.000s 73.774us 10 10 100.00
multi_message 94 95 98.95
aes_smoke 11.000s 558.992us 10 10 100.00
aes_config_error 9.000s 361.233us 50 50 100.00
aes_stress 4.000s 73.774us 10 10 100.00
aes_alert_reset 5.000s 281.482us 24 25 96.00
failure_test 84 85 98.82
aes_man_cfg_err 3.000s 80.121us 10 10 100.00
aes_config_error 9.000s 361.233us 50 50 100.00
aes_alert_reset 5.000s 281.482us 24 25 96.00
trigger_clear_test 9 10 90.00
aes_clear 4.000s 84.521us 9 10 90.00
nist_test_vectors 1 1 100.00
aes_nist_vectors 7.000s 1265.183us 1 1 100.00
reset_recovery 24 25 96.00
aes_alert_reset 5.000s 281.482us 24 25 96.00
stress 10 10 100.00
aes_stress 4.000s 73.774us 10 10 100.00
sideload 20 20 100.00
aes_stress 4.000s 73.774us 10 10 100.00
aes_sideload 4.000s 808.406us 10 10 100.00
deinitialization 10 10 100.00
aes_deinit 4.000s 334.162us 10 10 100.00
stress_all 4 10 40.00
aes_stress_all 11.000s 642.238us 4 10 40.00
alert_test 10 10 100.00
aes_alert_test 2.000s 70.335us 10 10 100.00
tl_d_oob_addr_access 25 25 100.00
aes_tl_errors 5.000s 783.704us 25 25 100.00
tl_d_illegal_access 25 25 100.00
aes_tl_errors 5.000s 783.704us 25 25 100.00
tl_d_outstanding_access 12 12 100.00
aes_csr_hw_reset 2.000s 91.400us 1 1 100.00
aes_csr_rw 3.000s 93.680us 5 5 100.00
aes_csr_aliasing 3.000s 213.803us 1 1 100.00
aes_same_csr_outstanding 2.000s 92.838us 5 5 100.00
tl_d_partial_access 12 12 100.00
aes_csr_hw_reset 2.000s 91.400us 1 1 100.00
aes_csr_rw 3.000s 93.680us 5 5 100.00
aes_csr_aliasing 3.000s 213.803us 1 1 100.00
aes_same_csr_outstanding 2.000s 92.838us 5 5 100.00
Testpoint Test Max Runtime Sim Time Pass Total %
reseeding 4 10 40.00
aes_reseed 4.000s 231.173us 4 10 40.00
fault_inject 584 660 88.48
aes_fi 4.000s 91.219us 0 10 0.00
aes_control_fi 62.073s 0.000us 272 300 90.67
aes_cipher_fi 61.000s 0.000us 312 350 89.14
shadow_reg_update_error 19 20 95.00
aes_shadow_reg_errors 13.000s 10057.944us 19 20 95.00
shadow_reg_read_clear_staged_value 19 20 95.00
aes_shadow_reg_errors 13.000s 10057.944us 19 20 95.00
shadow_reg_storage_error 19 20 95.00
aes_shadow_reg_errors 13.000s 10057.944us 19 20 95.00
shadowed_reset_glitch 19 20 95.00
aes_shadow_reg_errors 13.000s 10057.944us 19 20 95.00
shadow_reg_update_error_with_csr_rw 18 20 90.00
aes_shadow_reg_errors_with_csr_rw 4.000s 266.078us 18 20 90.00
tl_intg_err 30 30 100.00
aes_sec_cm 7.000s 3708.538us 5 5 100.00
aes_tl_intg_err 5.000s 176.203us 25 25 100.00
sec_cm_bus_integrity 25 25 100.00
aes_tl_intg_err 5.000s 176.203us 25 25 100.00
sec_cm_lc_escalate_en_intersig_mubi 24 25 96.00
aes_alert_reset 5.000s 281.482us 24 25 96.00
sec_cm_main_config_shadow 19 20 95.00
aes_shadow_reg_errors 13.000s 10057.944us 19 20 95.00
sec_cm_gcm_config_shadow 19 20 95.00
aes_shadow_reg_errors 13.000s 10057.944us 19 20 95.00
sec_cm_main_config_sparse 131 145 90.34
aes_smoke 11.000s 558.992us 10 10 100.00
aes_stress 4.000s 73.774us 10 10 100.00
aes_alert_reset 5.000s 281.482us 24 25 96.00
aes_core_fi 248.000s 10011.046us 87 100 87.00
sec_cm_gcm_config_sparse 147 160 91.88
aes_config_error 9.000s 361.233us 50 50 100.00
aes_stress 4.000s 73.774us 10 10 100.00
aes_core_fi 248.000s 10011.046us 87 100 87.00
sec_cm_aux_config_shadow 19 20 95.00
aes_shadow_reg_errors 13.000s 10057.944us 19 20 95.00
sec_cm_aux_config_regwen 20 20 100.00
aes_readability 3.000s 81.604us 10 10 100.00
aes_stress 4.000s 73.774us 10 10 100.00
sec_cm_key_sideload 20 20 100.00
aes_stress 4.000s 73.774us 10 10 100.00
aes_sideload 4.000s 808.406us 10 10 100.00
sec_cm_key_sw_unreadable 10 10 100.00
aes_readability 3.000s 81.604us 10 10 100.00
sec_cm_data_reg_sw_unreadable 10 10 100.00
aes_readability 3.000s 81.604us 10 10 100.00
sec_cm_key_sec_wipe 10 10 100.00
aes_readability 3.000s 81.604us 10 10 100.00
sec_cm_iv_config_sec_wipe 10 10 100.00
aes_readability 3.000s 81.604us 10 10 100.00
sec_cm_data_reg_sec_wipe 10 10 100.00
aes_readability 3.000s 81.604us 10 10 100.00
sec_cm_data_reg_key_sca 10 10 100.00
aes_stress 4.000s 73.774us 10 10 100.00
sec_cm_key_masking 10 10 100.00
aes_stress 4.000s 73.774us 10 10 100.00
sec_cm_main_fsm_sparse 0 10 0.00
aes_fi 4.000s 91.219us 0 10 0.00
sec_cm_main_fsm_redun 609 685 88.91
aes_fi 4.000s 91.219us 0 10 0.00
aes_control_fi 62.073s 0.000us 272 300 90.67
aes_cipher_fi 61.000s 0.000us 312 350 89.14
aes_ctr_fi 2.000s 66.694us 25 25 100.00
sec_cm_cipher_fsm_sparse 0 10 0.00
aes_fi 4.000s 91.219us 0 10 0.00
sec_cm_cipher_fsm_redun 584 660 88.48
aes_fi 4.000s 91.219us 0 10 0.00
aes_control_fi 62.073s 0.000us 272 300 90.67
aes_cipher_fi 61.000s 0.000us 312 350 89.14
sec_cm_cipher_ctr_redun 312 350 89.14
aes_cipher_fi 61.000s 0.000us 312 350 89.14
sec_cm_ctr_fsm_sparse 0 10 0.00
aes_fi 4.000s 91.219us 0 10 0.00
sec_cm_ctr_fsm_redun 297 335 88.66
aes_fi 4.000s 91.219us 0 10 0.00
aes_control_fi 62.073s 0.000us 272 300 90.67
aes_ctr_fi 2.000s 66.694us 25 25 100.00
sec_cm_ghash_fsm_sparse 0 10 0.00
aes_fi 4.000s 91.219us 0 10 0.00
sec_cm_ctrl_sparse 609 685 88.91
aes_fi 4.000s 91.219us 0 10 0.00
aes_control_fi 62.073s 0.000us 272 300 90.67
aes_cipher_fi 61.000s 0.000us 312 350 89.14
aes_ctr_fi 2.000s 66.694us 25 25 100.00
sec_cm_main_fsm_global_esc 24 25 96.00
aes_alert_reset 5.000s 281.482us 24 25 96.00
sec_cm_main_fsm_local_esc 609 685 88.91
aes_fi 4.000s 91.219us 0 10 0.00
aes_control_fi 62.073s 0.000us 272 300 90.67
aes_cipher_fi 61.000s 0.000us 312 350 89.14
aes_ctr_fi 2.000s 66.694us 25 25 100.00
sec_cm_cipher_fsm_local_esc 609 685 88.91
aes_fi 4.000s 91.219us 0 10 0.00
aes_control_fi 62.073s 0.000us 272 300 90.67
aes_cipher_fi 61.000s 0.000us 312 350 89.14
aes_ctr_fi 2.000s 66.694us 25 25 100.00
sec_cm_ctr_fsm_local_esc 297 335 88.66
aes_fi 4.000s 91.219us 0 10 0.00
aes_control_fi 62.073s 0.000us 272 300 90.67
aes_ctr_fi 2.000s 66.694us 25 25 100.00
sec_cm_ghash_fsm_local_esc 0 10 0.00
aes_fi 4.000s 91.219us 0 10 0.00
sec_cm_data_reg_local_esc 584 660 88.48
aes_fi 4.000s 91.219us 0 10 0.00
aes_control_fi 62.073s 0.000us 272 300 90.67
aes_cipher_fi 61.000s 0.000us 312 350 89.14
Testpoint Test Max Runtime Sim Time Pass Total %
stress_all_with_rand_reset 0 10 0.00
aes_stress_all_with_rand_reset 32.000s 2233.251us 0 10 0.00

Error Messages

   Test seed line log context
UVM_FATAL (aes_cipher_fi_vseq.sv:62) [aes_cipher_fi_vseq] wait timeout occurred! 25 test runs
aes_cipher_fi 5333715051980400113118528565298942499598570116609795457502162529039392483559 144
UVM_INFO @ 10048867980 ps: (uvm_report_catcher.svh:705) [UVM/REPORT/CATCHER]
--- UVM Report catcher Summary ---
aes_cipher_fi 60026369326388133697657632481333225435661665751849738125741970046058788489583 140
UVM_INFO @ 10002915354 ps: (uvm_report_catcher.svh:705) [UVM/REPORT/CATCHER]
--- UVM Report catcher Summary ---
aes_cipher_fi 27845347774213131670018162178395885524441073521723179173904009882670610539927 142
UVM_INFO @ 10006601273 ps: (uvm_report_catcher.svh:705) [UVM/REPORT/CATCHER]
--- UVM Report catcher Summary ---
aes_cipher_fi 97933061326729243577220627190692579188676330130138174702617973728414936235237 148
UVM_INFO @ 10010533846 ps: (uvm_report_catcher.svh:705) [UVM/REPORT/CATCHER]
--- UVM Report catcher Summary ---
aes_cipher_fi 41222092544397059092183084294442256106807563344721459813584416743680261441729 153
UVM_INFO @ 10004473573 ps: (uvm_report_catcher.svh:705) [UVM/REPORT/CATCHER]
--- UVM Report catcher Summary ---
aes_cipher_fi 48180479220471785688179435773520666536269395977338626401677758277860851211167 147
UVM_INFO @ 10017020011 ps: (uvm_report_catcher.svh:705) [UVM/REPORT/CATCHER]
--- UVM Report catcher Summary ---
aes_cipher_fi 87038471263036669284009752743526404021361892493036878537399662702807754788399 148
UVM_INFO @ 10074578785 ps: (uvm_report_catcher.svh:705) [UVM/REPORT/CATCHER]
--- UVM Report catcher Summary ---
aes_cipher_fi 50505559123244726759099704363370313177581933847713969822630828941292951794286 140
UVM_INFO @ 10018974327 ps: (uvm_report_catcher.svh:705) [UVM/REPORT/CATCHER]
--- UVM Report catcher Summary ---
aes_cipher_fi 7431171888791096707515120901084743500571801199155952114088667231361346478448 148
UVM_INFO @ 10006041322 ps: (uvm_report_catcher.svh:705) [UVM/REPORT/CATCHER]
--- UVM Report catcher Summary ---
aes_cipher_fi 7059754721114768068826110734302824695583323010245458135240484397945806909209 150
UVM_INFO @ 10004254377 ps: (uvm_report_catcher.svh:705) [UVM/REPORT/CATCHER]
--- UVM Report catcher Summary ---
aes_cipher_fi 96001712972131973540177891302514543134151989111313689790717049353216546455317 146
UVM_INFO @ 10033300798 ps: (uvm_report_catcher.svh:705) [UVM/REPORT/CATCHER]
--- UVM Report catcher Summary ---
aes_cipher_fi 70700349523427170808003303810612400200827140489825748579778668058551916183076 138
UVM_INFO @ 10016585267 ps: (uvm_report_catcher.svh:705) [UVM/REPORT/CATCHER]
--- UVM Report catcher Summary ---
aes_cipher_fi 61109647433528310151850483202898056170796621832441826850561014609102670478190 145
UVM_INFO @ 10011463931 ps: (uvm_report_catcher.svh:705) [UVM/REPORT/CATCHER]
--- UVM Report catcher Summary ---
aes_cipher_fi 97190609487465908566557472683786892481032140464153741460943021753509319088921 151
UVM_INFO @ 10011126222 ps: (uvm_report_catcher.svh:705) [UVM/REPORT/CATCHER]
--- UVM Report catcher Summary ---
aes_cipher_fi 112764528363102182416746255880953750527465117126014907602532965862589682779256 147
UVM_INFO @ 10020055947 ps: (uvm_report_catcher.svh:705) [UVM/REPORT/CATCHER]
--- UVM Report catcher Summary ---
aes_cipher_fi 4730690002828991426282897814706812761206512464894738601255177934757798844587 150
UVM_INFO @ 10008862542 ps: (uvm_report_catcher.svh:705) [UVM/REPORT/CATCHER]
--- UVM Report catcher Summary ---
aes_cipher_fi 91947973123553152784954201168455831950991623196051118196364340703110075341032 148
UVM_INFO @ 10006023837 ps: (uvm_report_catcher.svh:705) [UVM/REPORT/CATCHER]
--- UVM Report catcher Summary ---
aes_cipher_fi 31861154415324990915841652157002429059698269564114494650169156883978094130506 143
UVM_INFO @ 10002492120 ps: (uvm_report_catcher.svh:705) [UVM/REPORT/CATCHER]
--- UVM Report catcher Summary ---
aes_cipher_fi 20074440730907282952656441295490811266596767558395688273540511562029975438211 139
UVM_INFO @ 10006061272 ps: (uvm_report_catcher.svh:705) [UVM/REPORT/CATCHER]
--- UVM Report catcher Summary ---
aes_cipher_fi 40286892234946734673651559920412948346165990447791115567628970925384741759129 142
UVM_INFO @ 10006762017 ps: (uvm_report_catcher.svh:705) [UVM/REPORT/CATCHER]
--- UVM Report catcher Summary ---
aes_cipher_fi 64234243489466686882588912313030956876335489125618010637443654584972933219967 145
UVM_INFO @ 10017566027 ps: (uvm_report_catcher.svh:705) [UVM/REPORT/CATCHER]
--- UVM Report catcher Summary ---
aes_cipher_fi 62858052549387485466724181025405428624995987300084182223289507857504618380218 147
UVM_INFO @ 10009137275 ps: (uvm_report_catcher.svh:705) [UVM/REPORT/CATCHER]
--- UVM Report catcher Summary ---
aes_cipher_fi 1864979263618755768204230847063677244555464405573427852216837134751439771774 140
UVM_INFO @ 10018454588 ps: (uvm_report_catcher.svh:705) [UVM/REPORT/CATCHER]
--- UVM Report catcher Summary ---
aes_cipher_fi 109983547188726674136657092563469645265520226223868876098539933748725863975441 147
UVM_INFO @ 10005438110 ps: (uvm_report_catcher.svh:705) [UVM/REPORT/CATCHER]
--- UVM Report catcher Summary ---
aes_cipher_fi 77862831276428911509796137530023494399982229598670531124714138607068041910884 145
UVM_INFO @ 10002182666 ps: (uvm_report_catcher.svh:705) [UVM/REPORT/CATCHER]
--- UVM Report catcher Summary ---
Job timed out after * minutes 25 test runs
aes_cipher_fi 76540150150117879700078851192248019464354661781931916130765164977349910559875 None
aes_control_fi 20319843742669532837539171384405249711895710450937062941791302043030565824795 None
aes_control_fi 81636862743276248968211717617810191263819870458262500492941838637437893652319 None
aes_control_fi 47533730211181821358691765411886363777241064197010033310606491308734121667814 None
aes_control_fi 78782142743290153694537635270494208474719886611661994052388083887989010808957 None
aes_cipher_fi 84124567224112203806769550697724375869442391395994878022633992564055070554600 None
aes_cipher_fi 82563489723326567499354796999913474297462951462605808687267954044027778923811 None
aes_cipher_fi 38327102398415053893940677182323640612666774400170543083657783156189761574879 None
aes_cipher_fi 52667580752129440322270318151879751078799546244090756478947112034196389288043 None
aes_control_fi 50686462802855663917904459044717359260022287284007994660368578489801115547699 None
aes_control_fi 60267277181833410916847458711585452989351143932560930186630695730464244035705 None
aes_cipher_fi 1861744892716224382349956320517186818515585845962905653497303208143655231535 None
aes_cipher_fi 31753172477346632656549683489815756465647886707408948134582426761841627122285 None
aes_control_fi 38943298474952814667425207071934224933763888208369215804863861783382845321990 None
aes_cipher_fi 4988518300997725118380500922824122768592338232878515375304150813086664977250 None
aes_control_fi 82020517424155140038481745932952187138985765623525911424631930614558946496042 None
aes_control_fi 86471100334403894618551746820808702467169827609255548159461976154521065346989 None
aes_control_fi 113328906187094352253809604450269991384764890624758401813351612388841766032974 None
aes_cipher_fi 52606123686692524747341506204489973587492493107847059414260100069636991079060 None
aes_control_fi 73228564567239910422099196937035685162922247693702753971509414039067674135557 None
aes_cipher_fi 45196562728346206757551065013673464876964935325733015578130025081892815047278 None
aes_control_fi 35810114103268048596196120265558311814867276712306701528011518296316111088833 None
aes_cipher_fi 66474550251983582109907760190617734689985090685137948254129658854199559819773 None
aes_cipher_fi 75965053745157479013672379133986165884935332217395073493719702356664868878218 None
aes_cipher_fi 13310717933579539259960009444400651414988224765050242346809180139677064069331 None
UVM_FATAL (aes_control_fi_vseq.sv:62) [aes_control_fi_vseq] wait timeout occurred! 16 test runs
aes_control_fi 72574230566959779891162493879300757833246367526232161421958862774971056786646 150
UVM_INFO @ 10014965444 ps: (uvm_report_catcher.svh:705) [UVM/REPORT/CATCHER]
--- UVM Report catcher Summary ---
aes_control_fi 48696039590113394010108888811732285103796211638528900404523450217977734678320 145
UVM_INFO @ 10006915840 ps: (uvm_report_catcher.svh:705) [UVM/REPORT/CATCHER]
--- UVM Report catcher Summary ---
aes_control_fi 20139498629656948550480979142166442951596088721520751014752916721132507775305 153
UVM_INFO @ 10002586889 ps: (uvm_report_catcher.svh:705) [UVM/REPORT/CATCHER]
--- UVM Report catcher Summary ---
aes_control_fi 46245360071313517758647791688363979760279895926340342331261628684737432689604 154
UVM_INFO @ 10017859231 ps: (uvm_report_catcher.svh:705) [UVM/REPORT/CATCHER]
--- UVM Report catcher Summary ---
aes_control_fi 95559738645658190440437169066047147587603641111969006416691162318533111403887 142
UVM_INFO @ 10007619474 ps: (uvm_report_catcher.svh:705) [UVM/REPORT/CATCHER]
--- UVM Report catcher Summary ---
aes_control_fi 35700132915616267948245844490873799411553997960561218556732602298797929233679 145
UVM_INFO @ 10011355399 ps: (uvm_report_catcher.svh:705) [UVM/REPORT/CATCHER]
--- UVM Report catcher Summary ---
aes_control_fi 81334617796640996654618534385517937447160220503090258295369697081525895073593 138
UVM_INFO @ 10004962984 ps: (uvm_report_catcher.svh:705) [UVM/REPORT/CATCHER]
--- UVM Report catcher Summary ---
aes_control_fi 66734048713589208200339996714155610064923111262895992669891335000621003808068 145
UVM_INFO @ 10009630150 ps: (uvm_report_catcher.svh:705) [UVM/REPORT/CATCHER]
--- UVM Report catcher Summary ---
aes_control_fi 35792231177970307433417352719283879256450226592956718705039166466606057909094 140
UVM_INFO @ 10007520063 ps: (uvm_report_catcher.svh:705) [UVM/REPORT/CATCHER]
--- UVM Report catcher Summary ---
aes_control_fi 17932632146100920422431961955031378106044525650394190959834285732879096402074 143
UVM_INFO @ 10006844166 ps: (uvm_report_catcher.svh:705) [UVM/REPORT/CATCHER]
--- UVM Report catcher Summary ---
aes_control_fi 104513031265967280220232207571125380222232245942572654389316250503484177019628 148
UVM_INFO @ 10016080884 ps: (uvm_report_catcher.svh:705) [UVM/REPORT/CATCHER]
--- UVM Report catcher Summary ---
aes_control_fi 45631149242055036392507728385207129330133363520130177040716084220076278164000 148
UVM_INFO @ 10005388807 ps: (uvm_report_catcher.svh:705) [UVM/REPORT/CATCHER]
--- UVM Report catcher Summary ---
aes_control_fi 10221427610364127035149222807633265805675723853156180129695162565202541418018 142
UVM_INFO @ 10013540635 ps: (uvm_report_catcher.svh:705) [UVM/REPORT/CATCHER]
--- UVM Report catcher Summary ---
aes_control_fi 47225418280454061671402748021092675509885067370992912435975632708738399960365 139
UVM_INFO @ 10042242791 ps: (uvm_report_catcher.svh:705) [UVM/REPORT/CATCHER]
--- UVM Report catcher Summary ---
aes_control_fi 87535852236763360496771968501489197798717193554418589562245263817530146463305 145
UVM_INFO @ 10044011396 ps: (uvm_report_catcher.svh:705) [UVM/REPORT/CATCHER]
--- UVM Report catcher Summary ---
aes_control_fi 85269466717173755750958333785416395778034884972822419444683805502940199358203 148
UVM_INFO @ 10006022880 ps: (uvm_report_catcher.svh:705) [UVM/REPORT/CATCHER]
--- UVM Report catcher Summary ---
UVM_ERROR (uvm_sequencer_base.svh:757) sequencer [SEQREQZMB] The task responsible for requesting a wait_for_grant on sequencer 'sequencer' for sequence 'parent_sequence' has been killed, to avoid a deadlock the sequence will be removed from the arbitration queues 14 test runs
aes_reseed 75757622099519892180626638755821995418496367728100247425967313418029254535229 2868
UVM_INFO @ 22364035 ps: (uvm_report_catcher.svh:705) [UVM/REPORT/CATCHER]
--- UVM Report catcher Summary ---
aes_stress_all 30690010228972875298355962160939157335980839090928309742761246061168997526693 22297
UVM_INFO @ 171764827 ps: (uvm_report_catcher.svh:705) [UVM/REPORT/CATCHER]
--- UVM Report catcher Summary ---
aes_reseed 92245620292857151751762916330191452160314423857490331935558119026438885654290 5353
UVM_INFO @ 231172586 ps: (uvm_report_catcher.svh:705) [UVM/REPORT/CATCHER]
--- UVM Report catcher Summary ---
aes_reseed 63157714723147308479533730949550882742117253303845825355410916969263100109215 4702
UVM_INFO @ 165591607 ps: (uvm_report_catcher.svh:705) [UVM/REPORT/CATCHER]
--- UVM Report catcher Summary ---
aes_stress_all 62575506030171726903044278194762674535388327373448885632315081108755415125214 1639
UVM_INFO @ 36540554 ps: (uvm_report_catcher.svh:705) [UVM/REPORT/CATCHER]
--- UVM Report catcher Summary ---
aes_reseed 115117911982909638278292777458352167478269498952873506756876407736717399557533 4617
UVM_INFO @ 74247862 ps: (uvm_report_catcher.svh:705) [UVM/REPORT/CATCHER]
--- UVM Report catcher Summary ---
aes_stress_all 101159942443930954327916850422741556041241989059181254063397305580239102118484 18659
UVM_INFO @ 151559502 ps: (uvm_report_catcher.svh:705) [UVM/REPORT/CATCHER]
--- UVM Report catcher Summary ---
aes_stress_all_with_rand_reset 2806785135249693210311936189236279140205246812744202086523330981396910821624 140
UVM_INFO @ 101095485 ps: (uvm_report_catcher.svh:705) [UVM/REPORT/CATCHER]
--- UVM Report catcher Summary ---
aes_stress_all_with_rand_reset 100045067536684852349035684554206715964580368701561563642317926643786572553896 150
UVM_INFO @ 12315560 ps: (uvm_report_catcher.svh:705) [UVM/REPORT/CATCHER]
--- UVM Report catcher Summary ---
aes_stress_all 21491701781679100337222466252003701171326963874253378971240168481529224548205 2577
UVM_INFO @ 42543637 ps: (uvm_report_catcher.svh:705) [UVM/REPORT/CATCHER]
--- UVM Report catcher Summary ---
aes_reseed 77012950509656273884682876116293796142401322560012553322462826668225234119070 4685
UVM_INFO @ 59834423 ps: (uvm_report_catcher.svh:705) [UVM/REPORT/CATCHER]
--- UVM Report catcher Summary ---
aes_stress_all 49863488140977015425593546856580947571534156240246807664452549107069311686483 14319
UVM_INFO @ 1310534764 ps: (uvm_report_catcher.svh:705) [UVM/REPORT/CATCHER]
--- UVM Report catcher Summary ---
aes_reseed 57728830726775693683044654738779461739271958476960567013380980903036804492079 2458
UVM_INFO @ 126960379 ps: (uvm_report_catcher.svh:705) [UVM/REPORT/CATCHER]
--- UVM Report catcher Summary ---
aes_stress_all 93458484355716082266667199391649482494529577521107094458886698769024713763726 16635
UVM_INFO @ 110507175 ps: (uvm_report_catcher.svh:705) [UVM/REPORT/CATCHER]
--- UVM Report catcher Summary ---
UVM_FATAL (aes_scoreboard.sv:923) scoreboard [scoreboard] 10 test runs
aes_fi 29918383833381295438060604356850933831415336839612888494557484681907810598394 9907
----| NO FAILURES BUT NUMBER OF EXPECTED MESSAGES DOES NOT MATCH ACTUAL
----| Expected: 6
----| Seen: 4
----| Expected corrupted: 0
aes_fi 51287299081417202900937252343981174739062780422757796187827099499493449095861 7543
----| NO FAILURES BUT NUMBER OF EXPECTED MESSAGES DOES NOT MATCH ACTUAL
----| Expected: 5
----| Seen: 3
----| Expected corrupted: 0
aes_fi 109423512510890586385492807788523477466963523989924571956573126464086453736210 6135
----| NO FAILURES BUT NUMBER OF EXPECTED MESSAGES DOES NOT MATCH ACTUAL
----| Expected: 5
----| Seen: 4
----| Expected corrupted: 0
aes_fi 56580164828856392530839759333371990174338663095459057463969722181401918825164 8202
----| NO FAILURES BUT NUMBER OF EXPECTED MESSAGES DOES NOT MATCH ACTUAL
----| Expected: 6
----| Seen: 3
----| Expected corrupted: 0
aes_fi 50723077170744401070083313001574273272968920545611596865796520318429915900150 6278
----| NO FAILURES BUT NUMBER OF EXPECTED MESSAGES DOES NOT MATCH ACTUAL
----| Expected: 5
----| Seen: 4
----| Expected corrupted: 0
aes_fi 102326849186339561318512811889340722981588533240795596532359950365749201950971 4001
----| NO FAILURES BUT NUMBER OF EXPECTED MESSAGES DOES NOT MATCH ACTUAL
----| Expected: 3
----| Seen: 1
----| Expected corrupted: 0
aes_fi 103631828291209737917784803047996714567476457622675051116508739954624763972050 3906
----| NO FAILURES BUT NUMBER OF EXPECTED MESSAGES DOES NOT MATCH ACTUAL
----| Expected: 4
----| Seen: 3
----| Expected corrupted: 0
aes_fi 64218928005517025792005063349438164407543974751636845798124483004821942276255 3614
----| NO FAILURES BUT NUMBER OF EXPECTED MESSAGES DOES NOT MATCH ACTUAL
----| Expected: 3
----| Seen: 2
----| Expected corrupted: 0
aes_fi 12903475138215764889012423191261141467253949550303310770231533460702400758306 8626
----| NO FAILURES BUT NUMBER OF EXPECTED MESSAGES DOES NOT MATCH ACTUAL
----| Expected: 5
----| Seen: 4
----| Expected corrupted: 0
aes_fi 9422312280196735735210601372760800570759175833424503797505607849490146776439 4075
----| NO FAILURES BUT NUMBER OF EXPECTED MESSAGES DOES NOT MATCH ACTUAL
----| Expected: 3
----| Seen: 2
----| Expected corrupted: 0
UVM_FATAL (cip_base_vseq.sv:1230) [aes_common_vseq] Check failed (vseq_done) 7 test runs
aes_stress_all_with_rand_reset 111817578366133672953068061196821505603300114501810266065070616356073625757156 137
UVM_INFO @ 16455596 ps: (uvm_report_catcher.svh:705) [UVM/REPORT/CATCHER]
--- UVM Report catcher Summary ---
aes_stress_all_with_rand_reset 29135381631569563277796444060448270802081175044225085755436017068982339175905 306
UVM_INFO @ 3119233527 ps: (uvm_report_catcher.svh:705) [UVM/REPORT/CATCHER]
--- UVM Report catcher Summary ---
aes_stress_all_with_rand_reset 39651706577038802655475402797072349253809306850868230581398708625083080633483 951
UVM_INFO @ 2233250524 ps: (uvm_report_catcher.svh:705) [UVM/REPORT/CATCHER]
--- UVM Report catcher Summary ---
aes_stress_all_with_rand_reset 74272262566846967047925353179687826176798562655491402512021982505060153302892 167
UVM_INFO @ 23863816 ps: (uvm_report_catcher.svh:705) [UVM/REPORT/CATCHER]
--- UVM Report catcher Summary ---
aes_stress_all_with_rand_reset 93534348636917544153077910693432409250928664152874057448262982507978595786753 149
UVM_INFO @ 12930020 ps: (uvm_report_catcher.svh:705) [UVM/REPORT/CATCHER]
--- UVM Report catcher Summary ---
aes_stress_all_with_rand_reset 51103502113326653910336792696976041288997951085021171172213750236606061038870 228
UVM_INFO @ 395396147 ps: (uvm_report_catcher.svh:705) [UVM/REPORT/CATCHER]
--- UVM Report catcher Summary ---
aes_stress_all_with_rand_reset 112258568950217066570672376166209801645658586837011190444978727779887785698491 202
UVM_INFO @ 36954712 ps: (uvm_report_catcher.svh:705) [UVM/REPORT/CATCHER]
--- UVM Report catcher Summary ---
UVM_FATAL (aes_core_fi_vseq.sv:70) [aes_core_fi_vseq] wait timeout occurred! 5 test runs
aes_core_fi 48010141629381217907981466808241020450940362630791619871404795467857284446221 151
UVM_INFO @ 10010610213 ps: (uvm_report_catcher.svh:705) [UVM/REPORT/CATCHER]
--- UVM Report catcher Summary ---
aes_core_fi 10446382762246642358061407102531101002785078116403141874544851472581808139253 143
UVM_INFO @ 10004669234 ps: (uvm_report_catcher.svh:705) [UVM/REPORT/CATCHER]
--- UVM Report catcher Summary ---
aes_core_fi 42086478873552582643721193875154791804536560252876868301281025088763195974621 151
UVM_INFO @ 10004318014 ps: (uvm_report_catcher.svh:705) [UVM/REPORT/CATCHER]
--- UVM Report catcher Summary ---
aes_core_fi 48194139506099049541730732214558765733096151418657458343266604500588344626109 148
UVM_INFO @ 10004062124 ps: (uvm_report_catcher.svh:705) [UVM/REPORT/CATCHER]
--- UVM Report catcher Summary ---
aes_core_fi 83474051502511782889493348861162878348169672091871135103524834820555831595979 152
UVM_INFO @ 10011290443 ps: (uvm_report_catcher.svh:705) [UVM/REPORT/CATCHER]
--- UVM Report catcher Summary ---
UVM_ERROR (csr_utils_pkg.sv:463) [csr_utils_pkg::csr_rd_check.isolation_fork.unmblk1] Check failed obs == exp (* [*] vs * [*]) Regname: aes_reg_block_extended.ctrl_shadowed reset value: * 2 test runs
aes_shadow_reg_errors_with_csr_rw 33373376977251453331408952248496168696307941679353157527069537111731130212039 107
UVM_INFO @ 50839235 ps: (uvm_report_catcher.svh:705) [UVM/REPORT/CATCHER]
--- UVM Report catcher Summary ---
aes_shadow_reg_errors_with_csr_rw 104759791259361868583519448867160492677763218760936594023913090883955379144779 106
UVM_INFO @ 43755722 ps: (uvm_report_catcher.svh:705) [UVM/REPORT/CATCHER]
--- UVM Report catcher Summary ---
UVM_FATAL (csr_utils_pkg.sv:623) [csr_utils_pkg::csr_spinwait.isolation_fork] timeout aes_reg_block_extended.status.idle (addr=*, Comparison=CompareOpEq, exp_data=*, call_count=10) 2 test runs
aes_core_fi 69111318128352948541662303299559952177237661613166497075895971119680121327289 137
UVM_INFO @ 10015815838 ps: (uvm_report_catcher.svh:705) [UVM/REPORT/CATCHER]
--- UVM Report catcher Summary ---
aes_core_fi 18496213031539062772091786545291677247710066417595370004834790877018586360134 143
UVM_INFO @ 10016989289 ps: (uvm_report_catcher.svh:705) [UVM/REPORT/CATCHER]
--- UVM Report catcher Summary ---
UVM_FATAL (csr_utils_pkg.sv:623) [csr_utils_pkg::csr_spinwait.isolation_fork] timeout aes_reg_block_extended.status.idle (addr=*, Comparison=CompareOpEq, exp_data=*, call_count=12) 2 test runs
aes_core_fi 70680569187859827500550633417699653034882748314776330298880143190088066958187 147
UVM_INFO @ 10011045932 ps: (uvm_report_catcher.svh:705) [UVM/REPORT/CATCHER]
--- UVM Report catcher Summary ---
aes_core_fi 106753278803270848767620470245491016210690899699785705949131538536063629728243 144
UVM_INFO @ 10037105181 ps: (uvm_report_catcher.svh:705) [UVM/REPORT/CATCHER]
--- UVM Report catcher Summary ---
UVM_FATAL (aes_base_vseq.sv:1082) virtual_sequencer [aes_stress_vseq] 1 test run
aes_stress_all_with_rand_reset 26024564419101357437157409204880266738532314358149819586057613973601596999145 550
Was able to clear FATAL ALERT without reset
---| Idle: 0
---| Stall: 0
xmsim: *E,ASRTST (/nightly/current_run/scratch/master/aes_unmasked-sim-xcelium/default/fusesoc-work/src/lowrisc_ip_aes_*/rtl/aes_core.sv,1113): Assertion AesModeValid has failed 1 test run
aes_alert_reset 68406054735356494487412463762381893369390733303569874938537674034858023130847 372
xmsim: *E,ASRTST (/nightly/current_run/scratch/master/aes_unmasked-sim-xcelium/default/fusesoc-work/src/lowrisc_ip_aes_1.0/rtl/aes_control_fsm.sv,1180): (time 35887507 PS) Assertion tb.dut.u_aes_core.u_aes_control.gen_fsm[2].gen_fsm_n.u_aes_control_fsm_i.u_aes_control_fsm.AesModeValid has failed
xmsim: *E,ASRTST (/nightly/current_run/scratch/master/aes_unmasked-sim-xcelium/default/fusesoc-work/src/lowrisc_ip_aes_1.0/rtl/aes_control_fsm.sv,1180): (time 35887507 PS) Assertion tb.dut.u_aes_core.u_aes_control.gen_fsm[1].gen_fsm_p.u_aes_control_fsm_i.u_aes_control_fsm.AesModeValid has failed
xmsim: *E,ASRTST (/nightly/current_run/scratch/master/aes_unmasked-sim-xcelium/default/fusesoc-work/src/lowrisc_ip_aes_1.0/rtl/aes_control_fsm.sv,1180): (time 35887507 PS) Assertion tb.dut.u_aes_core.u_aes_control.gen_fsm[0].gen_fsm_p.u_aes_control_fsm_i.u_aes_control_fsm.AesModeValid has failed
UVM_ERROR @ 35887507 ps: (aes_core.sv:1113) [ASSERT FAILED] AesModeValid
UVM_FATAL (aes_scoreboard.sv:782) scoreboard [scoreboard] # * 1 test run
aes_clear 55619448595349692697652908113607400089820511436280329927370539838318151774528 1370
TEST FAILED MESSAGES DID NOT MATCH
0 93 2f dc 0
1 5d 68 96 0
UVM_FATAL (csr_utils_pkg.sv:623) [csr_utils_pkg::csr_spinwait.isolation_fork] timeout aes_reg_block_extended.status.idle (addr=*, Comparison=CompareOpEq, exp_data=*, call_count=5) 1 test run
aes_core_fi 67212242333868405748004659270409816831294407037562907089163090616483379927839 137
UVM_INFO @ 10014191409 ps: (uvm_report_catcher.svh:705) [UVM/REPORT/CATCHER]
--- UVM Report catcher Summary ---
UVM_FATAL (cip_base_vseq__shadow_reg_errors.svh:336) [aes_common_vseq] ctrl_shadowed update_err alert timeout 1 test run
aes_shadow_reg_errors 6501265139646200213526902538906722767823770164217939373822217562017373348380 107
UVM_INFO @ 10057944135 ps: (uvm_report_catcher.svh:705) [UVM/REPORT/CATCHER]
--- UVM Report catcher Summary ---
UVM_FATAL (csr_utils_pkg.sv:623) [csr_utils_pkg::csr_spinwait.isolation_fork] timeout aes_reg_block_extended.status.idle (addr=*, Comparison=CompareOpEq, exp_data=*, call_count=11) 1 test run
aes_core_fi 96484369922500316604406384687343820690721213007805341450232927178810856855604 147
UVM_INFO @ 10021509512 ps: (uvm_report_catcher.svh:705) [UVM/REPORT/CATCHER]
--- UVM Report catcher Summary ---
UVM_FATAL (csr_utils_pkg.sv:623) [csr_utils_pkg::csr_spinwait.isolation_fork] timeout aes_reg_block_extended.status.idle (addr=*, Comparison=CompareOpEq, exp_data=*, call_count=9) 1 test run
aes_core_fi 19741838158529245904552833059611725310206861591954373889411420479772648740636 138
UVM_INFO @ 10036766559 ps: (uvm_report_catcher.svh:705) [UVM/REPORT/CATCHER]
--- UVM Report catcher Summary ---
UVM_FATAL (csr_utils_pkg.sv:623) [csr_utils_pkg::csr_spinwait.isolation_fork] timeout aes_reg_block_extended.status.idle (addr=*, Comparison=CompareOpEq, exp_data=*, call_count=8) 1 test run
aes_core_fi 3841916016199170952402436381071923333856681853232398037056486752220750221561 141
UVM_INFO @ 10056104402 ps: (uvm_report_catcher.svh:705) [UVM/REPORT/CATCHER]
--- UVM Report catcher Summary ---