Simulation Results: aes/masked

 
12/09/2026 09:15:14 DVSim: v1.49.0 sha: fca045d json Branch: master Tool: xcelium [unknown]
Coverage statistics
  • Total
  • 97.93 %
  • code
  • 96.56 %
  • assert
  • 98.38 %
  • func
  • 98.85 %
  • block
  • 96.88 %
  • line
  • 97.73 %
  • branch
  • 92.67 %
  • toggle
  • 98.08 %
  • FSM
  • 97.78 %
Validation stages
V1
100.00%
V2
97.25%
V2S
92.45%
V3
0.00%
Testpoint Test Max Runtime Sim Time Pass Total %
wake_up 1 1 100.00
aes_wake_up 3.000s 77.722us 1 1 100.00
smoke 10 10 100.00
aes_smoke 5.000s 115.222us 10 10 100.00
csr_hw_reset 1 1 100.00
aes_csr_hw_reset 2.000s 137.992us 1 1 100.00
csr_rw 5 5 100.00
aes_csr_rw 2.000s 89.704us 5 5 100.00
csr_bit_bash 1 1 100.00
aes_csr_bit_bash 9.000s 767.891us 1 1 100.00
csr_aliasing 1 1 100.00
aes_csr_aliasing 2.000s 106.766us 1 1 100.00
csr_mem_rw_with_rand_reset 5 5 100.00
aes_csr_mem_rw_with_rand_reset 7.000s 110.858us 5 5 100.00
regwen_csr_and_corresponding_lockable_csr 6 6 100.00
aes_csr_rw 2.000s 89.704us 5 5 100.00
aes_csr_aliasing 2.000s 106.766us 1 1 100.00
Testpoint Test Max Runtime Sim Time Pass Total %
algorithm 70 70 100.00
aes_smoke 5.000s 115.222us 10 10 100.00
aes_config_error 23.000s 712.597us 50 50 100.00
aes_stress 15.000s 394.947us 10 10 100.00
key_length 70 70 100.00
aes_smoke 5.000s 115.222us 10 10 100.00
aes_config_error 23.000s 712.597us 50 50 100.00
aes_stress 15.000s 394.947us 10 10 100.00
back2back 35 35 100.00
aes_stress 15.000s 394.947us 10 10 100.00
aes_b2b 36.000s 459.209us 25 25 100.00
backpressure 10 10 100.00
aes_stress 15.000s 394.947us 10 10 100.00
multi_message 95 95 100.00
aes_smoke 5.000s 115.222us 10 10 100.00
aes_config_error 23.000s 712.597us 50 50 100.00
aes_stress 15.000s 394.947us 10 10 100.00
aes_alert_reset 22.000s 1266.597us 25 25 100.00
failure_test 85 85 100.00
aes_man_cfg_err 3.000s 86.711us 10 10 100.00
aes_config_error 23.000s 712.597us 50 50 100.00
aes_alert_reset 22.000s 1266.597us 25 25 100.00
trigger_clear_test 10 10 100.00
aes_clear 19.000s 2361.083us 10 10 100.00
nist_test_vectors 1 1 100.00
aes_nist_vectors 11.000s 189.279us 1 1 100.00
reset_recovery 25 25 100.00
aes_alert_reset 22.000s 1266.597us 25 25 100.00
stress 10 10 100.00
aes_stress 15.000s 394.947us 10 10 100.00
sideload 20 20 100.00
aes_stress 15.000s 394.947us 10 10 100.00
aes_sideload 6.000s 243.215us 10 10 100.00
deinitialization 10 10 100.00
aes_deinit 20.000s 1176.863us 10 10 100.00
stress_all 4 10 40.00
aes_stress_all 79.000s 2758.538us 4 10 40.00
alert_test 10 10 100.00
aes_alert_test 3.000s 168.960us 10 10 100.00
tl_d_oob_addr_access 25 25 100.00
aes_tl_errors 5.000s 1766.726us 25 25 100.00
tl_d_illegal_access 25 25 100.00
aes_tl_errors 5.000s 1766.726us 25 25 100.00
tl_d_outstanding_access 12 12 100.00
aes_csr_hw_reset 2.000s 137.992us 1 1 100.00
aes_csr_rw 2.000s 89.704us 5 5 100.00
aes_csr_aliasing 2.000s 106.766us 1 1 100.00
aes_same_csr_outstanding 8.000s 77.353us 5 5 100.00
tl_d_partial_access 12 12 100.00
aes_csr_hw_reset 2.000s 137.992us 1 1 100.00
aes_csr_rw 2.000s 89.704us 5 5 100.00
aes_csr_aliasing 2.000s 106.766us 1 1 100.00
aes_same_csr_outstanding 8.000s 77.353us 5 5 100.00
Testpoint Test Max Runtime Sim Time Pass Total %
reseeding 8 10 80.00
aes_reseed 58.000s 2264.527us 8 10 80.00
fault_inject 597 660 90.45
aes_fi 8.000s 1081.753us 0 10 0.00
aes_control_fi 61.000s 0.000us 272 300 90.67
aes_cipher_fi 61.000s 0.000us 325 350 92.86
shadow_reg_update_error 20 20 100.00
aes_shadow_reg_errors 3.000s 155.643us 20 20 100.00
shadow_reg_read_clear_staged_value 20 20 100.00
aes_shadow_reg_errors 3.000s 155.643us 20 20 100.00
shadow_reg_storage_error 20 20 100.00
aes_shadow_reg_errors 3.000s 155.643us 20 20 100.00
shadowed_reset_glitch 20 20 100.00
aes_shadow_reg_errors 3.000s 155.643us 20 20 100.00
shadow_reg_update_error_with_csr_rw 20 20 100.00
aes_shadow_reg_errors_with_csr_rw 5.000s 1759.784us 20 20 100.00
tl_intg_err 30 30 100.00
aes_sec_cm 13.000s 1219.457us 5 5 100.00
aes_tl_intg_err 5.000s 592.712us 25 25 100.00
sec_cm_bus_integrity 25 25 100.00
aes_tl_intg_err 5.000s 592.712us 25 25 100.00
sec_cm_lc_escalate_en_intersig_mubi 25 25 100.00
aes_alert_reset 22.000s 1266.597us 25 25 100.00
sec_cm_main_config_shadow 20 20 100.00
aes_shadow_reg_errors 3.000s 155.643us 20 20 100.00
sec_cm_gcm_config_shadow 20 20 100.00
aes_shadow_reg_errors 3.000s 155.643us 20 20 100.00
sec_cm_main_config_sparse 136 145 93.79
aes_smoke 5.000s 115.222us 10 10 100.00
aes_stress 15.000s 394.947us 10 10 100.00
aes_alert_reset 22.000s 1266.597us 25 25 100.00
aes_core_fi 87.000s 10247.341us 91 100 91.00
sec_cm_gcm_config_sparse 151 160 94.38
aes_config_error 23.000s 712.597us 50 50 100.00
aes_stress 15.000s 394.947us 10 10 100.00
aes_core_fi 87.000s 10247.341us 91 100 91.00
sec_cm_aux_config_shadow 20 20 100.00
aes_shadow_reg_errors 3.000s 155.643us 20 20 100.00
sec_cm_aux_config_regwen 20 20 100.00
aes_readability 3.000s 84.044us 10 10 100.00
aes_stress 15.000s 394.947us 10 10 100.00
sec_cm_key_sideload 20 20 100.00
aes_stress 15.000s 394.947us 10 10 100.00
aes_sideload 6.000s 243.215us 10 10 100.00
sec_cm_key_sw_unreadable 10 10 100.00
aes_readability 3.000s 84.044us 10 10 100.00
sec_cm_data_reg_sw_unreadable 10 10 100.00
aes_readability 3.000s 84.044us 10 10 100.00
sec_cm_key_sec_wipe 10 10 100.00
aes_readability 3.000s 84.044us 10 10 100.00
sec_cm_iv_config_sec_wipe 10 10 100.00
aes_readability 3.000s 84.044us 10 10 100.00
sec_cm_data_reg_sec_wipe 10 10 100.00
aes_readability 3.000s 84.044us 10 10 100.00
sec_cm_data_reg_key_sca 10 10 100.00
aes_stress 15.000s 394.947us 10 10 100.00
sec_cm_key_masking 10 10 100.00
aes_stress 15.000s 394.947us 10 10 100.00
sec_cm_main_fsm_sparse 0 10 0.00
aes_fi 8.000s 1081.753us 0 10 0.00
sec_cm_main_fsm_redun 622 685 90.80
aes_fi 8.000s 1081.753us 0 10 0.00
aes_control_fi 61.000s 0.000us 272 300 90.67
aes_cipher_fi 61.000s 0.000us 325 350 92.86
aes_ctr_fi 3.000s 106.890us 25 25 100.00
sec_cm_cipher_fsm_sparse 0 10 0.00
aes_fi 8.000s 1081.753us 0 10 0.00
sec_cm_cipher_fsm_redun 597 660 90.45
aes_fi 8.000s 1081.753us 0 10 0.00
aes_control_fi 61.000s 0.000us 272 300 90.67
aes_cipher_fi 61.000s 0.000us 325 350 92.86
sec_cm_cipher_ctr_redun 325 350 92.86
aes_cipher_fi 61.000s 0.000us 325 350 92.86
sec_cm_ctr_fsm_sparse 0 10 0.00
aes_fi 8.000s 1081.753us 0 10 0.00
sec_cm_ctr_fsm_redun 297 335 88.66
aes_fi 8.000s 1081.753us 0 10 0.00
aes_control_fi 61.000s 0.000us 272 300 90.67
aes_ctr_fi 3.000s 106.890us 25 25 100.00
sec_cm_ghash_fsm_sparse 0 10 0.00
aes_fi 8.000s 1081.753us 0 10 0.00
sec_cm_ctrl_sparse 622 685 90.80
aes_fi 8.000s 1081.753us 0 10 0.00
aes_control_fi 61.000s 0.000us 272 300 90.67
aes_cipher_fi 61.000s 0.000us 325 350 92.86
aes_ctr_fi 3.000s 106.890us 25 25 100.00
sec_cm_main_fsm_global_esc 25 25 100.00
aes_alert_reset 22.000s 1266.597us 25 25 100.00
sec_cm_main_fsm_local_esc 622 685 90.80
aes_fi 8.000s 1081.753us 0 10 0.00
aes_control_fi 61.000s 0.000us 272 300 90.67
aes_cipher_fi 61.000s 0.000us 325 350 92.86
aes_ctr_fi 3.000s 106.890us 25 25 100.00
sec_cm_cipher_fsm_local_esc 622 685 90.80
aes_fi 8.000s 1081.753us 0 10 0.00
aes_control_fi 61.000s 0.000us 272 300 90.67
aes_cipher_fi 61.000s 0.000us 325 350 92.86
aes_ctr_fi 3.000s 106.890us 25 25 100.00
sec_cm_ctr_fsm_local_esc 297 335 88.66
aes_fi 8.000s 1081.753us 0 10 0.00
aes_control_fi 61.000s 0.000us 272 300 90.67
aes_ctr_fi 3.000s 106.890us 25 25 100.00
sec_cm_ghash_fsm_local_esc 0 10 0.00
aes_fi 8.000s 1081.753us 0 10 0.00
sec_cm_data_reg_local_esc 597 660 90.45
aes_fi 8.000s 1081.753us 0 10 0.00
aes_control_fi 61.000s 0.000us 272 300 90.67
aes_cipher_fi 61.000s 0.000us 325 350 92.86
Testpoint Test Max Runtime Sim Time Pass Total %
stress_all_with_rand_reset 0 10 0.00
aes_stress_all_with_rand_reset 37.000s 2137.667us 0 10 0.00

Error Messages

   Test seed line log context
UVM_FATAL (aes_cipher_fi_vseq.sv:62) [aes_cipher_fi_vseq] wait timeout occurred! 19 test runs
aes_cipher_fi 93979567979584304516427317040387569022530311900078790709343846549043760025313 142
UVM_INFO @ 10021964149 ps: (uvm_report_catcher.svh:705) [UVM/REPORT/CATCHER]
--- UVM Report catcher Summary ---
aes_cipher_fi 27881014507675138874892992161360474793746235805736704510104544808499959662576 145
UVM_INFO @ 10017686441 ps: (uvm_report_catcher.svh:705) [UVM/REPORT/CATCHER]
--- UVM Report catcher Summary ---
aes_cipher_fi 66383999492111275035367869174995719527762740302684206993135360698543510085429 145
UVM_INFO @ 10064798590 ps: (uvm_report_catcher.svh:705) [UVM/REPORT/CATCHER]
--- UVM Report catcher Summary ---
aes_cipher_fi 21529031040111465275857636014887451286268784750576528469420972573324979445595 144
UVM_INFO @ 10110349147 ps: (uvm_report_catcher.svh:705) [UVM/REPORT/CATCHER]
--- UVM Report catcher Summary ---
aes_cipher_fi 40028563302240595570759681295703937161266916288120431743992462363530314247638 152
UVM_INFO @ 10009112320 ps: (uvm_report_catcher.svh:705) [UVM/REPORT/CATCHER]
--- UVM Report catcher Summary ---
aes_cipher_fi 15760826071563160163565652930625775627287427148032217519138558512451815403250 148
UVM_INFO @ 10017538682 ps: (uvm_report_catcher.svh:705) [UVM/REPORT/CATCHER]
--- UVM Report catcher Summary ---
aes_cipher_fi 75655566839554518979535727253330186316370261412472433122148180965543884163772 142
UVM_INFO @ 10189757802 ps: (uvm_report_catcher.svh:705) [UVM/REPORT/CATCHER]
--- UVM Report catcher Summary ---
aes_cipher_fi 53321819463767887038825738024429554511009290082170268791166109089793948172115 143
UVM_INFO @ 10012133894 ps: (uvm_report_catcher.svh:705) [UVM/REPORT/CATCHER]
--- UVM Report catcher Summary ---
aes_cipher_fi 39676147421251583785545083850140660746793860209660065807896875310002880033515 142
UVM_INFO @ 10016818427 ps: (uvm_report_catcher.svh:705) [UVM/REPORT/CATCHER]
--- UVM Report catcher Summary ---
aes_cipher_fi 104542199443870058326943654644324915068147777290300087555166948985196814790502 150
UVM_INFO @ 10025680921 ps: (uvm_report_catcher.svh:705) [UVM/REPORT/CATCHER]
--- UVM Report catcher Summary ---
aes_cipher_fi 95605879646938703415295640219351322186438648198096257430421075338469074843288 141
UVM_INFO @ 10013270549 ps: (uvm_report_catcher.svh:705) [UVM/REPORT/CATCHER]
--- UVM Report catcher Summary ---
aes_cipher_fi 109599088138119542109001122654803906784653268723342781757872191686045803023565 147
UVM_INFO @ 10019218253 ps: (uvm_report_catcher.svh:705) [UVM/REPORT/CATCHER]
--- UVM Report catcher Summary ---
aes_cipher_fi 2778642144363986213310277473465062203528052584771096840577982724699226250778 141
UVM_INFO @ 10062306770 ps: (uvm_report_catcher.svh:705) [UVM/REPORT/CATCHER]
--- UVM Report catcher Summary ---
aes_cipher_fi 8475507856715204221167286753727785366599629229446795729118977394007186166923 140
UVM_INFO @ 10019425130 ps: (uvm_report_catcher.svh:705) [UVM/REPORT/CATCHER]
--- UVM Report catcher Summary ---
aes_cipher_fi 46285742682146708318605841521984015267847169824404151584659552074594536726870 139
UVM_INFO @ 10009736399 ps: (uvm_report_catcher.svh:705) [UVM/REPORT/CATCHER]
--- UVM Report catcher Summary ---
aes_cipher_fi 21673177578287696446819997844366777417740869017342181228534264048560235772184 153
UVM_INFO @ 10018511132 ps: (uvm_report_catcher.svh:705) [UVM/REPORT/CATCHER]
--- UVM Report catcher Summary ---
aes_cipher_fi 65909030830432690976065626113501625327039511025622560155088773889625162661788 150
UVM_INFO @ 10017999523 ps: (uvm_report_catcher.svh:705) [UVM/REPORT/CATCHER]
--- UVM Report catcher Summary ---
aes_cipher_fi 12993853663801483293563536228928625366727749477898306141689624477479888695625 145
UVM_INFO @ 10024843378 ps: (uvm_report_catcher.svh:705) [UVM/REPORT/CATCHER]
--- UVM Report catcher Summary ---
aes_cipher_fi 39043911668426220636876095263669770923362972210228922859136497631909559618215 144
UVM_INFO @ 10006832801 ps: (uvm_report_catcher.svh:705) [UVM/REPORT/CATCHER]
--- UVM Report catcher Summary ---
Job timed out after * minutes 18 test runs
aes_control_fi 71200265387725045706443120753933021893098455512950802657069107472562714359695 None
aes_control_fi 6816352658837044486617057772474177131990190398807006216156217572475230875618 None
aes_control_fi 65903929532333376696539907611389660103789580589733249305363847041608124513509 None
aes_cipher_fi 80105695549103512061318200692093409058590998831289610306545138823817914515554 None
aes_control_fi 110606045442005966383561201728233343615473049164508080266253063569430724196980 None
aes_cipher_fi 22726590305426266012333754209669412918069536695560466320338502469831649548486 None
aes_control_fi 75102542135367067855382050184094271407644722227111727635342690879727486119245 None
aes_control_fi 41283303918374289557626780963988211243852933986768588052045138986377273930793 None
aes_cipher_fi 19934681436243279421631493453855409666865250073574628030264374156964926340874 None
aes_cipher_fi 113556501588044010965902381090791717715919052349828146173526927866779724809149 None
aes_control_fi 112537630322797915231932663657216260145978396070167294970828899423822771377167 None
aes_control_fi 32352156021840000567847218163163129469061282331420501248052186187805621032600 None
aes_control_fi 110714239611262230859682256035529471103162086403810076594152591195726718404326 None
aes_cipher_fi 27422297920043129920833863163785135565594434584378274128883776808552456841089 None
aes_control_fi 87685117510284190492885571130232835494699641296144661913519986269736965605770 None
aes_control_fi 83033444807461376796477517761479452054638817068133309770489230357472037038294 None
aes_control_fi 60955484282714801023819248008699386770578395417763541489552722971400212018160 None
aes_cipher_fi 14802892263416600503688441929869150028522821272576699423042425449012885238486 None
UVM_FATAL (aes_control_fi_vseq.sv:62) [aes_control_fi_vseq] wait timeout occurred! 16 test runs
aes_control_fi 63123597690217258387806894121989693976247478640730048972268428665606816237896 146
UVM_INFO @ 10020724260 ps: (uvm_report_catcher.svh:705) [UVM/REPORT/CATCHER]
--- UVM Report catcher Summary ---
aes_control_fi 60339363997216513311725792466589485514228861524704458053504840589899041971526 138
UVM_INFO @ 10041955450 ps: (uvm_report_catcher.svh:705) [UVM/REPORT/CATCHER]
--- UVM Report catcher Summary ---
aes_control_fi 35172486083033582375606318261607709571064953841278480106385622310391181457731 146
UVM_INFO @ 10010425091 ps: (uvm_report_catcher.svh:705) [UVM/REPORT/CATCHER]
--- UVM Report catcher Summary ---
aes_control_fi 7224722209597056816012488029461737495143086065950497272027135949769918618313 150
UVM_INFO @ 10016723764 ps: (uvm_report_catcher.svh:705) [UVM/REPORT/CATCHER]
--- UVM Report catcher Summary ---
aes_control_fi 112608124366722749519978219590527553135595713426892841158968416752638637685953 141
UVM_INFO @ 10007754651 ps: (uvm_report_catcher.svh:705) [UVM/REPORT/CATCHER]
--- UVM Report catcher Summary ---
aes_control_fi 37163497453475721005346900934574052654986669085037366791274119620411112842095 150
UVM_INFO @ 10012968961 ps: (uvm_report_catcher.svh:705) [UVM/REPORT/CATCHER]
--- UVM Report catcher Summary ---
aes_control_fi 17753209824875285303772031657581040944572121851202912746743338422446842975239 140
UVM_INFO @ 10008978199 ps: (uvm_report_catcher.svh:705) [UVM/REPORT/CATCHER]
--- UVM Report catcher Summary ---
aes_control_fi 68053617268410559209369439143196472846166120912195863130559188719940181874028 149
UVM_INFO @ 10032974056 ps: (uvm_report_catcher.svh:705) [UVM/REPORT/CATCHER]
--- UVM Report catcher Summary ---
aes_control_fi 112617245673695188109708477488675474755381750160429750449722036785893986112349 149
UVM_INFO @ 10028924001 ps: (uvm_report_catcher.svh:705) [UVM/REPORT/CATCHER]
--- UVM Report catcher Summary ---
aes_control_fi 4867759151267460685601232050606848649945001002505832284961344721808936986402 152
UVM_INFO @ 10014537726 ps: (uvm_report_catcher.svh:705) [UVM/REPORT/CATCHER]
--- UVM Report catcher Summary ---
aes_control_fi 1987736136353876382754380249828318771496991148197254341446515209671158703585 137
UVM_INFO @ 10010376724 ps: (uvm_report_catcher.svh:705) [UVM/REPORT/CATCHER]
--- UVM Report catcher Summary ---
aes_control_fi 95969096044146957024908674611167947080699247830844233316464223013298562539000 148
UVM_INFO @ 10024603002 ps: (uvm_report_catcher.svh:705) [UVM/REPORT/CATCHER]
--- UVM Report catcher Summary ---
aes_control_fi 2610498195229453032954504430743475498510827226314784614880932034654354584736 142
UVM_INFO @ 10011752478 ps: (uvm_report_catcher.svh:705) [UVM/REPORT/CATCHER]
--- UVM Report catcher Summary ---
aes_control_fi 85098872021478333813746443020072815037634091277665465518290559233077225870990 145
UVM_INFO @ 10018064002 ps: (uvm_report_catcher.svh:705) [UVM/REPORT/CATCHER]
--- UVM Report catcher Summary ---
aes_control_fi 20744670375956029939724467597406300592155902547371815427472190890218675415685 151
UVM_INFO @ 10030549957 ps: (uvm_report_catcher.svh:705) [UVM/REPORT/CATCHER]
--- UVM Report catcher Summary ---
aes_control_fi 66769720879765026671236295898378789367169069506065237808796095486897110705675 148
UVM_INFO @ 10012448230 ps: (uvm_report_catcher.svh:705) [UVM/REPORT/CATCHER]
--- UVM Report catcher Summary ---
UVM_ERROR (uvm_sequencer_base.svh:757) sequencer [SEQREQZMB] The task responsible for requesting a wait_for_grant on sequencer 'sequencer' for sequence 'parent_sequence' has been killed, to avoid a deadlock the sequence will be removed from the arbitration queues 10 test runs
aes_reseed 77875922437067920410612979858025994335929399536717485017857493496600668439114 1940
UVM_INFO @ 34941895 ps: (uvm_report_catcher.svh:705) [UVM/REPORT/CATCHER]
--- UVM Report catcher Summary ---
aes_stress_all_with_rand_reset 79845606765346250287473146265413836488489831852278648366590959648559598226007 401
UVM_INFO @ 2036147067 ps: (uvm_report_catcher.svh:705) [UVM/REPORT/CATCHER]
--- UVM Report catcher Summary ---
aes_stress_all 114577655808876122367487916936387209918601477590547687118776981024504210134674 28186
UVM_INFO @ 405625499 ps: (uvm_report_catcher.svh:705) [UVM/REPORT/CATCHER]
--- UVM Report catcher Summary ---
aes_stress_all_with_rand_reset 4549097287916200069058427540671265916447110260318514024306117688731278582300 166
UVM_INFO @ 131852024 ps: (uvm_report_catcher.svh:705) [UVM/REPORT/CATCHER]
--- UVM Report catcher Summary ---
aes_stress_all 69367226018838055136096835807444823974624911529540748156005571312361444855055 118983
UVM_INFO @ 919357929 ps: (uvm_report_catcher.svh:705) [UVM/REPORT/CATCHER]
--- UVM Report catcher Summary ---
aes_stress_all_with_rand_reset 31428104465760362582743835711688789421549097456526504936468756235387497136459 249
UVM_INFO @ 635079455 ps: (uvm_report_catcher.svh:705) [UVM/REPORT/CATCHER]
--- UVM Report catcher Summary ---
aes_reseed 42425883185196018112197326283472488881334423912614475366481360247512568651942 37816
UVM_INFO @ 594721816 ps: (uvm_report_catcher.svh:705) [UVM/REPORT/CATCHER]
--- UVM Report catcher Summary ---
aes_stress_all 109811286286662187156057514782928035433230699049792346802568178588821101944566 2155
UVM_INFO @ 61607034 ps: (uvm_report_catcher.svh:705) [UVM/REPORT/CATCHER]
--- UVM Report catcher Summary ---
aes_stress_all 1593600407975958281480112297819009352884588502945256433138482282210895489982 247911
UVM_INFO @ 2758537620 ps: (uvm_report_catcher.svh:705) [UVM/REPORT/CATCHER]
--- UVM Report catcher Summary ---
aes_stress_all 82581465577826064595168652003578251783819989781525137868878781623864840728904 13453
UVM_INFO @ 401836216 ps: (uvm_report_catcher.svh:705) [UVM/REPORT/CATCHER]
--- UVM Report catcher Summary ---
UVM_FATAL (aes_scoreboard.sv:923) scoreboard [scoreboard] 10 test runs
aes_fi 73987257078734392489478846977375220910388585170869547670810551837197290873637 4534
----| NO FAILURES BUT NUMBER OF EXPECTED MESSAGES DOES NOT MATCH ACTUAL
----| Expected: 6
----| Seen: 5
----| Expected corrupted: 0
aes_fi 73545619633882559782605503987768249372529742776371088770653115006326070884401 17274
----| NO FAILURES BUT NUMBER OF EXPECTED MESSAGES DOES NOT MATCH ACTUAL
----| Expected: 6
----| Seen: 5
----| Expected corrupted: 0
aes_fi 112905438493821763079864362640589847590101990944773631226085180624578986285547 5372
----| NO FAILURES BUT NUMBER OF EXPECTED MESSAGES DOES NOT MATCH ACTUAL
----| Expected: 4
----| Seen: 3
----| Expected corrupted: 0
aes_fi 77371550325739939721448709227654988712232504024505228947114366429614449259637 13299
----| NO FAILURES BUT NUMBER OF EXPECTED MESSAGES DOES NOT MATCH ACTUAL
----| Expected: 3
----| Seen: 2
----| Expected corrupted: 0
aes_fi 97897833222257672791557795973669651705104251218779631120140574715901395374556 18379
----| NO FAILURES BUT NUMBER OF EXPECTED MESSAGES DOES NOT MATCH ACTUAL
----| Expected: 5
----| Seen: 4
----| Expected corrupted: 0
aes_fi 104397864130281439650369249483038689675911172002785227428293364380604955707676 16058
----| NO FAILURES BUT NUMBER OF EXPECTED MESSAGES DOES NOT MATCH ACTUAL
----| Expected: 3
----| Seen: 2
----| Expected corrupted: 0
aes_fi 92463987455478436825975050576446467012412042806755099197193789270287279213413 14206
----| NO FAILURES BUT NUMBER OF EXPECTED MESSAGES DOES NOT MATCH ACTUAL
----| Expected: 6
----| Seen: 4
----| Expected corrupted: 0
aes_fi 87085281264968205119261122776174463798457025270196460106982849406570243000217 16642
----| NO FAILURES BUT NUMBER OF EXPECTED MESSAGES DOES NOT MATCH ACTUAL
----| Expected: 5
----| Seen: 2
----| Expected corrupted: 0
aes_fi 28765770554658909334555624330979310897514133256247950291916282333076211504048 9919
----| NO FAILURES BUT NUMBER OF EXPECTED MESSAGES DOES NOT MATCH ACTUAL
----| Expected: 5
----| Seen: 4
----| Expected corrupted: 0
aes_fi 1229973874235585776886185058980251501235568946417424640200787554305490271498 13047
----| NO FAILURES BUT NUMBER OF EXPECTED MESSAGES DOES NOT MATCH ACTUAL
----| Expected: 4
----| Seen: 3
----| Expected corrupted: 0
UVM_FATAL (aes_core_fi_vseq.sv:70) [aes_core_fi_vseq] wait timeout occurred! 8 test runs
aes_core_fi 69465555373520547169710851635333964517353427541624950950547830638327519027242 140
UVM_INFO @ 10247341457 ps: (uvm_report_catcher.svh:705) [UVM/REPORT/CATCHER]
--- UVM Report catcher Summary ---
aes_core_fi 103852988639194039891876914977158063244178884945859009730763940797518478450277 142
UVM_INFO @ 10007881910 ps: (uvm_report_catcher.svh:705) [UVM/REPORT/CATCHER]
--- UVM Report catcher Summary ---
aes_core_fi 9214450161076028247800423434137432858014232000738067244652694507839878987575 153
UVM_INFO @ 10018336294 ps: (uvm_report_catcher.svh:705) [UVM/REPORT/CATCHER]
--- UVM Report catcher Summary ---
aes_core_fi 43703135342001286343515116503555571276743789045277551029590352754329830827694 143
UVM_INFO @ 10008108857 ps: (uvm_report_catcher.svh:705) [UVM/REPORT/CATCHER]
--- UVM Report catcher Summary ---
aes_core_fi 107616997563542446975235734561108879610766514161804237588000455705967611106396 148
UVM_INFO @ 10013778984 ps: (uvm_report_catcher.svh:705) [UVM/REPORT/CATCHER]
--- UVM Report catcher Summary ---
aes_core_fi 49760060956297735605116239618065514343350415048117627245068774633056079401551 151
UVM_INFO @ 10010483636 ps: (uvm_report_catcher.svh:705) [UVM/REPORT/CATCHER]
--- UVM Report catcher Summary ---
aes_core_fi 101785140397618631780041457273215417048628377594103371705714213418228191191514 145
UVM_INFO @ 10011703238 ps: (uvm_report_catcher.svh:705) [UVM/REPORT/CATCHER]
--- UVM Report catcher Summary ---
aes_core_fi 4555018407558978723181050348162587055348915827833733887087011573527799902079 143
UVM_INFO @ 10008949259 ps: (uvm_report_catcher.svh:705) [UVM/REPORT/CATCHER]
--- UVM Report catcher Summary ---
UVM_FATAL (cip_base_vseq.sv:1230) [aes_common_vseq] Check failed (vseq_done) 6 test runs
aes_stress_all_with_rand_reset 30753672908416173611900100304048031513649693023547708502356772685448143753095 515
UVM_INFO @ 13954504590 ps: (uvm_report_catcher.svh:705) [UVM/REPORT/CATCHER]
--- UVM Report catcher Summary ---
aes_stress_all_with_rand_reset 12112753894686869156671724106898559087077286891113973871505557220986107928367 250
UVM_INFO @ 159268083 ps: (uvm_report_catcher.svh:705) [UVM/REPORT/CATCHER]
--- UVM Report catcher Summary ---
aes_stress_all_with_rand_reset 84137482093138752326747370729489439442242655140949059603530830043537609322029 202
UVM_INFO @ 3315249828 ps: (uvm_report_catcher.svh:705) [UVM/REPORT/CATCHER]
--- UVM Report catcher Summary ---
aes_stress_all_with_rand_reset 81279300767965955689522854224139247390626530276229902146842955848673712651291 462
UVM_INFO @ 2137667023 ps: (uvm_report_catcher.svh:705) [UVM/REPORT/CATCHER]
--- UVM Report catcher Summary ---
aes_stress_all_with_rand_reset 111849281798509955554331112140890109443693398589457677682037045225057703544811 208
UVM_INFO @ 90793011 ps: (uvm_report_catcher.svh:705) [UVM/REPORT/CATCHER]
--- UVM Report catcher Summary ---
aes_stress_all_with_rand_reset 18277846421615362662370899552943713890588439671893234413654633510875998543756 137
UVM_INFO @ 24219940 ps: (uvm_report_catcher.svh:705) [UVM/REPORT/CATCHER]
--- UVM Report catcher Summary ---
UVM_FATAL (aes_scoreboard.sv:782) scoreboard [scoreboard] # * 1 test run
aes_stress_all 20383258484350243447669822485373338830461126526169471272154922430612720453618 14849
TEST FAILED MESSAGES DID NOT MATCH
0 8d 3d 3d 0
1 00 bb bb 0
UVM_FATAL (aes_base_vseq.sv:1094) virtual_sequencer [aes_stress_vseq] 1 test run
aes_stress_all_with_rand_reset 72879399702334745394783929079155448887377389486968675938114245345863291038288 246
Was able to clear FATAL ALERT without reset
---| Idle: 0
---| Stall: 0
xmsim: *E,ASRTST (/nightly/current_run/scratch/master/aes_masked-sim-xcelium/default/fusesoc-work/src/lowrisc_ip_aes_*/rtl/aes_cipher_core.sv,858): Assertion AesSecCmKeyMaskingInitialPrngUpdateSubBytes has failed (* cycles, starting * PS) 1 test run
aes_core_fi 76850199092210175755151938706146479433957071225701565120203995575795845905416 141
UVM_ERROR @ 36177223 ps: (aes_cipher_core.sv:858) [ASSERT FAILED] AesSecCmKeyMaskingInitialPrngUpdateSubBytes
UVM_INFO @ 36177223 ps: (uvm_report_catcher.svh:705) [UVM/REPORT/CATCHER]
--- UVM Report catcher Summary ---