Simulation Results: chip

 
31/08/2026 21:27:41 DVSim: v1.52.0 sha: 93d21e7 json Branch: master Tool: vcs [unknown]
Coverage statistics
  • Total
  • 67.17 %
  • code
  • 61.50 %
  • assert
  • 76.58 %
  • func
  • 63.44 %
  • line
  • 67.13 %
  • branch
  • 73.83 %
  • cond
  • 64.05 %
  • toggle
  • 45.35 %
  • FSM
  • 57.14 %
Validation stages
V1
27.27%
V2
36.41%
V2S
100.00%
V3
0.00%
unmapped
40.00%
Testpoint Test Max Runtime Sim Time Pass Total %
chip_sw_uart_tx_rx 0 1 0.00
chip_sw_uart_tx_rx 15.935s 0.000us 0 1 0.00
chip_sw_uart_rx_overflow 0 1 0.00
chip_sw_uart_tx_rx 15.935s 0.000us 0 1 0.00
chip_sw_uart_rand_baudrate 0 1 0.00
chip_sw_uart_rand_baudrate 37.468s 0.000us 0 1 0.00
chip_sw_uart_tx_rx_alt_clk_freq 0 1 0.00
chip_sw_uart_tx_rx_alt_clk_freq 32.038s 0.000us 0 1 0.00
chip_sw_gpio_out 1 1 100.00
chip_sw_gpio 453.240s 288.565us 1 1 100.00
chip_sw_gpio_in 1 1 100.00
chip_sw_gpio 453.240s 288.565us 1 1 100.00
chip_sw_gpio_irq 1 1 100.00
chip_sw_gpio 453.240s 288.565us 1 1 100.00
chip_sw_example_tests 1 4 25.00
chip_sw_example_rom 55.940s 10.240us 0 1 0.00
chip_sw_example_manufacturer 19.382s 0.000us 0 1 0.00
chip_sw_example_concurrency 263.400s 168.812us 1 1 100.00
chip_sw_uart_smoketest_signed 32.890s 0.000us 0 1 0.00
csr_bit_bash 0 1 0.00
chip_csr_bit_bash 10.920s 0.000us 0 1 0.00
csr_aliasing 0 1 0.00
chip_csr_aliasing 11.520s 0.000us 0 1 0.00
regwen_csr_and_corresponding_lockable_csr 0 1 0.00
chip_csr_aliasing 11.520s 0.000us 0 1 0.00
xbar_smoke 1 1 100.00
xbar_smoke 12.630s 12.046us 1 1 100.00
Testpoint Test Max Runtime Sim Time Pass Total %
chip_sw_spi_device_flash_mode 0 1 0.00
chip_sw_uart_tx_rx_bootstrap 42.268s 0.000us 0 1 0.00
chip_sw_spi_device_pass_through 1 1 100.00
chip_sw_spi_device_pass_through 2975.190s 4390.850us 1 1 100.00
chip_sw_spi_device_pass_through_collision 0 1 0.00
chip_sw_spi_device_pass_through_collision 410.360s 273.046us 0 1 0.00
chip_sw_spi_device_tpm 0 1 0.00
chip_sw_spi_device_tpm 15.626s 0.000us 0 1 0.00
chip_sw_spi_host_tx_rx 0 1 0.00
chip_sw_spi_host_tx_rx 13.029s 0.000us 0 1 0.00
chip_sw_i2c_host_tx_rx 0 1 0.00
chip_sw_i2c_host_tx_rx 15.842s 0.000us 0 1 0.00
chip_sw_i2c_device_tx_rx 0 1 0.00
chip_sw_i2c_device_tx_rx 19.841s 0.000us 0 1 0.00
chip_pin_mux 0 1 0.00
chip_padctrl_attributes 3.840s 0.000us 0 1 0.00
chip_padctrl_attributes 0 1 0.00
chip_padctrl_attributes 3.840s 0.000us 0 1 0.00
chip_sw_sleep_pin_wake 0 1 0.00
chip_sw_sleep_pin_wake 13.435s 0.000us 0 1 0.00
chip_sw_sleep_pin_retention 0 1 0.00
chip_sw_sleep_pin_retention 17.404s 0.000us 0 1 0.00
chip_sw_data_integrity 0 1 0.00
chip_sw_data_integrity_escalation 13.702s 0.000us 0 1 0.00
chip_sw_instruction_integrity 0 1 0.00
chip_sw_data_integrity_escalation 13.702s 0.000us 0 1 0.00
chip_jtag_csr_rw 0 1 0.00
chip_jtag_csr_rw 152.760s 131.615us 0 1 0.00
chip_jtag_mem_access 0 1 0.00
chip_jtag_mem_access 149.780s 132.542us 0 1 0.00
chip_rv_dm_ndm_reset_req 1 1 100.00
chip_rv_dm_ndm_reset_req 467.450s 310.199us 1 1 100.00
chip_sw_rv_dm_ndm_reset_req_when_cpu_halted 0 1 0.00
chip_sw_rv_dm_ndm_reset_req_when_cpu_halted 11.801s 0.000us 0 1 0.00
chip_rv_dm_access_after_wakeup 0 1 0.00
chip_sw_rv_dm_access_after_wakeup 16.045s 0.000us 0 1 0.00
chip_rv_dm_lc_disabled 0 1 0.00
chip_rv_dm_lc_disabled 418.870s 504.759us 0 1 0.00
chip_sw_timer 1 1 100.00
chip_sw_rv_timer_irq 366.990s 266.954us 1 1 100.00
chip_sw_aon_timer_wakeup_irq 0 1 0.00
chip_sw_aon_timer_irq 627.880s 503.397us 0 1 0.00
chip_sw_aon_timer_wdog_bark_irq 0 1 0.00
chip_sw_aon_timer_irq 627.880s 503.397us 0 1 0.00
chip_sw_aon_timer_wdog_lc_escalate 1 1 100.00
chip_sw_aon_timer_wdog_lc_escalate 596.870s 386.525us 1 1 100.00
chip_sw_aon_timer_wdog_bite_reset 0 1 0.00
chip_sw_aon_timer_wdog_bite_reset 307.660s 182.604us 0 1 0.00
chip_sw_aon_timer_sleep_wdog_bite_reset 0 1 0.00
chip_sw_aon_timer_wdog_bite_reset 307.660s 182.604us 0 1 0.00
chip_sw_aon_timer_sleep_wdog_sleep_pause 1 1 100.00
chip_sw_aon_timer_sleep_wdog_sleep_pause 507.400s 2310.451us 1 1 100.00
chip_sw_plic_sw_irq 1 1 100.00
chip_sw_plic_sw_irq 265.740s 164.357us 1 1 100.00
chip_sw_clkmgr_idle_trans 4 4 100.00
chip_sw_otbn_randomness 473.610s 245.135us 1 1 100.00
chip_sw_aes_idle 274.210s 165.843us 1 1 100.00
chip_sw_hmac_enc_idle 293.680s 178.201us 1 1 100.00
chip_sw_kmac_idle 257.930s 164.067us 1 1 100.00
chip_sw_clkmgr_off_trans 0 4 0.00
chip_sw_clkmgr_off_aes_trans 287.220s 185.280us 0 1 0.00
chip_sw_clkmgr_off_hmac_trans 327.150s 185.280us 0 1 0.00
chip_sw_clkmgr_off_kmac_trans 298.170s 185.392us 0 1 0.00
chip_sw_clkmgr_off_otbn_trans 276.950s 185.360us 0 1 0.00
chip_sw_clkmgr_jitter 1 6 16.67
chip_sw_otbn_ecdsa_op_irq_jitter_en 53.880s 10.380us 0 1 0.00
chip_sw_aes_enc_jitter_en 56.340s 10.400us 0 1 0.00
chip_sw_hmac_enc_jitter_en 61.590s 10.360us 0 1 0.00
chip_sw_kmac_mode_kmac_jitter_en 66.580s 10.360us 0 1 0.00
chip_sw_sram_ctrl_scrambled_access_jitter_en 13.182s 0.000us 0 1 0.00
chip_sw_clkmgr_jitter 281.190s 161.261us 1 1 100.00
chip_sw_clkmgr_extended_range 1 7 14.29
chip_sw_clkmgr_jitter_reduced_freq 544.780s 1962.669us 1 1 100.00
chip_sw_otbn_ecdsa_op_irq_jitter_en_reduced_freq 52.040s 10.380us 0 1 0.00
chip_sw_aes_enc_jitter_en_reduced_freq 53.680s 10.140us 0 1 0.00
chip_sw_hmac_enc_jitter_en_reduced_freq 67.680s 10.320us 0 1 0.00
chip_sw_kmac_mode_kmac_jitter_en_reduced_freq 63.410s 10.140us 0 1 0.00
chip_sw_sram_ctrl_scrambled_access_jitter_en_reduced_freq 56.100s 10.180us 0 1 0.00
chip_sw_csrng_edn_concurrency_reduced_freq 51.310s 10.320us 0 1 0.00
chip_sw_clkmgr_deep_sleep_frequency 0 1 0.00
chip_sw_ast_clk_outputs 71.125s 0.000us 0 1 0.00
chip_sw_clkmgr_sleep_frequency 0 1 0.00
chip_sw_clkmgr_sleep_frequency 13.796s 0.000us 0 1 0.00
chip_sw_clkmgr_reset_frequency 0 1 0.00
chip_sw_clkmgr_reset_frequency 12.575s 0.000us 0 1 0.00
chip_sw_clkmgr_escalation_reset 0 1 0.00
chip_sw_all_escalation_resets 1393.490s 943.433us 0 1 0.00
chip_sw_pwrmgr_external_full_reset 1 1 100.00
chip_sw_pwrmgr_full_aon_reset 530.710s 499.712us 1 1 100.00
chip_sw_pwrmgr_sleep_all_reset_reqs 0 1 0.00
chip_sw_aon_timer_wdog_bite_reset 307.660s 182.604us 0 1 0.00
chip_sw_pwrmgr_wdog_reset 0 1 0.00
chip_sw_pwrmgr_wdog_reset 13.909s 0.000us 0 1 0.00
chip_sw_pwrmgr_power_glitch_reset 1 1 100.00
chip_sw_pwrmgr_full_aon_reset 530.710s 499.712us 1 1 100.00
chip_sw_pwrmgr_main_power_glitch_reset 0 1 0.00
chip_sw_pwrmgr_main_power_glitch_reset 18.537s 0.000us 0 1 0.00
chip_sw_pwrmgr_random_sleep_power_glitch_reset 0 1 0.00
chip_sw_pwrmgr_random_sleep_power_glitch_reset 20.023s 0.000us 0 1 0.00
chip_sw_pwrmgr_deep_sleep_power_glitch_reset 0 1 0.00
chip_sw_pwrmgr_deep_sleep_power_glitch_reset 13.456s 0.000us 0 1 0.00
chip_sw_pwrmgr_sleep_power_glitch_reset 0 1 0.00
chip_sw_pwrmgr_sleep_power_glitch_reset 14.982s 0.000us 0 1 0.00
chip_sw_pwrmgr_sleep_disabled 0 1 0.00
chip_sw_pwrmgr_sleep_disabled 17.730s 0.000us 0 1 0.00
chip_sw_pwrmgr_escalation_reset 0 1 0.00
chip_sw_all_escalation_resets 1393.490s 943.433us 0 1 0.00
chip_sw_rstmgr_sys_reset_info 1 1 100.00
chip_rv_dm_ndm_reset_req 467.450s 310.199us 1 1 100.00
chip_sw_rstmgr_cpu_info 0 1 0.00
chip_sw_rstmgr_cpu_info 570.140s 412.096us 0 1 0.00
chip_sw_rstmgr_sw_req_reset 1 1 100.00
chip_sw_rstmgr_sw_req 464.890s 305.440us 1 1 100.00
chip_sw_rstmgr_alert_info 0 1 0.00
chip_sw_rstmgr_alert_info 537.100s 331.228us 0 1 0.00
chip_sw_rstmgr_sw_rst 1 1 100.00
chip_sw_rstmgr_sw_rst 259.510s 163.760us 1 1 100.00
chip_sw_rstmgr_escalation_reset 0 1 0.00
chip_sw_all_escalation_resets 1393.490s 943.433us 0 1 0.00
chip_sw_alert_handler_alerts 0 1 0.00
chip_sw_alert_test 28.101s 0.000us 0 1 0.00
chip_sw_alert_handler_escalations 0 1 0.00
chip_sw_alert_handler_escalation 23.716s 0.000us 0 1 0.00
chip_sw_all_escalation_resets 0 1 0.00
chip_sw_all_escalation_resets 1393.490s 943.433us 0 1 0.00
chip_sw_alert_handler_entropy 0 1 0.00
chip_sw_alert_handler_entropy 69.732s 0.000us 0 1 0.00
chip_sw_alert_handler_crashdump 0 1 0.00
chip_sw_rstmgr_alert_info 537.100s 331.228us 0 1 0.00
chip_sw_alert_handler_ping_timeout 1 1 100.00
chip_sw_alert_handler_ping_timeout 417.950s 329.571us 1 1 100.00
chip_sw_alert_handler_lpg_sleep_mode_alerts 0 1 0.00
chip_sw_alert_handler_lpg_sleep_mode_alerts 89.283s 0.000us 0 1 0.00
chip_sw_alert_handler_lpg_sleep_mode_pings 0 1 0.00
chip_sw_alert_handler_lpg_sleep_mode_pings 116.469s 0.000us 0 1 0.00
chip_sw_alert_handler_lpg_clock_off 0 1 0.00
chip_sw_alert_handler_lpg_clkoff 99.646s 0.000us 0 1 0.00
chip_sw_alert_handler_lpg_reset_toggle 0 1 0.00
chip_sw_alert_handler_lpg_reset_toggle 103.134s 0.000us 0 1 0.00
chip_sw_alert_handler_reverse_ping_in_deep_sleep 0 1 0.00
chip_sw_alert_handler_reverse_ping_in_deep_sleep 96.285s 0.000us 0 1 0.00
chip_sw_lc_ctrl_alert_handler_escalation 0 1 0.00
chip_sw_alert_handler_escalation 23.716s 0.000us 0 1 0.00
chip_sw_lc_ctrl_jtag_access 0 1 0.00
chip_sw_lc_ctrl_transition 12.608s 0.000us 0 1 0.00
chip_sw_lc_ctrl_otp_hw_cfg 0 1 0.00
chip_sw_lc_ctrl_otp_hw_cfg 11.794s 0.000us 0 1 0.00
chip_sw_lc_ctrl_init 0 1 0.00
chip_sw_lc_ctrl_transition 12.608s 0.000us 0 1 0.00
chip_sw_lc_ctrl_transitions 0 1 0.00
chip_sw_lc_ctrl_transition 12.608s 0.000us 0 1 0.00
chip_sw_lc_ctrl_kmac_req 0 1 0.00
chip_sw_lc_ctrl_transition 12.608s 0.000us 0 1 0.00
chip_sw_lc_ctrl_broadcast 2 9 22.22
chip_sw_otp_ctrl_lc_signals_test_unlocked0 13.360s 0.000us 0 1 0.00
chip_sw_otp_ctrl_lc_signals_dev 19.466s 0.000us 0 1 0.00
chip_sw_otp_ctrl_lc_signals_prod 20.570s 0.000us 0 1 0.00
chip_sw_otp_ctrl_lc_signals_rma 13.056s 0.000us 0 1 0.00
chip_sw_lc_ctrl_transition 12.608s 0.000us 0 1 0.00
chip_sw_rom_ctrl_integrity_check 1157.190s 1294.047us 1 1 100.00
chip_sw_sram_ctrl_execution_main 13.610s 0.000us 0 1 0.00
chip_prim_tl_access 545.480s 625.030us 1 1 100.00
chip_rv_dm_lc_disabled 418.870s 504.759us 0 1 0.00
chip_sw_aes_enc 1 2 50.00
chip_sw_aes_enc 276.720s 173.241us 1 1 100.00
chip_sw_aes_enc_jitter_en 56.340s 10.400us 0 1 0.00
chip_sw_aes_gcm 1 2 50.00
chip_sw_aes_enc 276.720s 173.241us 1 1 100.00
chip_sw_aes_enc_jitter_en 56.340s 10.400us 0 1 0.00
chip_sw_aes_entropy 1 1 100.00
chip_sw_aes_entropy 277.310s 164.528us 1 1 100.00
chip_sw_aes_idle 1 1 100.00
chip_sw_aes_idle 274.210s 165.843us 1 1 100.00
chip_sw_hmac_enc 1 2 50.00
chip_sw_hmac_enc 295.500s 173.782us 1 1 100.00
chip_sw_hmac_enc_jitter_en 61.590s 10.360us 0 1 0.00
chip_sw_hmac_idle 1 1 100.00
chip_sw_hmac_enc_idle 293.680s 178.201us 1 1 100.00
chip_sw_kmac_enc 2 3 66.67
chip_sw_kmac_mode_cshake 276.180s 167.334us 1 1 100.00
chip_sw_kmac_mode_kmac 303.580s 188.892us 1 1 100.00
chip_sw_kmac_mode_kmac_jitter_en 66.580s 10.360us 0 1 0.00
chip_sw_kmac_app_lc 0 1 0.00
chip_sw_lc_ctrl_transition 12.608s 0.000us 0 1 0.00
chip_sw_kmac_app_rom 0 1 0.00
chip_sw_kmac_app_rom 23.525s 0.000us 0 1 0.00
chip_sw_kmac_entropy 1 1 100.00
chip_sw_kmac_entropy 335.600s 199.766us 1 1 100.00
chip_sw_kmac_idle 1 1 100.00
chip_sw_kmac_idle 257.930s 164.067us 1 1 100.00
chip_sw_entropy_src_csrng 1 1 100.00
chip_sw_entropy_src_csrng 2007.700s 2224.147us 1 1 100.00
chip_sw_csrng_edn_cmd 1 1 100.00
chip_sw_entropy_src_csrng 2007.700s 2224.147us 1 1 100.00
chip_sw_csrng_fuse_en_sw_app_read 0 1 0.00
chip_sw_csrng_fuse_en_sw_app_read_test 14.491s 0.000us 0 1 0.00
chip_sw_csrng_known_answer_tests 1 1 100.00
chip_sw_csrng_kat_test 276.390s 175.991us 1 1 100.00
chip_sw_edn_entropy_reqs 1 1 100.00
chip_sw_csrng_edn_concurrency 1898.420s 899.837us 1 1 100.00
chip_sw_otbn_op 1 2 50.00
chip_sw_otbn_ecdsa_op_irq 3530.330s 1494.104us 1 1 100.00
chip_sw_otbn_ecdsa_op_irq_jitter_en 53.880s 10.380us 0 1 0.00
chip_sw_otbn_rnd_entropy 1 1 100.00
chip_sw_otbn_randomness 473.610s 245.135us 1 1 100.00
chip_sw_otbn_urnd_entropy 1 1 100.00
chip_sw_otbn_randomness 473.610s 245.135us 1 1 100.00
chip_sw_otbn_idle 1 1 100.00
chip_sw_otbn_randomness 473.610s 245.135us 1 1 100.00
chip_sw_otbn_mem_scramble 1 1 100.00
chip_sw_otbn_mem_scramble 550.780s 280.758us 1 1 100.00
chip_sw_rom_access 1 1 100.00
chip_sw_rom_ctrl_integrity_check 1157.190s 1294.047us 1 1 100.00
chip_sw_rom_ctrl_integrity_check 1 1 100.00
chip_sw_rom_ctrl_integrity_check 1157.190s 1294.047us 1 1 100.00
chip_sw_sram_scrambled_access 1 2 50.00
chip_sw_sram_ctrl_scrambled_access 548.590s 350.279us 1 1 100.00
chip_sw_sram_ctrl_scrambled_access_jitter_en 13.182s 0.000us 0 1 0.00
chip_sw_sram_execution 0 1 0.00
chip_sw_sram_ctrl_execution_main 13.610s 0.000us 0 1 0.00
chip_sw_sram_lc_escalation 0 2 0.00
chip_sw_all_escalation_resets 1393.490s 943.433us 0 1 0.00
chip_sw_data_integrity_escalation 13.702s 0.000us 0 1 0.00
chip_otp_ctrl_init 0 1 0.00
chip_sw_lc_ctrl_transition 12.608s 0.000us 0 1 0.00
chip_sw_otp_ctrl_keys 3 3 100.00
chip_sw_otbn_mem_scramble 550.780s 280.758us 1 1 100.00
chip_sw_sram_ctrl_scrambled_access 548.590s 350.279us 1 1 100.00
chip_sw_rv_core_ibex_icache_invalidate 286.460s 176.024us 1 1 100.00
chip_sw_otp_ctrl_entropy 3 3 100.00
chip_sw_otbn_mem_scramble 550.780s 280.758us 1 1 100.00
chip_sw_sram_ctrl_scrambled_access 548.590s 350.279us 1 1 100.00
chip_sw_rv_core_ibex_icache_invalidate 286.460s 176.024us 1 1 100.00
chip_sw_otp_ctrl_program 0 1 0.00
chip_sw_lc_ctrl_transition 12.608s 0.000us 0 1 0.00
chip_sw_otp_ctrl_program_error 0 1 0.00
chip_sw_lc_ctrl_program_error 13.695s 0.000us 0 1 0.00
chip_sw_otp_ctrl_hw_cfg 0 1 0.00
chip_sw_lc_ctrl_otp_hw_cfg 11.794s 0.000us 0 1 0.00
chip_sw_otp_ctrl_lc_signals 1 6 16.67
chip_sw_otp_ctrl_lc_signals_test_unlocked0 13.360s 0.000us 0 1 0.00
chip_sw_otp_ctrl_lc_signals_dev 19.466s 0.000us 0 1 0.00
chip_sw_otp_ctrl_lc_signals_prod 20.570s 0.000us 0 1 0.00
chip_sw_otp_ctrl_lc_signals_rma 13.056s 0.000us 0 1 0.00
chip_sw_lc_ctrl_transition 12.608s 0.000us 0 1 0.00
chip_prim_tl_access 545.480s 625.030us 1 1 100.00
chip_sw_otp_prim_tl_access 1 1 100.00
chip_prim_tl_access 545.480s 625.030us 1 1 100.00
chip_sw_otp_ctrl_nvm_cnt 0 1 0.00
chip_sw_otp_ctrl_nvm_cnt 18.067s 0.000us 0 1 0.00
chip_sw_otp_ctrl_sw_parts 0 1 0.00
chip_sw_otp_ctrl_sw_parts 21.138s 0.000us 0 1 0.00
chip_sw_ast_clk_outputs 0 1 0.00
chip_sw_ast_clk_outputs 71.125s 0.000us 0 1 0.00
chip_sw_ast_sys_clk_jitter 1 6 16.67
chip_sw_otbn_ecdsa_op_irq_jitter_en 53.880s 10.380us 0 1 0.00
chip_sw_aes_enc_jitter_en 56.340s 10.400us 0 1 0.00
chip_sw_hmac_enc_jitter_en 61.590s 10.360us 0 1 0.00
chip_sw_kmac_mode_kmac_jitter_en 66.580s 10.360us 0 1 0.00
chip_sw_sram_ctrl_scrambled_access_jitter_en 13.182s 0.000us 0 1 0.00
chip_sw_clkmgr_jitter 281.190s 161.261us 1 1 100.00
chip_sw_soc_proxy_external_reset_requests 0 1 0.00
chip_sw_soc_proxy_smoketest 244.590s 156.320us 0 1 0.00
chip_sw_soc_proxy_external_irqs 0 1 0.00
chip_sw_soc_proxy_smoketest 244.590s 156.320us 0 1 0.00
chip_sw_soc_proxy_external_wakeup_requests 0 1 0.00
chip_sw_soc_proxy_external_wakeup 252.320s 157.913us 0 1 0.00
chip_sw_soc_proxy_gpios 1 1 100.00
chip_sw_soc_proxy_gpios 252.960s 180.103us 1 1 100.00
chip_sw_nmi_irq 0 1 0.00
chip_sw_rv_core_ibex_nmi_irq 498.280s 269.301us 0 1 0.00
chip_sw_rv_core_ibex_rnd 1 1 100.00
chip_sw_rv_core_ibex_rnd 337.810s 206.432us 1 1 100.00
chip_sw_rv_core_ibex_address_translation 1 1 100.00
chip_sw_rv_core_ibex_address_translation 311.960s 179.968us 1 1 100.00
chip_sw_rv_core_ibex_icache_scrambled_access 1 1 100.00
chip_sw_rv_core_ibex_icache_invalidate 286.460s 176.024us 1 1 100.00
chip_sw_rv_core_ibex_fault_dump 0 1 0.00
chip_sw_rstmgr_cpu_info 570.140s 412.096us 0 1 0.00
chip_sw_rv_core_ibex_double_fault 0 1 0.00
chip_sw_rstmgr_cpu_info 570.140s 412.096us 0 1 0.00
chip_sw_smoketest 14 14 100.00
chip_sw_aes_smoketest 250.500s 173.165us 1 1 100.00
chip_sw_aon_timer_smoketest 304.440s 182.384us 1 1 100.00
chip_sw_clkmgr_smoketest 262.460s 162.233us 1 1 100.00
chip_sw_csrng_smoketest 266.070s 164.287us 1 1 100.00
chip_sw_gpio_smoketest 293.160s 192.872us 1 1 100.00
chip_sw_hmac_smoketest 315.630s 195.004us 1 1 100.00
chip_sw_kmac_smoketest 332.870s 185.525us 1 1 100.00
chip_sw_otbn_smoketest 445.510s 230.213us 1 1 100.00
chip_sw_otp_ctrl_smoketest 284.050s 165.852us 1 1 100.00
chip_sw_rv_plic_smoketest 263.030s 164.019us 1 1 100.00
chip_sw_rv_timer_smoketest 394.690s 266.827us 1 1 100.00
chip_sw_rstmgr_smoketest 279.320s 161.072us 1 1 100.00
chip_sw_sram_ctrl_smoketest 246.160s 164.565us 1 1 100.00
chip_sw_uart_smoketest 279.550s 175.224us 1 1 100.00
chip_sw_rom_functests 0 1 0.00
rom_keymgr_dpe_functest 12.665s 0.000us 0 1 0.00
chip_sw_signed 0 1 0.00
chip_sw_uart_smoketest_signed 32.890s 0.000us 0 1 0.00
chip_sw_boot 0 1 0.00
chip_sw_uart_tx_rx_bootstrap 42.268s 0.000us 0 1 0.00
chip_sw_secure_boot 0 1 0.00
base_rom_e2e_smoke 10.906s 0.000us 0 1 0.00
chip_lc_scrap 4 4 100.00
chip_sw_lc_ctrl_rma_to_scrap 302.100s 216.621us 1 1 100.00
chip_sw_lc_ctrl_raw_to_scrap 276.940s 212.239us 1 1 100.00
chip_sw_lc_ctrl_test_locked0_to_scrap 257.940s 217.390us 1 1 100.00
chip_sw_lc_ctrl_rand_to_scrap 277.130s 213.792us 1 1 100.00
chip_lc_test_locked 0 2 0.00
chip_sw_lc_walkthrough_testunlocks 12.539s 0.000us 0 1 0.00
chip_rv_dm_lc_disabled 418.870s 504.759us 0 1 0.00
chip_sw_lc_walkthrough 0 5 0.00
chip_sw_lc_walkthrough_dev 59.598s 0.000us 0 1 0.00
chip_sw_lc_walkthrough_prod 50.318s 0.000us 0 1 0.00
chip_sw_lc_walkthrough_prodend 13.188s 0.000us 0 1 0.00
chip_sw_lc_walkthrough_rma 23.978s 0.000us 0 1 0.00
chip_sw_lc_walkthrough_testunlocks 12.539s 0.000us 0 1 0.00
chip_sw_lc_ctrl_volatile_raw_unlock 2 3 66.67
chip_sw_lc_ctrl_volatile_raw_unlock 712.220s 610.949us 1 1 100.00
chip_sw_lc_ctrl_volatile_raw_unlock_ext_clk_48mhz 941.300s 708.969us 1 1 100.00
rom_volatile_raw_unlock 128.906s 0.000us 0 1 0.00
chip_sw_rom_raw_unlock 0 1 0.00
rom_raw_unlock 117.363s 0.000us 0 1 0.00
chip_sw_exit_test_unlocked_bootstrap 0 1 0.00
chip_sw_exit_test_unlocked_bootstrap 42.262s 0.000us 0 1 0.00
chip_sw_inject_scramble_seed 0 1 0.00
chip_sw_inject_scramble_seed 110.092s 0.000us 0 1 0.00
tl_d_oob_addr_access 0 1 0.00
chip_tl_errors 145.790s 118.075us 0 1 0.00
tl_d_illegal_access 0 1 0.00
chip_tl_errors 145.790s 118.075us 0 1 0.00
tl_d_outstanding_access 0 2 0.00
chip_csr_aliasing 11.520s 0.000us 0 1 0.00
chip_same_csr_outstanding 11.620s 0.000us 0 1 0.00
tl_d_partial_access 0 2 0.00
chip_csr_aliasing 11.520s 0.000us 0 1 0.00
chip_same_csr_outstanding 11.620s 0.000us 0 1 0.00
xbar_base_random_sequence 1 1 100.00
xbar_random 17.340s 22.804us 1 1 100.00
xbar_random_delay 6 6 100.00
xbar_smoke_zero_delays 11.840s 11.443us 1 1 100.00
xbar_smoke_large_delays 335.320s 2451.283us 1 1 100.00
xbar_smoke_slow_rsp 465.840s 2036.195us 1 1 100.00
xbar_random_zero_delays 72.750s 39.873us 1 1 100.00
xbar_random_large_delays 1596.790s 12449.452us 1 1 100.00
xbar_random_slow_rsp 2115.760s 12601.515us 1 1 100.00
xbar_unmapped_address 2 2 100.00
xbar_unmapped_addr 103.470s 45.319us 1 1 100.00
xbar_error_and_unmapped_addr 42.860s 55.828us 1 1 100.00
xbar_error_cases 2 2 100.00
xbar_error_random 55.080s 104.192us 1 1 100.00
xbar_error_and_unmapped_addr 42.860s 55.828us 1 1 100.00
xbar_all_access_same_device 2 2 100.00
xbar_access_same_device 151.170s 125.625us 1 1 100.00
xbar_access_same_device_slow_rsp 1002.910s 4454.211us 1 1 100.00
xbar_all_hosts_use_same_source_id 1 1 100.00
xbar_same_source 255.240s 458.079us 1 1 100.00
xbar_stress_all 2 2 100.00
xbar_stress_all 1281.890s 2618.489us 1 1 100.00
xbar_stress_all_with_error 491.140s 373.764us 1 1 100.00
xbar_stress_with_reset 2 2 100.00
xbar_stress_all_with_rand_reset 160.630s 88.408us 1 1 100.00
xbar_stress_all_with_reset_error 1422.040s 867.723us 1 1 100.00
rom_e2e_smoke 0 1 0.00
rom_e2e_smoke 13.896s 0.000us 0 1 0.00
rom_e2e_shutdown_output 0 1 0.00
rom_e2e_shutdown_output 24.120s 0.000us 0 1 0.00
rom_e2e_shutdown_exception_c 0 1 0.00
rom_e2e_shutdown_exception_c 17.761s 0.000us 0 1 0.00
rom_e2e_boot_policy_valid 0 15 0.00
rom_e2e_boot_policy_valid_a_good_b_good_test_unlocked0 66.062s 0.000us 0 1 0.00
rom_e2e_boot_policy_valid_a_good_b_good_dev 16.757s 0.000us 0 1 0.00
rom_e2e_boot_policy_valid_a_good_b_good_prod 10.697s 0.000us 0 1 0.00
rom_e2e_boot_policy_valid_a_good_b_good_prod_end 13.430s 0.000us 0 1 0.00
rom_e2e_boot_policy_valid_a_good_b_good_rma 12.187s 0.000us 0 1 0.00
rom_e2e_boot_policy_valid_a_good_b_bad_test_unlocked0 164.205s 0.000us 0 1 0.00
rom_e2e_boot_policy_valid_a_good_b_bad_dev 11.164s 0.000us 0 1 0.00
rom_e2e_boot_policy_valid_a_good_b_bad_prod 11.810s 0.000us 0 1 0.00
rom_e2e_boot_policy_valid_a_good_b_bad_prod_end 13.398s 0.000us 0 1 0.00
rom_e2e_boot_policy_valid_a_good_b_bad_rma 15.749s 0.000us 0 1 0.00
rom_e2e_boot_policy_valid_a_bad_b_good_test_unlocked0 75.582s 0.000us 0 1 0.00
rom_e2e_boot_policy_valid_a_bad_b_good_dev 17.428s 0.000us 0 1 0.00
rom_e2e_boot_policy_valid_a_bad_b_good_prod 21.900s 0.000us 0 1 0.00
rom_e2e_boot_policy_valid_a_bad_b_good_prod_end 15.216s 0.000us 0 1 0.00
rom_e2e_boot_policy_valid_a_bad_b_good_rma 19.295s 0.000us 0 1 0.00
rom_e2e_sigverify_always 0 15 0.00
rom_e2e_sigverify_always_a_bad_b_bad_test_unlocked0 182.567s 0.000us 0 1 0.00
rom_e2e_sigverify_always_a_bad_b_bad_dev 21.320s 0.000us 0 1 0.00
rom_e2e_sigverify_always_a_bad_b_bad_prod 25.044s 0.000us 0 1 0.00
rom_e2e_sigverify_always_a_bad_b_bad_prod_end 24.195s 0.000us 0 1 0.00
rom_e2e_sigverify_always_a_bad_b_bad_rma 37.061s 0.000us 0 1 0.00
rom_e2e_sigverify_always_a_bad_b_nothing_test_unlocked0 148.020s 0.000us 0 1 0.00
rom_e2e_sigverify_always_a_bad_b_nothing_dev 14.843s 0.000us 0 1 0.00
rom_e2e_sigverify_always_a_bad_b_nothing_prod 15.895s 0.000us 0 1 0.00
rom_e2e_sigverify_always_a_bad_b_nothing_prod_end 21.108s 0.000us 0 1 0.00
rom_e2e_sigverify_always_a_bad_b_nothing_rma 19.878s 0.000us 0 1 0.00
rom_e2e_sigverify_always_a_nothing_b_bad_test_unlocked0 139.286s 0.000us 0 1 0.00
rom_e2e_sigverify_always_a_nothing_b_bad_dev 12.477s 0.000us 0 1 0.00
rom_e2e_sigverify_always_a_nothing_b_bad_prod 14.916s 0.000us 0 1 0.00
rom_e2e_sigverify_always_a_nothing_b_bad_prod_end 14.543s 0.000us 0 1 0.00
rom_e2e_sigverify_always_a_nothing_b_bad_rma 13.205s 0.000us 0 1 0.00
rom_e2e_asm_init 0 5 0.00
rom_e2e_asm_init_test_unlocked0 167.579s 0.000us 0 1 0.00
rom_e2e_asm_init_dev 12.416s 0.000us 0 1 0.00
rom_e2e_asm_init_prod 24.785s 0.000us 0 1 0.00
rom_e2e_asm_init_prod_end 12.158s 0.000us 0 1 0.00
rom_e2e_asm_init_rma 12.806s 0.000us 0 1 0.00
rom_e2e_keymgr_dpe_init 0 3 0.00
rom_e2e_keymgr_dpe_init_rom_ext_meas 16.649s 0.000us 0 1 0.00
rom_e2e_keymgr_dpe_init_rom_ext_no_meas 18.267s 0.000us 0 1 0.00
rom_e2e_keymgr_dpe_init_rom_ext_invalid_meas 19.641s 0.000us 0 1 0.00
rom_e2e_static_critical 0 1 0.00
rom_e2e_static_critical 15.356s 0.000us 0 1 0.00
Testpoint Test Max Runtime Sim Time Pass Total %
chip_sw_aes_masking_off 1 1 100.00
chip_sw_aes_masking_off 327.880s 196.275us 1 1 100.00
chip_sw_rv_core_ibex_lockstep_glitch 1 1 100.00
chip_sw_rv_core_ibex_lockstep_glitch 224.390s 137.165us 1 1 100.00
Testpoint Test Max Runtime Sim Time Pass Total %
chip_rv_dm_perform_debug 0 3 0.00
rom_e2e_jtag_debug_test_unlocked0 31.695s 0.000us 0 1 0.00
rom_e2e_jtag_debug_dev 19.992s 0.000us 0 1 0.00
rom_e2e_jtag_debug_rma 19.396s 0.000us 0 1 0.00
chip_sw_rv_dm_access_after_hw_reset 0 1 0.00
chip_sw_rv_dm_access_after_escalation_reset 21.605s 0.000us 0 1 0.00
chip_sw_plic_alerts 0 1 0.00
chip_sw_all_escalation_resets 1393.490s 943.433us 0 1 0.00
chip_sw_otp_ctrl_vendor_test_csr_access 0 1 0.00
chip_sw_otp_ctrl_vendor_test_csr_access 12.824s 0.000us 0 1 0.00
chip_sw_otp_ctrl_escalation 0 1 0.00
chip_sw_otp_ctrl_escalation 298.140s 176.940us 0 1 0.00
chip_sw_coremark 0 1 0.00
chip_sw_coremark 14.865s 0.000us 0 1 0.00
chip_sw_power_max_load 0 1 0.00
chip_sw_power_virus 104.816s 0.000us 0 1 0.00
rom_e2e_debug 0 3 0.00
rom_e2e_jtag_debug_test_unlocked0 31.695s 0.000us 0 1 0.00
rom_e2e_jtag_debug_dev 19.992s 0.000us 0 1 0.00
rom_e2e_jtag_debug_rma 19.396s 0.000us 0 1 0.00
rom_e2e_jtag_inject 0 3 0.00
rom_e2e_jtag_inject_test_unlocked0 23.094s 0.000us 0 1 0.00
rom_e2e_jtag_inject_dev 29.497s 0.000us 0 1 0.00
rom_e2e_jtag_inject_rma 16.729s 0.000us 0 1 0.00
rom_e2e_self_hash 0 1 0.00
rom_e2e_self_hash 186.139s 0.000us 0 1 0.00
Testpoint Test Max Runtime Sim Time Pass Total %
Unmapped 8 20 40.00
chip_sw_rstmgr_rst_cnsty_escalation 59.720s 10.300us 0 1 0.00
chip_sw_aes_gcm 376.670s 203.632us 1 1 100.00
chip_sw_entropy_src_kat_test 247.820s 163.650us 1 1 100.00
chip_sw_entropy_src_ast_rng_req 253.600s 161.177us 1 1 100.00
chip_plic_all_irqs_0 582.440s 327.718us 1 1 100.00
chip_plic_all_irqs_10 483.980s 300.650us 1 1 100.00
chip_sw_dma_inline_hashing 370.680s 210.503us 1 1 100.00
chip_sw_dma_abort 387.500s 211.731us 0 1 0.00
rom_e2e_sigverify_mod_exp_test_unlocked0_otbn 40.122s 0.000us 0 1 0.00
rom_e2e_sigverify_mod_exp_test_unlocked0_sw 37.601s 0.000us 0 1 0.00
rom_e2e_sigverify_mod_exp_dev_otbn 12.473s 0.000us 0 1 0.00
rom_e2e_sigverify_mod_exp_dev_sw 22.670s 0.000us 0 1 0.00
rom_e2e_sigverify_mod_exp_prod_otbn 18.536s 0.000us 0 1 0.00
rom_e2e_sigverify_mod_exp_prod_sw 19.206s 0.000us 0 1 0.00
rom_e2e_sigverify_mod_exp_prod_end_otbn 11.757s 0.000us 0 1 0.00
rom_e2e_sigverify_mod_exp_prod_end_sw 19.438s 0.000us 0 1 0.00
rom_e2e_sigverify_mod_exp_rma_otbn 14.987s 0.000us 0 1 0.00
rom_e2e_sigverify_mod_exp_rma_sw 11.816s 0.000us 0 1 0.00
chip_sw_entropy_src_smoketest 356.580s 207.111us 1 1 100.00
chip_sw_mbx_smoketest 571.790s 380.998us 1 1 100.00

Error Messages

   Test seed line log context
Some pass patterns missing: ['^TEST PASSED (UVM_)?CHECKS$'] 119 test runs
chip_sw_example_manufacturer 102038197769182710535352758961688740791151205375042499122790653939691618951695 None
ERROR: Analysis of target '@@+hooks+manufacturer_test_hooks//:example_test_sim_dv' failed; build aborted: Target @@+hooks+manufacturer_test_hooks//:example_test_sim_dv is incompatible and cannot be built, but was explicitly requested.
Dependency chain:
@@+hooks+manufacturer_test_hooks//:example_test_sim_dv (f2055d) <-- target platform (//toolchain:opentitan_platform) didn't satisfy constraint @@platforms//:incompatible
INFO: Elapsed time: 1.483s, Critical Path: 0.04s
INFO: 1 process: 1 internal.
ERROR: Build did NOT complete successfully
FAILED:
_run_cmd -> had a non-zero return code of 1.
make: *** [/nightly/current_run/opentitan/hw/dv/tools/dvsim/sim.mk:58: sw_build] Error 1
chip_sw_data_integrity_escalation 101289881190817995516057386011091755074244170315402268643350332597514547664764 None
Use --verbose_failures to see the command lines of failed build steps.
ERROR: Analysis of target '//sw/device/tests/sim_dv:data_integrity_escalation_reset_test_sim_dv' failed; build aborted: Target //sw/device/tests/sim_dv:data_integrity_escalation_reset_test_sim_dv is incompatible and cannot be built, but was explicitly requested.
Dependency chain:
//sw/device/tests/sim_dv:data_integrity_escalation_reset_test_sim_dv (f2055d) <-- target platform (//toolchain:opentitan_platform) didn't satisfy constraint @@platforms//:incompatible
INFO: Elapsed time: 0.429s, Critical Path: 0.04s
INFO: 1 process: 1 internal.
ERROR: Build did NOT complete successfully
_run_cmd -> had a non-zero return code of 1.
make: *** [/nightly/current_run/opentitan/hw/dv/tools/dvsim/sim.mk:58: sw_build] Error 1
chip_sw_sleep_pin_wake 35196284085343949580330911502636455702666889531160671385777051498669749628189 None
Use --verbose_failures to see the command lines of failed build steps.
ERROR: Analysis of target '//sw/device/tests:sleep_pin_wake_test_sim_dv' failed; build aborted: Target //sw/device/tests:sleep_pin_wake_test_sim_dv is incompatible and cannot be built, but was explicitly requested.
Dependency chain:
//sw/device/tests:sleep_pin_wake_test_sim_dv (f2055d) <-- target platform (//toolchain:opentitan_platform) didn't satisfy constraint @@platforms//:incompatible
INFO: Elapsed time: 0.345s, Critical Path: 0.04s
INFO: 1 process: 1 internal.
ERROR: Build did NOT complete successfully
_run_cmd -> had a non-zero return code of 1.
make: *** [/nightly/current_run/opentitan/hw/dv/tools/dvsim/sim.mk:58: sw_build] Error 1
chip_sw_sleep_pin_retention 19006954708376980499485336588060074097251411123606009304691946869801992635614 None
Use --verbose_failures to see the command lines of failed build steps.
ERROR: Analysis of target '//sw/device/tests:sleep_pin_retention_test_sim_dv' failed; build aborted: Target //sw/device/tests:sleep_pin_retention_test_sim_dv is incompatible and cannot be built, but was explicitly requested.
Dependency chain:
//sw/device/tests:sleep_pin_retention_test_sim_dv (f2055d) <-- target platform (//toolchain:opentitan_platform) didn't satisfy constraint @@platforms//:incompatible
INFO: Elapsed time: 0.823s, Critical Path: 0.04s
INFO: 1 process: 1 internal.
ERROR: Build did NOT complete successfully
_run_cmd -> had a non-zero return code of 1.
make: *** [/nightly/current_run/opentitan/hw/dv/tools/dvsim/sim.mk:58: sw_build] Error 1
chip_sw_uart_tx_rx 57330018620352582254185753771666500077240362915092005637835694435588952837741 None
Use --verbose_failures to see the command lines of failed build steps.
ERROR: Analysis of target '//sw/device/tests:uart_tx_rx_test_sim_dv' failed; build aborted: Target //sw/device/tests:uart_tx_rx_test_sim_dv is incompatible and cannot be built, but was explicitly requested.
Dependency chain:
//sw/device/tests:uart_tx_rx_test_sim_dv (f2055d) <-- target platform (//toolchain:opentitan_platform) didn't satisfy constraint @@platforms//:incompatible
INFO: Elapsed time: 1.276s, Critical Path: 0.04s
INFO: 1 process: 1 internal.
ERROR: Build did NOT complete successfully
_run_cmd -> had a non-zero return code of 1.
make: *** [/nightly/current_run/opentitan/hw/dv/tools/dvsim/sim.mk:58: sw_build] Error 1
chip_sw_uart_tx_rx_bootstrap 75222082053012074487186455358718066879650637782208428452193658061977083626195 None
Use --verbose_failures to see the command lines of failed build steps.
ERROR: Analysis of target '//sw/device/tests:uart_tx_rx_test_sim_dv' failed; build aborted: Target //sw/device/tests:uart_tx_rx_test_sim_dv is incompatible and cannot be built, but was explicitly requested.
Dependency chain:
//sw/device/tests:uart_tx_rx_test_sim_dv (f2055d) <-- target platform (//toolchain:opentitan_platform) didn't satisfy constraint @@platforms//:incompatible
INFO: Elapsed time: 8.818s, Critical Path: 0.03s
INFO: 1 process: 1 internal.
ERROR: Build did NOT complete successfully
_run_cmd -> had a non-zero return code of 1.
make: *** [/nightly/current_run/opentitan/hw/dv/tools/dvsim/sim.mk:58: sw_build] Error 1
chip_sw_inject_scramble_seed 111387525852577498513917275589559594172771994104386153992840529755676702561349 None
Use --verbose_failures to see the command lines of failed build steps.
ERROR: Analysis of target '//sw/device/tests/sim_dv:inject_scramble_seed_sim_dv' failed; build aborted: Target //sw/device/tests/sim_dv:inject_scramble_seed_sim_dv is incompatible and cannot be built, but was explicitly requested.
Dependency chain:
//sw/device/tests/sim_dv:inject_scramble_seed_sim_dv (f2055d) <-- target platform (//toolchain:opentitan_platform) didn't satisfy constraint @@platforms//:incompatible
INFO: Elapsed time: 1.084s, Critical Path: 0.03s
INFO: 1 process: 1 internal.
ERROR: Build did NOT complete successfully
_run_cmd -> had a non-zero return code of 1.
make: *** [/nightly/current_run/opentitan/hw/dv/tools/dvsim/sim.mk:58: sw_build] Error 1
chip_sw_exit_test_unlocked_bootstrap 67540136077537966002822789801686284782711486640984987742666896958899181286321 None
Use --verbose_failures to see the command lines of failed build steps.
ERROR: Analysis of target '//sw/device/tests/sim_dv:exit_test_unlocked_bootstrap_sim_dv' failed; build aborted: Target //sw/device/tests/sim_dv:exit_test_unlocked_bootstrap_sim_dv is incompatible and cannot be built, but was explicitly requested.
Dependency chain:
//sw/device/tests/sim_dv:exit_test_unlocked_bootstrap_sim_dv (f2055d) <-- target platform (//toolchain:opentitan_platform) didn't satisfy constraint @@platforms//:incompatible
INFO: Elapsed time: 13.282s, Critical Path: 0.03s
INFO: 1 process: 1 internal.
ERROR: Build did NOT complete successfully
_run_cmd -> had a non-zero return code of 1.
make: *** [/nightly/current_run/opentitan/hw/dv/tools/dvsim/sim.mk:58: sw_build] Error 1
chip_sw_uart_rand_baudrate 9871862301474872491063554537555321735495802743826212939366180945852409862935 None
Use --verbose_failures to see the command lines of failed build steps.
ERROR: Analysis of target '//sw/device/tests:uart_tx_rx_test_sim_dv' failed; build aborted: Target //sw/device/tests:uart_tx_rx_test_sim_dv is incompatible and cannot be built, but was explicitly requested.
Dependency chain:
//sw/device/tests:uart_tx_rx_test_sim_dv (f2055d) <-- target platform (//toolchain:opentitan_platform) didn't satisfy constraint @@platforms//:incompatible
INFO: Elapsed time: 1.445s, Critical Path: 0.04s
INFO: 1 process: 1 internal.
ERROR: Build did NOT complete successfully
_run_cmd -> had a non-zero return code of 1.
make: *** [/nightly/current_run/opentitan/hw/dv/tools/dvsim/sim.mk:58: sw_build] Error 1
chip_sw_uart_tx_rx_alt_clk_freq 22174113519559302742527451326989376498255819417679393606411016411027645205427 None
Use --verbose_failures to see the command lines of failed build steps.
ERROR: Analysis of target '//sw/device/tests:uart_tx_rx_test_sim_dv' failed; build aborted: Target //sw/device/tests:uart_tx_rx_test_sim_dv is incompatible and cannot be built, but was explicitly requested.
Dependency chain:
//sw/device/tests:uart_tx_rx_test_sim_dv (f2055d) <-- target platform (//toolchain:opentitan_platform) didn't satisfy constraint @@platforms//:incompatible
INFO: Elapsed time: 2.270s, Critical Path: 0.01s
INFO: 1 process: 1 internal.
ERROR: Build did NOT complete successfully
_run_cmd -> had a non-zero return code of 1.
make: *** [/nightly/current_run/opentitan/hw/dv/tools/dvsim/sim.mk:58: sw_build] Error 1
chip_sw_i2c_host_tx_rx 11990470681015736732057207764859634487380685517878347279465425390109313348864 None
Use --verbose_failures to see the command lines of failed build steps.
ERROR: Analysis of target '//sw/device/tests/sim_dv:i2c_host_tx_rx_test_sim_dv' failed; build aborted: Target //sw/device/tests/sim_dv:i2c_host_tx_rx_test_sim_dv is incompatible and cannot be built, but was explicitly requested.
Dependency chain:
//sw/device/tests/sim_dv:i2c_host_tx_rx_test_sim_dv (f2055d) <-- target platform (//toolchain:opentitan_platform) didn't satisfy constraint @@platforms//:incompatible
INFO: Elapsed time: 0.957s, Critical Path: 0.05s
INFO: 1 process: 1 internal.
ERROR: Build did NOT complete successfully
_run_cmd -> had a non-zero return code of 1.
make: *** [/nightly/current_run/opentitan/hw/dv/tools/dvsim/sim.mk:58: sw_build] Error 1
chip_sw_i2c_device_tx_rx 38018328749862820177686172594686344736336417312514137983491767482133742761027 None
Use --verbose_failures to see the command lines of failed build steps.
ERROR: Analysis of target '//sw/device/tests/sim_dv:i2c_device_tx_rx_test_sim_dv' failed; build aborted: Target //sw/device/tests/sim_dv:i2c_device_tx_rx_test_sim_dv is incompatible and cannot be built, but was explicitly requested.
Dependency chain:
//sw/device/tests/sim_dv:i2c_device_tx_rx_test_sim_dv (f2055d) <-- target platform (//toolchain:opentitan_platform) didn't satisfy constraint @@platforms//:incompatible
INFO: Elapsed time: 2.189s, Critical Path: 0.04s
INFO: 1 process: 1 internal.
ERROR: Build did NOT complete successfully
_run_cmd -> had a non-zero return code of 1.
make: *** [/nightly/current_run/opentitan/hw/dv/tools/dvsim/sim.mk:58: sw_build] Error 1
chip_sw_spi_device_tpm 62672667029206132096442634297191439326939216234735892137072909488169206905368 None
Use --verbose_failures to see the command lines of failed build steps.
ERROR: Analysis of target '//sw/device/tests:spi_device_tpm_tx_rx_test_sim_dv' failed; build aborted: Target //sw/device/tests:spi_device_tpm_tx_rx_test_sim_dv is incompatible and cannot be built, but was explicitly requested.
Dependency chain:
//sw/device/tests:spi_device_tpm_tx_rx_test_sim_dv (f2055d) <-- target platform (//toolchain:opentitan_platform) didn't satisfy constraint @@platforms//:incompatible
INFO: Elapsed time: 1.670s, Critical Path: 0.04s
INFO: 1 process: 1 internal.
ERROR: Build did NOT complete successfully
_run_cmd -> had a non-zero return code of 1.
make: *** [/nightly/current_run/opentitan/hw/dv/tools/dvsim/sim.mk:58: sw_build] Error 1
chip_sw_spi_host_tx_rx 38076978770272276857021560347106935344160901966040750334606932638713349034781 None
Use --verbose_failures to see the command lines of failed build steps.
ERROR: Analysis of target '//sw/device/tests/sim_dv:spi_host_tx_rx_test_sim_dv' failed; build aborted: Target //sw/device/tests/sim_dv:spi_host_tx_rx_test_sim_dv is incompatible and cannot be built, but was explicitly requested.
Dependency chain:
//sw/device/tests/sim_dv:spi_host_tx_rx_test_sim_dv (f2055d) <-- target platform (//toolchain:opentitan_platform) didn't satisfy constraint @@platforms//:incompatible
INFO: Elapsed time: 0.383s, Critical Path: 0.02s
INFO: 1 process: 1 internal.
ERROR: Build did NOT complete successfully
_run_cmd -> had a non-zero return code of 1.
make: *** [/nightly/current_run/opentitan/hw/dv/tools/dvsim/sim.mk:58: sw_build] Error 1
chip_sw_lc_ctrl_otp_hw_cfg 77767455258778154051618979490572046775647069414150665641645728678206897993720 None
---- STDOUT ----
---- STDERR ----
WARNING: Target pattern parsing failed.
ERROR: Skipping '//sw/device/tests:lc_ctrl_otp_hw_cfg_test_sim_dv': no such target '//sw/device/tests:lc_ctrl_otp_hw_cfg_test_sim_dv': target 'lc_ctrl_otp_hw_cfg_test_sim_dv' not declared in package 'sw/device/tests' defined by /nightly/current_run/opentitan/sw/device/tests/BUILD (did you mean lc_ctrl_otp_hw_cfg0_test_sim_dv?)
ERROR: no such target '//sw/device/tests:lc_ctrl_otp_hw_cfg_test_sim_dv': target 'lc_ctrl_otp_hw_cfg_test_sim_dv' not declared in package 'sw/device/tests' defined by /nightly/current_run/opentitan/sw/device/tests/BUILD (did you mean lc_ctrl_otp_hw_cfg0_test_sim_dv?)
ERROR: Build did NOT complete successfully
_run_cmd -> had a non-zero return code of 1.
make: *** [/nightly/current_run/opentitan/hw/dv/tools/dvsim/sim.mk:58: sw_build] Error 1
chip_sw_otp_ctrl_lc_signals_test_unlocked0 38909039818136163285498207489714300339454410635263590727709319885507074534368 None
Use --verbose_failures to see the command lines of failed build steps.
ERROR: Analysis of target '//sw/device/tests/sim_dv:otp_ctrl_lc_signals_test_sim_dv' failed; build aborted: Target //sw/device/tests/sim_dv:otp_ctrl_lc_signals_test_sim_dv is incompatible and cannot be built, but was explicitly requested.
Dependency chain:
//sw/device/tests/sim_dv:otp_ctrl_lc_signals_test_sim_dv (f2055d) <-- target platform (//toolchain:opentitan_platform) didn't satisfy constraint @@platforms//:incompatible
INFO: Elapsed time: 0.903s, Critical Path: 0.04s
INFO: 1 process: 1 internal.
ERROR: Build did NOT complete successfully
_run_cmd -> had a non-zero return code of 1.
make: *** [/nightly/current_run/opentitan/hw/dv/tools/dvsim/sim.mk:58: sw_build] Error 1
chip_sw_otp_ctrl_lc_signals_dev 66860745692632995322284621512711010738646051284202994492040804395325308178267 None
Use --verbose_failures to see the command lines of failed build steps.
ERROR: Analysis of target '//sw/device/tests/sim_dv:otp_ctrl_lc_signals_test_sim_dv' failed; build aborted: Target //sw/device/tests/sim_dv:otp_ctrl_lc_signals_test_sim_dv is incompatible and cannot be built, but was explicitly requested.
Dependency chain:
//sw/device/tests/sim_dv:otp_ctrl_lc_signals_test_sim_dv (f2055d) <-- target platform (//toolchain:opentitan_platform) didn't satisfy constraint @@platforms//:incompatible
INFO: Elapsed time: 1.857s, Critical Path: 0.03s
INFO: 1 process: 1 internal.
ERROR: Build did NOT complete successfully
_run_cmd -> had a non-zero return code of 1.
make: *** [/nightly/current_run/opentitan/hw/dv/tools/dvsim/sim.mk:58: sw_build] Error 1
chip_sw_otp_ctrl_lc_signals_prod 113007890579222585857839797078998578280045264704510722011516226391535081196494 None
Use --verbose_failures to see the command lines of failed build steps.
ERROR: Analysis of target '//sw/device/tests/sim_dv:otp_ctrl_lc_signals_test_sim_dv' failed; build aborted: Target //sw/device/tests/sim_dv:otp_ctrl_lc_signals_test_sim_dv is incompatible and cannot be built, but was explicitly requested.
Dependency chain:
//sw/device/tests/sim_dv:otp_ctrl_lc_signals_test_sim_dv (f2055d) <-- target platform (//toolchain:opentitan_platform) didn't satisfy constraint @@platforms//:incompatible
INFO: Elapsed time: 1.800s, Critical Path: 0.03s
INFO: 1 process: 1 internal.
ERROR: Build did NOT complete successfully
_run_cmd -> had a non-zero return code of 1.
make: *** [/nightly/current_run/opentitan/hw/dv/tools/dvsim/sim.mk:58: sw_build] Error 1
chip_sw_otp_ctrl_lc_signals_rma 28164628763119692282143070234848065168595771928996272861158586878472142143903 None
Use --verbose_failures to see the command lines of failed build steps.
ERROR: Analysis of target '//sw/device/tests/sim_dv:otp_ctrl_lc_signals_test_sim_dv' failed; build aborted: Target //sw/device/tests/sim_dv:otp_ctrl_lc_signals_test_sim_dv is incompatible and cannot be built, but was explicitly requested.
Dependency chain:
//sw/device/tests/sim_dv:otp_ctrl_lc_signals_test_sim_dv (f2055d) <-- target platform (//toolchain:opentitan_platform) didn't satisfy constraint @@platforms//:incompatible
INFO: Elapsed time: 0.581s, Critical Path: 0.03s
INFO: 1 process: 1 internal.
ERROR: Build did NOT complete successfully
_run_cmd -> had a non-zero return code of 1.
make: *** [/nightly/current_run/opentitan/hw/dv/tools/dvsim/sim.mk:58: sw_build] Error 1
chip_sw_otp_ctrl_vendor_test_csr_access 108799468527880830225985190565963646320369058152037512980263121860880602196422 None
Use --verbose_failures to see the command lines of failed build steps.
ERROR: Analysis of target '//sw/device/tests/sim_dv:otp_ctrl_vendor_test_csr_access_test_sim_dv' failed; build aborted: Target //sw/device/tests/sim_dv:otp_ctrl_vendor_test_csr_access_test_sim_dv is incompatible and cannot be built, but was explicitly requested.
Dependency chain:
//sw/device/tests/sim_dv:otp_ctrl_vendor_test_csr_access_test_sim_dv (f2055d) <-- target platform (//toolchain:opentitan_platform) didn't satisfy constraint @@platforms//:incompatible
INFO: Elapsed time: 0.422s, Critical Path: 0.04s
INFO: 1 process: 1 internal.
ERROR: Build did NOT complete successfully
_run_cmd -> had a non-zero return code of 1.
make: *** [/nightly/current_run/opentitan/hw/dv/tools/dvsim/sim.mk:58: sw_build] Error 1
chip_sw_otp_ctrl_nvm_cnt 62611092242663080677785449267668038708700775058526501797160463272656258477685 None
Another command (pid=519907) is running. Waiting for it to complete on the server (server_pid=209140)...
Another command (pid=522716) is running. Waiting for it to complete on the server (server_pid=209140)...
Another command (pid=504020) is running. Waiting for it to complete on the server (server_pid=209140)...
WARNING: Target pattern parsing failed.
ERROR: Skipping '//sw/device/tests:otp_ctrl_nvm_cnt_test_sim_dv': no such target '//sw/device/tests:otp_ctrl_nvm_cnt_test_sim_dv': target 'otp_ctrl_nvm_cnt_test_sim_dv' not declared in package 'sw/device/tests' defined by /nightly/current_run/opentitan/sw/device/tests/BUILD
ERROR: no such target '//sw/device/tests:otp_ctrl_nvm_cnt_test_sim_dv': target 'otp_ctrl_nvm_cnt_test_sim_dv' not declared in package 'sw/device/tests' defined by /nightly/current_run/opentitan/sw/device/tests/BUILD
ERROR: Build did NOT complete successfully
_run_cmd -> had a non-zero return code of 1.
make: *** [/nightly/current_run/opentitan/hw/dv/tools/dvsim/sim.mk:58: sw_build] Error 1
chip_sw_otp_ctrl_sw_parts 75848317584888873386088213461966614360610778183914128278180746431632568105627 None
Another command (pid=482262) is running. Waiting for it to complete on the server (server_pid=209140)...
Another command (pid=505841) is running. Waiting for it to complete on the server (server_pid=209140)...
Another command (pid=525361) is running. Waiting for it to complete on the server (server_pid=209140)...
WARNING: Target pattern parsing failed.
ERROR: Skipping '//sw/device/tests:otp_ctrl_sw_parts_test_sim_dv': no such target '//sw/device/tests:otp_ctrl_sw_parts_test_sim_dv': target 'otp_ctrl_sw_parts_test_sim_dv' not declared in package 'sw/device/tests' defined by /nightly/current_run/opentitan/sw/device/tests/BUILD
ERROR: no such target '//sw/device/tests:otp_ctrl_sw_parts_test_sim_dv': target 'otp_ctrl_sw_parts_test_sim_dv' not declared in package 'sw/device/tests' defined by /nightly/current_run/opentitan/sw/device/tests/BUILD
ERROR: Build did NOT complete successfully
_run_cmd -> had a non-zero return code of 1.
make: *** [/nightly/current_run/opentitan/hw/dv/tools/dvsim/sim.mk:58: sw_build] Error 1
chip_sw_lc_ctrl_transition 67661646535431090728808159767432142968921420378045747234643834976030477502175 None
Use --verbose_failures to see the command lines of failed build steps.
ERROR: Analysis of target '//sw/device/tests/sim_dv:lc_ctrl_transition_test_sim_dv' failed; build aborted: Target //sw/device/tests/sim_dv:lc_ctrl_transition_test_sim_dv is incompatible and cannot be built, but was explicitly requested.
Dependency chain:
//sw/device/tests/sim_dv:lc_ctrl_transition_test_sim_dv (f2055d) <-- target platform (//toolchain:opentitan_platform) didn't satisfy constraint @@platforms//:incompatible
INFO: Elapsed time: 0.407s, Critical Path: 0.04s
INFO: 1 process: 1 internal.
ERROR: Build did NOT complete successfully
_run_cmd -> had a non-zero return code of 1.
make: *** [/nightly/current_run/opentitan/hw/dv/tools/dvsim/sim.mk:58: sw_build] Error 1
chip_sw_lc_walkthrough_dev 104696366274041819932740065338503769607062495120728197863658210102512781844979 None
Use --verbose_failures to see the command lines of failed build steps.
ERROR: Analysis of target '//sw/device/tests/sim_dv:lc_walkthrough_test_sim_dv' failed; build aborted: Target //sw/device/tests/sim_dv:lc_walkthrough_test_sim_dv is incompatible and cannot be built, but was explicitly requested.
Dependency chain:
//sw/device/tests/sim_dv:lc_walkthrough_test_sim_dv (f2055d) <-- target platform (//toolchain:opentitan_platform) didn't satisfy constraint @@platforms//:incompatible
INFO: Elapsed time: 21.952s, Critical Path: 0.03s
INFO: 1 process: 1 internal.
ERROR: Build did NOT complete successfully
_run_cmd -> had a non-zero return code of 1.
make: *** [/nightly/current_run/opentitan/hw/dv/tools/dvsim/sim.mk:58: sw_build] Error 1
chip_sw_lc_walkthrough_prod 32459213512752868347960168057806978543999761062845468224252228127833018478337 None
Use --verbose_failures to see the command lines of failed build steps.
ERROR: Analysis of target '//sw/device/tests/sim_dv:lc_walkthrough_test_sim_dv' failed; build aborted: Target //sw/device/tests/sim_dv:lc_walkthrough_test_sim_dv is incompatible and cannot be built, but was explicitly requested.
Dependency chain:
//sw/device/tests/sim_dv:lc_walkthrough_test_sim_dv (f2055d) <-- target platform (//toolchain:opentitan_platform) didn't satisfy constraint @@platforms//:incompatible
INFO: Elapsed time: 6.200s, Critical Path: 0.01s
INFO: 1 process: 1 internal.
ERROR: Build did NOT complete successfully
_run_cmd -> had a non-zero return code of 1.
make: *** [/nightly/current_run/opentitan/hw/dv/tools/dvsim/sim.mk:58: sw_build] Error 1
chip_sw_lc_walkthrough_prodend 71835533815242329363930255799083254910680971937044861148360072362010215828370 None
Use --verbose_failures to see the command lines of failed build steps.
ERROR: Analysis of target '//sw/device/tests/sim_dv:lc_walkthrough_test_sim_dv' failed; build aborted: Target //sw/device/tests/sim_dv:lc_walkthrough_test_sim_dv is incompatible and cannot be built, but was explicitly requested.
Dependency chain:
//sw/device/tests/sim_dv:lc_walkthrough_test_sim_dv (f2055d) <-- target platform (//toolchain:opentitan_platform) didn't satisfy constraint @@platforms//:incompatible
INFO: Elapsed time: 0.373s, Critical Path: 0.04s
INFO: 1 process: 1 internal.
ERROR: Build did NOT complete successfully
_run_cmd -> had a non-zero return code of 1.
make: *** [/nightly/current_run/opentitan/hw/dv/tools/dvsim/sim.mk:58: sw_build] Error 1
chip_sw_lc_walkthrough_rma 40216860761661390712169645196052897941899667785667641858711375682793057781881 None
Use --verbose_failures to see the command lines of failed build steps.
ERROR: Analysis of target '//sw/device/tests/sim_dv:lc_walkthrough_test_sim_dv' failed; build aborted: Target //sw/device/tests/sim_dv:lc_walkthrough_test_sim_dv is incompatible and cannot be built, but was explicitly requested.
Dependency chain:
//sw/device/tests/sim_dv:lc_walkthrough_test_sim_dv (f2055d) <-- target platform (//toolchain:opentitan_platform) didn't satisfy constraint @@platforms//:incompatible
INFO: Elapsed time: 2.798s, Critical Path: 0.04s
INFO: 1 process: 1 internal.
ERROR: Build did NOT complete successfully
_run_cmd -> had a non-zero return code of 1.
make: *** [/nightly/current_run/opentitan/hw/dv/tools/dvsim/sim.mk:58: sw_build] Error 1
chip_sw_lc_walkthrough_testunlocks 79509107656340345419945508586931310346271042925395615572761713441947019306105 None
Use --verbose_failures to see the command lines of failed build steps.
ERROR: Analysis of target '//sw/device/tests/sim_dv:lc_walkthrough_testunlocks_test_sim_dv' failed; build aborted: Target //sw/device/tests/sim_dv:lc_walkthrough_testunlocks_test_sim_dv is incompatible and cannot be built, but was explicitly requested.
Dependency chain:
//sw/device/tests/sim_dv:lc_walkthrough_testunlocks_test_sim_dv (f2055d) <-- target platform (//toolchain:opentitan_platform) didn't satisfy constraint @@platforms//:incompatible
INFO: Elapsed time: 0.339s, Critical Path: 0.03s
INFO: 1 process: 1 internal.
ERROR: Build did NOT complete successfully
_run_cmd -> had a non-zero return code of 1.
make: *** [/nightly/current_run/opentitan/hw/dv/tools/dvsim/sim.mk:58: sw_build] Error 1
chip_sw_pwrmgr_main_power_glitch_reset 36177127858637289207689126787989388667198937220004261957132181906639765616262 None
Use --verbose_failures to see the command lines of failed build steps.
ERROR: Analysis of target '//sw/device/tests/sim_dv:pwrmgr_main_power_glitch_test_sim_dv' failed; build aborted: Target //sw/device/tests/sim_dv:pwrmgr_main_power_glitch_test_sim_dv is incompatible and cannot be built, but was explicitly requested.
Dependency chain:
//sw/device/tests/sim_dv:pwrmgr_main_power_glitch_test_sim_dv (f2055d) <-- target platform (//toolchain:opentitan_platform) didn't satisfy constraint @@platforms//:incompatible
INFO: Elapsed time: 2.616s, Critical Path: 0.03s
INFO: 1 process: 1 internal.
ERROR: Build did NOT complete successfully
_run_cmd -> had a non-zero return code of 1.
make: *** [/nightly/current_run/opentitan/hw/dv/tools/dvsim/sim.mk:58: sw_build] Error 1
chip_sw_pwrmgr_sleep_power_glitch_reset 15270062222631515275193459805351987868963934833439398334324316251408044959650 None
ERROR: Analysis of target '//sw/device/tests/sim_dv:pwrmgr_sleep_power_glitch_test_sim_dv' failed; build aborted: Target //sw/device/tests/sim_dv:pwrmgr_sleep_power_glitch_test_sim_dv is incompatible and cannot be built, but was explicitly requested.
Dependency chain:
//sw/device/tests/sim_dv:pwrmgr_sleep_power_glitch_test_sim_dv (f2055d) <-- target platform (//toolchain:opentitan_platform) didn't satisfy constraint @@platforms//:incompatible
INFO: Elapsed time: 1.142s, Critical Path: 0.03s
INFO: 1 process: 1 internal.
ERROR: Build did NOT complete successfully
FAILED:
_run_cmd -> had a non-zero return code of 1.
make: *** [/nightly/current_run/opentitan/hw/dv/tools/dvsim/sim.mk:58: sw_build] Error 1
chip_sw_pwrmgr_deep_sleep_power_glitch_reset 76161555847667565287631734175710277141265374260599168768320957479524757363843 None
Use --verbose_failures to see the command lines of failed build steps.
ERROR: Analysis of target '//sw/device/tests/sim_dv:pwrmgr_deep_sleep_power_glitch_test_sim_dv' failed; build aborted: Target //sw/device/tests/sim_dv:pwrmgr_deep_sleep_power_glitch_test_sim_dv is incompatible and cannot be built, but was explicitly requested.
Dependency chain:
//sw/device/tests/sim_dv:pwrmgr_deep_sleep_power_glitch_test_sim_dv (f2055d) <-- target platform (//toolchain:opentitan_platform) didn't satisfy constraint @@platforms//:incompatible
INFO: Elapsed time: 0.573s, Critical Path: 0.04s
INFO: 1 process: 1 internal.
ERROR: Build did NOT complete successfully
_run_cmd -> had a non-zero return code of 1.
make: *** [/nightly/current_run/opentitan/hw/dv/tools/dvsim/sim.mk:58: sw_build] Error 1
chip_sw_pwrmgr_random_sleep_power_glitch_reset 45167196068629836874778579431913020742336302094172235698229655307923781452458 None
Use --verbose_failures to see the command lines of failed build steps.
ERROR: Analysis of target '//sw/device/tests/sim_dv:pwrmgr_random_sleep_power_glitch_reset_test_sim_dv' failed; build aborted: Target //sw/device/tests/sim_dv:pwrmgr_random_sleep_power_glitch_reset_test_sim_dv is incompatible and cannot be built, but was explicitly requested.
Dependency chain:
//sw/device/tests/sim_dv:pwrmgr_random_sleep_power_glitch_reset_test_sim_dv (f2055d) <-- target platform (//toolchain:opentitan_platform) didn't satisfy constraint @@platforms//:incompatible
INFO: Elapsed time: 6.372s, Critical Path: 0.03s
INFO: 1 process: 1 internal.
ERROR: Build did NOT complete successfully
_run_cmd -> had a non-zero return code of 1.
make: *** [/nightly/current_run/opentitan/hw/dv/tools/dvsim/sim.mk:58: sw_build] Error 1
chip_sw_pwrmgr_sleep_disabled 75997026499098458491219154933649359189426011417127143721803515885861028148010 None
Use --verbose_failures to see the command lines of failed build steps.
ERROR: Analysis of target '//sw/device/tests:pwrmgr_sleep_disabled_test_sim_dv' failed; build aborted: Target //sw/device/tests:pwrmgr_sleep_disabled_test_sim_dv is incompatible and cannot be built, but was explicitly requested.
Dependency chain:
//sw/device/tests:pwrmgr_sleep_disabled_test_sim_dv (f2055d) <-- target platform (//toolchain:opentitan_platform) didn't satisfy constraint @@platforms//:incompatible
INFO: Elapsed time: 0.969s, Critical Path: 0.01s
INFO: 1 process: 1 internal.
ERROR: Build did NOT complete successfully
_run_cmd -> had a non-zero return code of 1.
make: *** [/nightly/current_run/opentitan/hw/dv/tools/dvsim/sim.mk:58: sw_build] Error 1
chip_sw_pwrmgr_wdog_reset 114747310807199607798501460216387803717407361932605618050903529734318198723680 None
Use --verbose_failures to see the command lines of failed build steps.
ERROR: Analysis of target '//sw/device/tests:pwrmgr_wdog_reset_reqs_test_sim_dv' failed; build aborted: Target //sw/device/tests:pwrmgr_wdog_reset_reqs_test_sim_dv is incompatible and cannot be built, but was explicitly requested.
Dependency chain:
//sw/device/tests:pwrmgr_wdog_reset_reqs_test_sim_dv (f2055d) <-- target platform (//toolchain:opentitan_platform) didn't satisfy constraint @@platforms//:incompatible
INFO: Elapsed time: 0.388s, Critical Path: 0.01s
INFO: 1 process: 1 internal.
ERROR: Build did NOT complete successfully
_run_cmd -> had a non-zero return code of 1.
make: *** [/nightly/current_run/opentitan/hw/dv/tools/dvsim/sim.mk:58: sw_build] Error 1
chip_sw_alert_test 63511020767582327355732671354758539679871229585313999364315460021310340228850 None
Another command (pid=686462) is running. Waiting for it to complete on the server (server_pid=209140)...
WARNING: Target pattern parsing failed.
ERROR: Skipping '//sw/device/tests/autogen/top_darjeeling:alert_test_sim_dv': no such package 'sw/device/tests/autogen/top_darjeeling': BUILD file not found in any of the following directories. Add a BUILD file to a directory to mark it as a package.
- sw/device/tests/autogen/top_darjeeling
ERROR: no such package 'sw/device/tests/autogen/top_darjeeling': BUILD file not found in any of the following directories. Add a BUILD file to a directory to mark it as a package.
- sw/device/tests/autogen/top_darjeeling
ERROR: Build did NOT complete successfully
_run_cmd -> had a non-zero return code of 1.
make: *** [/nightly/current_run/opentitan/hw/dv/tools/dvsim/sim.mk:58: sw_build] Error 1
chip_sw_alert_handler_escalation 103959805659703525348544792876529171578985252247652275435861577939244134434377 None
Use --verbose_failures to see the command lines of failed build steps.
ERROR: Analysis of target '//sw/device/tests:alert_handler_escalation_test_sim_dv' failed; build aborted: Target //sw/device/tests:alert_handler_escalation_test_sim_dv is incompatible and cannot be built, but was explicitly requested.
Dependency chain:
//sw/device/tests:alert_handler_escalation_test_sim_dv (f2055d) <-- target platform (//toolchain:opentitan_platform) didn't satisfy constraint @@platforms//:incompatible
INFO: Elapsed time: 6.868s, Critical Path: 0.03s
INFO: 1 process: 1 internal.
ERROR: Build did NOT complete successfully
_run_cmd -> had a non-zero return code of 1.
make: *** [/nightly/current_run/opentitan/hw/dv/tools/dvsim/sim.mk:58: sw_build] Error 1
chip_sw_alert_handler_reverse_ping_in_deep_sleep 29183290199804744719233532718688264958184462944895912395008386755836873988720 None
Use --verbose_failures to see the command lines of failed build steps.
ERROR: Analysis of target '//sw/device/tests:alert_handler_reverse_ping_in_deep_sleep_test_sim_dv' failed; build aborted: Target //sw/device/tests:alert_handler_reverse_ping_in_deep_sleep_test_sim_dv is incompatible and cannot be built, but was explicitly requested.
Dependency chain:
//sw/device/tests:alert_handler_reverse_ping_in_deep_sleep_test_sim_dv (f2055d) <-- target platform (//toolchain:opentitan_platform) didn't satisfy constraint @@platforms//:incompatible
INFO: Elapsed time: 1.203s, Critical Path: 0.05s
INFO: 1 process: 1 internal.
ERROR: Build did NOT complete successfully
_run_cmd -> had a non-zero return code of 1.
make: *** [/nightly/current_run/opentitan/hw/dv/tools/dvsim/sim.mk:58: sw_build] Error 1
chip_sw_alert_handler_lpg_sleep_mode_alerts 11090217496522238901357228503244673158428704748760223667291729590848618246938 None
Another command (pid=425144) is running. Waiting for it to complete on the server (server_pid=209140)...
Another command (pid=354246) is running. Waiting for it to complete on the server (server_pid=209140)...
Another command (pid=398460) is running. Waiting for it to complete on the server (server_pid=209140)...
WARNING: Target pattern parsing failed.
ERROR: Skipping '//sw/device/tests:alert_handler_lpg_sleep_mode_alerts_test_sim_dv': no such target '//sw/device/tests:alert_handler_lpg_sleep_mode_alerts_test_sim_dv': target 'alert_handler_lpg_sleep_mode_alerts_test_sim_dv' not declared in package 'sw/device/tests' defined by /nightly/current_run/opentitan/sw/device/tests/BUILD
ERROR: no such target '//sw/device/tests:alert_handler_lpg_sleep_mode_alerts_test_sim_dv': target 'alert_handler_lpg_sleep_mode_alerts_test_sim_dv' not declared in package 'sw/device/tests' defined by /nightly/current_run/opentitan/sw/device/tests/BUILD
ERROR: Build did NOT complete successfully
_run_cmd -> had a non-zero return code of 1.
make: *** [/nightly/current_run/opentitan/hw/dv/tools/dvsim/sim.mk:58: sw_build] Error 1
chip_sw_alert_handler_lpg_sleep_mode_pings 52501926157053518929106656554794882685744552606839394394061187178345921329370 None
Use --verbose_failures to see the command lines of failed build steps.
ERROR: Analysis of target '//sw/device/tests:alert_handler_lpg_sleep_mode_pings_test_sim_dv' failed; build aborted: Target //sw/device/tests:alert_handler_lpg_sleep_mode_pings_test_sim_dv is incompatible and cannot be built, but was explicitly requested.
Dependency chain:
//sw/device/tests:alert_handler_lpg_sleep_mode_pings_test_sim_dv (f2055d) <-- target platform (//toolchain:opentitan_platform) didn't satisfy constraint @@platforms//:incompatible
INFO: Elapsed time: 16.913s, Critical Path: 0.03s
INFO: 1 process: 1 internal.
ERROR: Build did NOT complete successfully
_run_cmd -> had a non-zero return code of 1.
make: *** [/nightly/current_run/opentitan/hw/dv/tools/dvsim/sim.mk:58: sw_build] Error 1
chip_sw_alert_handler_lpg_clkoff 10146026289146174437701453844321695713288935703072742839669160409672674609635 None
Use --verbose_failures to see the command lines of failed build steps.
ERROR: Analysis of target '//sw/device/tests:alert_handler_lpg_clkoff_test_sim_dv' failed; build aborted: Target //sw/device/tests:alert_handler_lpg_clkoff_test_sim_dv is incompatible and cannot be built, but was explicitly requested.
Dependency chain:
//sw/device/tests:alert_handler_lpg_clkoff_test_sim_dv (f2055d) <-- target platform (//toolchain:opentitan_platform) didn't satisfy constraint @@platforms//:incompatible
INFO: Elapsed time: 0.948s, Critical Path: 0.03s
INFO: 1 process: 1 internal.
ERROR: Build did NOT complete successfully
_run_cmd -> had a non-zero return code of 1.
make: *** [/nightly/current_run/opentitan/hw/dv/tools/dvsim/sim.mk:58: sw_build] Error 1
chip_sw_alert_handler_lpg_reset_toggle 33564668417795601261307687740655267649219659747788330934768428910259165141792 None
Use --verbose_failures to see the command lines of failed build steps.
ERROR: Analysis of target '//sw/device/tests:alert_handler_lpg_reset_toggle_test_sim_dv' failed; build aborted: Target //sw/device/tests:alert_handler_lpg_reset_toggle_test_sim_dv is incompatible and cannot be built, but was explicitly requested.
Dependency chain:
//sw/device/tests:alert_handler_lpg_reset_toggle_test_sim_dv (f2055d) <-- target platform (//toolchain:opentitan_platform) didn't satisfy constraint @@platforms//:incompatible
INFO: Elapsed time: 2.440s, Critical Path: 0.03s
INFO: 1 process: 1 internal.
ERROR: Build did NOT complete successfully
_run_cmd -> had a non-zero return code of 1.
make: *** [/nightly/current_run/opentitan/hw/dv/tools/dvsim/sim.mk:58: sw_build] Error 1
chip_sw_alert_handler_entropy 14052942069295766066607016342828604401291294213470093245502272725527706509871 None
Use --verbose_failures to see the command lines of failed build steps.
ERROR: Analysis of target '//sw/device/tests/sim_dv:alert_handler_entropy_test_sim_dv' failed; build aborted: Target //sw/device/tests/sim_dv:alert_handler_entropy_test_sim_dv is incompatible and cannot be built, but was explicitly requested.
Dependency chain:
//sw/device/tests/sim_dv:alert_handler_entropy_test_sim_dv (f2055d) <-- target platform (//toolchain:opentitan_platform) didn't satisfy constraint @@platforms//:incompatible
INFO: Elapsed time: 40.864s, Critical Path: 0.03s
INFO: 1 process: 1 internal.
ERROR: Build did NOT complete successfully
_run_cmd -> had a non-zero return code of 1.
make: *** [/nightly/current_run/opentitan/hw/dv/tools/dvsim/sim.mk:58: sw_build] Error 1
chip_sw_csrng_fuse_en_sw_app_read_test 8211197221318110988860803551939081699274775529526163439606779061944075572305 None
Use --verbose_failures to see the command lines of failed build steps.
ERROR: Analysis of target '//sw/device/tests/sim_dv:csrng_fuse_en_sw_app_read_sim_dv' failed; build aborted: Target //sw/device/tests/sim_dv:csrng_fuse_en_sw_app_read_sim_dv is incompatible and cannot be built, but was explicitly requested.
Dependency chain:
//sw/device/tests/sim_dv:csrng_fuse_en_sw_app_read_sim_dv (f2055d) <-- target platform (//toolchain:opentitan_platform) didn't satisfy constraint @@platforms//:incompatible
INFO: Elapsed time: 0.756s, Critical Path: 0.04s
INFO: 1 process: 1 internal.
ERROR: Build did NOT complete successfully
_run_cmd -> had a non-zero return code of 1.
make: *** [/nightly/current_run/opentitan/hw/dv/tools/dvsim/sim.mk:58: sw_build] Error 1
chip_sw_kmac_app_rom 111197072358868691592637946917575177779705735847170337536302415195692885910698 None
INFO: [build_sw_collateral_for_sim.py:207] cquery_cmd = ./bazelisk.sh cquery labels(data, //sw/device/tests:kmac_app_rom_test_sim_dv) union labels(srcs, //sw/device/tests:kmac_app_rom_test_sim_dv) --ui_event_filters=-info --noshow_progress --//hw/top=darjeeling --//hw/top=darjeeling --output=starlark
---- STDOUT ----
---- STDERR ----
Another command (pid=1161088) is running. Waiting for it to complete on the server (server_pid=209140)...
ERROR: Error doing post analysis query: Evaluation of subquery "labels('data', //sw/device/tests:kmac_app_rom_test_sim_dv)" failed (did you want to use --keep_going?): in 'data' of rule //sw/device/tests:kmac_app_rom_test_sim_dv: configured target of type test_suite does not have attribute 'data'
ERROR: Build did NOT complete successfully
_run_cmd -> had a non-zero return code of 1.
make: *** [/nightly/current_run/opentitan/hw/dv/tools/dvsim/sim.mk:58: sw_build] Error 1
chip_sw_sram_ctrl_scrambled_access_jitter_en 89141676949178098276246744778069988881196238381131754648563730951758027693515 None
---- STDERR ----
Another command (pid=1377201) is running. Waiting for it to complete on the server (server_pid=209140)...
WARNING: Target pattern parsing failed.
ERROR: Skipping '//sw/device/tests/sim_dv:sram_ctrl_scrambled_access_test_sim_dv': no such target '//sw/device/tests/sim_dv:sram_ctrl_scrambled_access_test_sim_dv': target 'sram_ctrl_scrambled_access_test_sim_dv' not declared in package 'sw/device/tests/sim_dv' defined by /nightly/current_run/opentitan/sw/device/tests/sim_dv/BUILD
ERROR: no such target '//sw/device/tests/sim_dv:sram_ctrl_scrambled_access_test_sim_dv': target 'sram_ctrl_scrambled_access_test_sim_dv' not declared in package 'sw/device/tests/sim_dv' defined by /nightly/current_run/opentitan/sw/device/tests/sim_dv/BUILD
ERROR: Build did NOT complete successfully
_run_cmd -> had a non-zero return code of 1.
make: *** [/nightly/current_run/opentitan/hw/dv/tools/dvsim/sim.mk:58: sw_build] Error 1
chip_sw_sram_ctrl_execution_main 94607662369582789953912486833510986156249082657011974774976566988968310601707 None
Use --verbose_failures to see the command lines of failed build steps.
ERROR: Analysis of target '//sw/device/tests/sim_dv:sram_ctrl_execution_main_test_sim_dv' failed; build aborted: Target //sw/device/tests/sim_dv:sram_ctrl_execution_main_test_sim_dv is incompatible and cannot be built, but was explicitly requested.
Dependency chain:
//sw/device/tests/sim_dv:sram_ctrl_execution_main_test_sim_dv (f2055d) <-- target platform (//toolchain:opentitan_platform) didn't satisfy constraint @@platforms//:incompatible
INFO: Elapsed time: 0.377s, Critical Path: 0.03s
INFO: 1 process: 1 internal.
ERROR: Build did NOT complete successfully
_run_cmd -> had a non-zero return code of 1.
make: *** [/nightly/current_run/opentitan/hw/dv/tools/dvsim/sim.mk:58: sw_build] Error 1
chip_sw_coremark 106306389986118151140907219636913093605516996700591811094877714001580221266439 None
Another command (pid=500205) is running. Waiting for it to complete on the server (server_pid=209140)...
WARNING: Target pattern parsing failed.
ERROR: Skipping '//third_party/coremark/top_darjeeling:coremark_test_sim_dv': no such package 'third_party/coremark/top_darjeeling': BUILD file not found in any of the following directories. Add a BUILD file to a directory to mark it as a package.
- third_party/coremark/top_darjeeling
ERROR: no such package 'third_party/coremark/top_darjeeling': BUILD file not found in any of the following directories. Add a BUILD file to a directory to mark it as a package.
- third_party/coremark/top_darjeeling
ERROR: Build did NOT complete successfully
_run_cmd -> had a non-zero return code of 1.
make: *** [/nightly/current_run/opentitan/hw/dv/tools/dvsim/sim.mk:58: sw_build] Error 1
chip_sw_clkmgr_reset_frequency 62480237727390369529183276539374800317236195455303962356834061683056148556087 None
Use --verbose_failures to see the command lines of failed build steps.
ERROR: Analysis of target '//sw/device/tests:clkmgr_reset_frequency_test_sim_dv' failed; build aborted: Target //sw/device/tests:clkmgr_reset_frequency_test_sim_dv is incompatible and cannot be built, but was explicitly requested.
Dependency chain:
//sw/device/tests:clkmgr_reset_frequency_test_sim_dv (f2055d) <-- target platform (//toolchain:opentitan_platform) didn't satisfy constraint @@platforms//:incompatible
INFO: Elapsed time: 0.420s, Critical Path: 0.04s
INFO: 1 process: 1 internal.
ERROR: Build did NOT complete successfully
_run_cmd -> had a non-zero return code of 1.
make: *** [/nightly/current_run/opentitan/hw/dv/tools/dvsim/sim.mk:58: sw_build] Error 1
chip_sw_clkmgr_sleep_frequency 1977883072217835777035310910617996386843015911474365916882856756096719796160 None
Use --verbose_failures to see the command lines of failed build steps.
ERROR: Analysis of target '//sw/device/tests:clkmgr_sleep_frequency_test_sim_dv' failed; build aborted: Target //sw/device/tests:clkmgr_sleep_frequency_test_sim_dv is incompatible and cannot be built, but was explicitly requested.
Dependency chain:
//sw/device/tests:clkmgr_sleep_frequency_test_sim_dv (f2055d) <-- target platform (//toolchain:opentitan_platform) didn't satisfy constraint @@platforms//:incompatible
INFO: Elapsed time: 0.424s, Critical Path: 0.06s
INFO: 1 process: 1 internal.
ERROR: Build did NOT complete successfully
_run_cmd -> had a non-zero return code of 1.
make: *** [/nightly/current_run/opentitan/hw/dv/tools/dvsim/sim.mk:58: sw_build] Error 1
chip_sw_ast_clk_outputs 39166479700191117590190235063508197589385549107478979696772906280688080334248 None
Use --verbose_failures to see the command lines of failed build steps.
ERROR: Analysis of target '//sw/device/tests:ast_clk_outs_test_sim_dv' failed; build aborted: Target //sw/device/tests:ast_clk_outs_test_sim_dv is incompatible and cannot be built, but was explicitly requested.
Dependency chain:
//sw/device/tests:ast_clk_outs_test_sim_dv (f2055d) <-- target platform (//toolchain:opentitan_platform) didn't satisfy constraint @@platforms//:incompatible
INFO: Elapsed time: 28.852s, Critical Path: 0.03s
INFO: 1 process: 1 internal.
ERROR: Build did NOT complete successfully
_run_cmd -> had a non-zero return code of 1.
make: *** [/nightly/current_run/opentitan/hw/dv/tools/dvsim/sim.mk:58: sw_build] Error 1
chip_sw_lc_ctrl_program_error 50807350727778003868675907378866164443401162520103083422480486610142372229003 None
Use --verbose_failures to see the command lines of failed build steps.
ERROR: Analysis of target '//sw/device/tests/sim_dv:lc_ctrl_program_error_sim_dv' failed; build aborted: Target //sw/device/tests/sim_dv:lc_ctrl_program_error_sim_dv is incompatible and cannot be built, but was explicitly requested.
Dependency chain:
//sw/device/tests/sim_dv:lc_ctrl_program_error_sim_dv (f2055d) <-- target platform (//toolchain:opentitan_platform) didn't satisfy constraint @@platforms//:incompatible
INFO: Elapsed time: 0.403s, Critical Path: 0.04s
INFO: 1 process: 1 internal.
ERROR: Build did NOT complete successfully
_run_cmd -> had a non-zero return code of 1.
make: *** [/nightly/current_run/opentitan/hw/dv/tools/dvsim/sim.mk:58: sw_build] Error 1
chip_sw_rv_dm_ndm_reset_req_when_cpu_halted 12106246175407497536620754268894593723651626757233762216233351387940283020511 None
---- STDERR ----
Another command (pid=1324614) is running. Waiting for it to complete on the server (server_pid=209140)...
WARNING: Target pattern parsing failed.
ERROR: Skipping '//sw/device/tests:rv_dm_ndm_reset_req_when_cpu_halted_sim_dv': no such target '//sw/device/tests:rv_dm_ndm_reset_req_when_cpu_halted_sim_dv': target 'rv_dm_ndm_reset_req_when_cpu_halted_sim_dv' not declared in package 'sw/device/tests' defined by /nightly/current_run/opentitan/sw/device/tests/BUILD (did you mean rv_dm_ndm_reset_req_when_cpu_halted_dev_sim_dv, or rv_dm_ndm_reset_req_when_cpu_halted_rma_sim_dv?)
ERROR: no such target '//sw/device/tests:rv_dm_ndm_reset_req_when_cpu_halted_sim_dv': target 'rv_dm_ndm_reset_req_when_cpu_halted_sim_dv' not declared in package 'sw/device/tests' defined by /nightly/current_run/opentitan/sw/device/tests/BUILD (did you mean rv_dm_ndm_reset_req_when_cpu_halted_dev_sim_dv, or rv_dm_ndm_reset_req_when_cpu_halted_rma_sim_dv?)
ERROR: Build did NOT complete successfully
_run_cmd -> had a non-zero return code of 1.
make: *** [/nightly/current_run/opentitan/hw/dv/tools/dvsim/sim.mk:58: sw_build] Error 1
chip_sw_rv_dm_access_after_wakeup 50899390915373955694375843367771911686980855755547447072292973587067471727220 None
Another command (pid=1320851) is running. Waiting for it to complete on the server (server_pid=209140)...
Another command (pid=1318697) is running. Waiting for it to complete on the server (server_pid=209140)...
Another command (pid=1321971) is running. Waiting for it to complete on the server (server_pid=209140)...
WARNING: Target pattern parsing failed.
ERROR: Skipping '//sw/device/tests:rv_dm_access_after_wakeup_sim_dv': no such target '//sw/device/tests:rv_dm_access_after_wakeup_sim_dv': target 'rv_dm_access_after_wakeup_sim_dv' not declared in package 'sw/device/tests' defined by /nightly/current_run/opentitan/sw/device/tests/BUILD (did you mean rv_dm_access_after_wakeup_dev_sim_dv, or rv_dm_access_after_wakeup_rma_sim_dv?)
ERROR: no such target '//sw/device/tests:rv_dm_access_after_wakeup_sim_dv': target 'rv_dm_access_after_wakeup_sim_dv' not declared in package 'sw/device/tests' defined by /nightly/current_run/opentitan/sw/device/tests/BUILD (did you mean rv_dm_access_after_wakeup_dev_sim_dv, or rv_dm_access_after_wakeup_rma_sim_dv?)
ERROR: Build did NOT complete successfully
_run_cmd -> had a non-zero return code of 1.
make: *** [/nightly/current_run/opentitan/hw/dv/tools/dvsim/sim.mk:58: sw_build] Error 1
chip_sw_rv_dm_access_after_escalation_reset 48909013096017831601250079865648470135612436805115945323114132349223774795711 None
Use --verbose_failures to see the command lines of failed build steps.
ERROR: Analysis of target '//sw/device/tests:alert_handler_escalation_test_sim_dv' failed; build aborted: Target //sw/device/tests:alert_handler_escalation_test_sim_dv is incompatible and cannot be built, but was explicitly requested.
Dependency chain:
//sw/device/tests:alert_handler_escalation_test_sim_dv (f2055d) <-- target platform (//toolchain:opentitan_platform) didn't satisfy constraint @@platforms//:incompatible
INFO: Elapsed time: 1.248s, Critical Path: 0.04s
INFO: 1 process: 1 internal.
ERROR: Build did NOT complete successfully
_run_cmd -> had a non-zero return code of 1.
make: *** [/nightly/current_run/opentitan/hw/dv/tools/dvsim/sim.mk:58: sw_build] Error 1
chip_sw_power_virus 48327414274067483348863623767495280527528586757745196262010574655688271496774 None
Use --verbose_failures to see the command lines of failed build steps.
ERROR: Analysis of target '//sw/device/tests:power_virus_systemtest_sim_dv' failed; build aborted: Target //sw/device/tests:power_virus_systemtest_sim_dv is incompatible and cannot be built, but was explicitly requested.
Dependency chain:
//sw/device/tests:power_virus_systemtest_sim_dv (f2055d) <-- target platform (//toolchain:opentitan_platform) didn't satisfy constraint @@platforms//:incompatible
INFO: Elapsed time: 2.598s, Critical Path: 0.01s
INFO: 1 process: 1 internal.
ERROR: Build did NOT complete successfully
_run_cmd -> had a non-zero return code of 1.
make: *** [/nightly/current_run/opentitan/hw/dv/tools/dvsim/sim.mk:58: sw_build] Error 1
base_rom_e2e_smoke 36463423072508401896212815541483889750705332068438528930545609409631126924841 None
_deploy_software_collateral(args)
~~~~~~~~~~~~~~~~~~~~~~~~~~~^^^^^^
File "/nightly/current_run/opentitan/util/py/scripts/build_sw_collateral_for_sim.py", line 329, in _deploy_software_collateral
image_string = ImageString(image)
File "<string>", line 4, in __init__
File "/nightly/current_run/opentitan/util/py/scripts/build_sw_collateral_for_sim.py", line 261, in __post_init__
assert flag in KNOWN_FLAGS, f"Unknown flag '{flag}' used in sw_image '{self.raw}'"
^^^^^^^^^^^^^^^^^^^
AssertionError: Unknown flag 'test_in_second_rom' used in sw_image '//sw/device/silicon_creator/rom/e2e:base_rom_e2e_smoke:7:test_in_second_rom'
make: *** [/nightly/current_run/opentitan/hw/dv/tools/dvsim/sim.mk:58: sw_build] Error 1
rom_e2e_smoke 73195080134299639558021784155065637327702238143602956294634638880646197758280 None
---- STDERR ----
Another command (pid=1390166) is running. Waiting for it to complete on the server (server_pid=209140)...
Another command (pid=1390879) is running. Waiting for it to complete on the server (server_pid=209140)...
WARNING: Target pattern parsing failed.
ERROR: Skipping '//sw/device/silicon_creator/rom/e2e:empty_test_slot_a_sim_dv': no such target '//sw/device/silicon_creator/rom/e2e:empty_test_slot_a_sim_dv': target 'empty_test_slot_a_sim_dv' not declared in package 'sw/device/silicon_creator/rom/e2e' defined by /nightly/current_run/opentitan/sw/device/silicon_creator/rom/e2e/BUILD
ERROR: no such target '//sw/device/silicon_creator/rom/e2e:empty_test_slot_a_sim_dv': target 'empty_test_slot_a_sim_dv' not declared in package 'sw/device/silicon_creator/rom/e2e' defined by /nightly/current_run/opentitan/sw/device/silicon_creator/rom/e2e/BUILD
ERROR: Build did NOT complete successfully
_run_cmd -> had a non-zero return code of 1.
make: *** [/nightly/current_run/opentitan/hw/dv/tools/dvsim/sim.mk:58: sw_build] Error 1
rom_e2e_shutdown_exception_c 113399489398096314291794078703699663612627720113985382229940005314934422936483 None
Another command (pid=578325) is running. Waiting for it to complete on the server (server_pid=209140)...
Another command (pid=579685) is running. Waiting for it to complete on the server (server_pid=209140)...
Another command (pid=585219) is running. Waiting for it to complete on the server (server_pid=209140)...
WARNING: Target pattern parsing failed.
ERROR: Skipping '//sw/device/silicon_creator/rom:rom_with_fake_keys_sim_dv': no such target '//sw/device/silicon_creator/rom:rom_with_fake_keys_sim_dv': target 'rom_with_fake_keys_sim_dv' not declared in package 'sw/device/silicon_creator/rom' defined by /nightly/current_run/opentitan/sw/device/silicon_creator/rom/BUILD
ERROR: no such target '//sw/device/silicon_creator/rom:rom_with_fake_keys_sim_dv': target 'rom_with_fake_keys_sim_dv' not declared in package 'sw/device/silicon_creator/rom' defined by /nightly/current_run/opentitan/sw/device/silicon_creator/rom/BUILD
ERROR: Build did NOT complete successfully
_run_cmd -> had a non-zero return code of 1.
make: *** [/nightly/current_run/opentitan/hw/dv/tools/dvsim/sim.mk:58: sw_build] Error 1
rom_e2e_shutdown_output 18311825830027596921072900518486973995248301578515998727449283432922433874534 None
Another command (pid=580203) is running. Waiting for it to complete on the server (server_pid=209140)...
Another command (pid=585787) is running. Waiting for it to complete on the server (server_pid=209140)...
Another command (pid=597037) is running. Waiting for it to complete on the server (server_pid=209140)...
WARNING: Target pattern parsing failed.
ERROR: Skipping '//sw/device/silicon_creator/rom/e2e:empty_test_slot_a_sim_dv': no such target '//sw/device/silicon_creator/rom/e2e:empty_test_slot_a_sim_dv': target 'empty_test_slot_a_sim_dv' not declared in package 'sw/device/silicon_creator/rom/e2e' defined by /nightly/current_run/opentitan/sw/device/silicon_creator/rom/e2e/BUILD
ERROR: no such target '//sw/device/silicon_creator/rom/e2e:empty_test_slot_a_sim_dv': target 'empty_test_slot_a_sim_dv' not declared in package 'sw/device/silicon_creator/rom/e2e' defined by /nightly/current_run/opentitan/sw/device/silicon_creator/rom/e2e/BUILD
ERROR: Build did NOT complete successfully
_run_cmd -> had a non-zero return code of 1.
make: *** [/nightly/current_run/opentitan/hw/dv/tools/dvsim/sim.mk:58: sw_build] Error 1
rom_e2e_boot_policy_valid_a_good_b_good_test_unlocked0 63289788964115739198116527342144967650150153241073498358847890624133688054551 None
Another command (pid=319242) is running. Waiting for it to complete on the server (server_pid=209140)...
Another command (pid=356731) is running. Waiting for it to complete on the server (server_pid=209140)...
Another command (pid=327000) is running. Waiting for it to complete on the server (server_pid=209140)...
WARNING: Target pattern parsing failed.
ERROR: Skipping '//sw/device/silicon_creator/rom/e2e:empty_test_slot_a_sim_dv': no such target '//sw/device/silicon_creator/rom/e2e:empty_test_slot_a_sim_dv': target 'empty_test_slot_a_sim_dv' not declared in package 'sw/device/silicon_creator/rom/e2e' defined by /nightly/current_run/opentitan/sw/device/silicon_creator/rom/e2e/BUILD
ERROR: no such target '//sw/device/silicon_creator/rom/e2e:empty_test_slot_a_sim_dv': target 'empty_test_slot_a_sim_dv' not declared in package 'sw/device/silicon_creator/rom/e2e' defined by /nightly/current_run/opentitan/sw/device/silicon_creator/rom/e2e/BUILD
ERROR: Build did NOT complete successfully
_run_cmd -> had a non-zero return code of 1.
make: *** [/nightly/current_run/opentitan/hw/dv/tools/dvsim/sim.mk:58: sw_build] Error 1
rom_e2e_boot_policy_valid_a_good_b_good_dev 35094902013170083216973170566158236528932341093539919567409718691539528902096 None
Another command (pid=548725) is running. Waiting for it to complete on the server (server_pid=209140)...
Another command (pid=545111) is running. Waiting for it to complete on the server (server_pid=209140)...
Another command (pid=554215) is running. Waiting for it to complete on the server (server_pid=209140)...
WARNING: Target pattern parsing failed.
ERROR: Skipping '//sw/device/silicon_creator/rom/e2e:empty_test_slot_a_sim_dv': no such target '//sw/device/silicon_creator/rom/e2e:empty_test_slot_a_sim_dv': target 'empty_test_slot_a_sim_dv' not declared in package 'sw/device/silicon_creator/rom/e2e' defined by /nightly/current_run/opentitan/sw/device/silicon_creator/rom/e2e/BUILD
ERROR: no such target '//sw/device/silicon_creator/rom/e2e:empty_test_slot_a_sim_dv': target 'empty_test_slot_a_sim_dv' not declared in package 'sw/device/silicon_creator/rom/e2e' defined by /nightly/current_run/opentitan/sw/device/silicon_creator/rom/e2e/BUILD
ERROR: Build did NOT complete successfully
_run_cmd -> had a non-zero return code of 1.
make: *** [/nightly/current_run/opentitan/hw/dv/tools/dvsim/sim.mk:58: sw_build] Error 1
rom_e2e_boot_policy_valid_a_good_b_good_prod 9873618329903516261956107390698156809856054686623595059117850192200625501368 None
---- STDERR ----
Another command (pid=542632) is running. Waiting for it to complete on the server (server_pid=209140)...
WARNING: Target pattern parsing failed.
ERROR: Skipping '//sw/device/silicon_creator/rom/e2e:empty_test_slot_a_sim_dv': no such target '//sw/device/silicon_creator/rom/e2e:empty_test_slot_a_sim_dv': target 'empty_test_slot_a_sim_dv' not declared in package 'sw/device/silicon_creator/rom/e2e' defined by /nightly/current_run/opentitan/sw/device/silicon_creator/rom/e2e/BUILD
ERROR: no such target '//sw/device/silicon_creator/rom/e2e:empty_test_slot_a_sim_dv': target 'empty_test_slot_a_sim_dv' not declared in package 'sw/device/silicon_creator/rom/e2e' defined by /nightly/current_run/opentitan/sw/device/silicon_creator/rom/e2e/BUILD
ERROR: Build did NOT complete successfully
_run_cmd -> had a non-zero return code of 1.
make: *** [/nightly/current_run/opentitan/hw/dv/tools/dvsim/sim.mk:58: sw_build] Error 1
rom_e2e_boot_policy_valid_a_good_b_good_prod_end 110975115510201746439440032033014120310605818347531843689141268981097840422876 None
Another command (pid=535669) is running. Waiting for it to complete on the server (server_pid=209140)...
Another command (pid=545111) is running. Waiting for it to complete on the server (server_pid=209140)...
Another command (pid=554215) is running. Waiting for it to complete on the server (server_pid=209140)...
WARNING: Target pattern parsing failed.
ERROR: Skipping '//sw/device/silicon_creator/rom/e2e:empty_test_slot_a_sim_dv': no such target '//sw/device/silicon_creator/rom/e2e:empty_test_slot_a_sim_dv': target 'empty_test_slot_a_sim_dv' not declared in package 'sw/device/silicon_creator/rom/e2e' defined by /nightly/current_run/opentitan/sw/device/silicon_creator/rom/e2e/BUILD
ERROR: no such target '//sw/device/silicon_creator/rom/e2e:empty_test_slot_a_sim_dv': target 'empty_test_slot_a_sim_dv' not declared in package 'sw/device/silicon_creator/rom/e2e' defined by /nightly/current_run/opentitan/sw/device/silicon_creator/rom/e2e/BUILD
ERROR: Build did NOT complete successfully
_run_cmd -> had a non-zero return code of 1.
make: *** [/nightly/current_run/opentitan/hw/dv/tools/dvsim/sim.mk:58: sw_build] Error 1
rom_e2e_boot_policy_valid_a_good_b_good_rma 110849996948206466070384208541729531444890254718241866768642045059288211966462 None
---- STDERR ----
Another command (pid=545111) is running. Waiting for it to complete on the server (server_pid=209140)...
Another command (pid=554215) is running. Waiting for it to complete on the server (server_pid=209140)...
WARNING: Target pattern parsing failed.
ERROR: Skipping '//sw/device/silicon_creator/rom/e2e:empty_test_slot_a_sim_dv': no such target '//sw/device/silicon_creator/rom/e2e:empty_test_slot_a_sim_dv': target 'empty_test_slot_a_sim_dv' not declared in package 'sw/device/silicon_creator/rom/e2e' defined by /nightly/current_run/opentitan/sw/device/silicon_creator/rom/e2e/BUILD
ERROR: no such target '//sw/device/silicon_creator/rom/e2e:empty_test_slot_a_sim_dv': target 'empty_test_slot_a_sim_dv' not declared in package 'sw/device/silicon_creator/rom/e2e' defined by /nightly/current_run/opentitan/sw/device/silicon_creator/rom/e2e/BUILD
ERROR: Build did NOT complete successfully
_run_cmd -> had a non-zero return code of 1.
make: *** [/nightly/current_run/opentitan/hw/dv/tools/dvsim/sim.mk:58: sw_build] Error 1
rom_e2e_boot_policy_valid_a_good_b_bad_test_unlocked0 84557548666341492630705148258891072604300147292775018461470199751172239115842 None
Another command (pid=326399) is running. Waiting for it to complete on the server (server_pid=209140)...
Another command (pid=487382) is running. Waiting for it to complete on the server (server_pid=209140)...
Another command (pid=380032) is running. Waiting for it to complete on the server (server_pid=209140)...
WARNING: Target pattern parsing failed.
ERROR: Skipping '//sw/device/silicon_creator/rom/e2e:empty_test_slot_a_sim_dv': no such target '//sw/device/silicon_creator/rom/e2e:empty_test_slot_a_sim_dv': target 'empty_test_slot_a_sim_dv' not declared in package 'sw/device/silicon_creator/rom/e2e' defined by /nightly/current_run/opentitan/sw/device/silicon_creator/rom/e2e/BUILD
ERROR: no such target '//sw/device/silicon_creator/rom/e2e:empty_test_slot_a_sim_dv': target 'empty_test_slot_a_sim_dv' not declared in package 'sw/device/silicon_creator/rom/e2e' defined by /nightly/current_run/opentitan/sw/device/silicon_creator/rom/e2e/BUILD
ERROR: Build did NOT complete successfully
_run_cmd -> had a non-zero return code of 1.
make: *** [/nightly/current_run/opentitan/hw/dv/tools/dvsim/sim.mk:58: sw_build] Error 1
rom_e2e_boot_policy_valid_a_good_b_bad_dev 33804497012731106097474493201489980224737638696728514232095366217148789727207 None
---- STDERR ----
Another command (pid=525361) is running. Waiting for it to complete on the server (server_pid=209140)...
Another command (pid=513693) is running. Waiting for it to complete on the server (server_pid=209140)...
WARNING: Target pattern parsing failed.
ERROR: Skipping '//sw/device/silicon_creator/rom/e2e:empty_test_slot_a_sim_dv': no such target '//sw/device/silicon_creator/rom/e2e:empty_test_slot_a_sim_dv': target 'empty_test_slot_a_sim_dv' not declared in package 'sw/device/silicon_creator/rom/e2e' defined by /nightly/current_run/opentitan/sw/device/silicon_creator/rom/e2e/BUILD
ERROR: no such target '//sw/device/silicon_creator/rom/e2e:empty_test_slot_a_sim_dv': target 'empty_test_slot_a_sim_dv' not declared in package 'sw/device/silicon_creator/rom/e2e' defined by /nightly/current_run/opentitan/sw/device/silicon_creator/rom/e2e/BUILD
ERROR: Build did NOT complete successfully
_run_cmd -> had a non-zero return code of 1.
make: *** [/nightly/current_run/opentitan/hw/dv/tools/dvsim/sim.mk:58: sw_build] Error 1
rom_e2e_boot_policy_valid_a_good_b_bad_prod 69024881906764288560199018259106998028969852797908675039153561852158666119330 None
Another command (pid=540019) is running. Waiting for it to complete on the server (server_pid=209140)...
Another command (pid=534701) is running. Waiting for it to complete on the server (server_pid=209140)...
Another command (pid=543158) is running. Waiting for it to complete on the server (server_pid=209140)...
WARNING: Target pattern parsing failed.
ERROR: Skipping '//sw/device/silicon_creator/rom/e2e:empty_test_slot_a_sim_dv': no such target '//sw/device/silicon_creator/rom/e2e:empty_test_slot_a_sim_dv': target 'empty_test_slot_a_sim_dv' not declared in package 'sw/device/silicon_creator/rom/e2e' defined by /nightly/current_run/opentitan/sw/device/silicon_creator/rom/e2e/BUILD
ERROR: no such target '//sw/device/silicon_creator/rom/e2e:empty_test_slot_a_sim_dv': target 'empty_test_slot_a_sim_dv' not declared in package 'sw/device/silicon_creator/rom/e2e' defined by /nightly/current_run/opentitan/sw/device/silicon_creator/rom/e2e/BUILD
ERROR: Build did NOT complete successfully
_run_cmd -> had a non-zero return code of 1.
make: *** [/nightly/current_run/opentitan/hw/dv/tools/dvsim/sim.mk:58: sw_build] Error 1
rom_e2e_boot_policy_valid_a_good_b_bad_prod_end 107813332129841009137349354181719825685075762073584269399984260908758741457420 None
Another command (pid=542531) is running. Waiting for it to complete on the server (server_pid=209140)...
Another command (pid=545067) is running. Waiting for it to complete on the server (server_pid=209140)...
Another command (pid=534573) is running. Waiting for it to complete on the server (server_pid=209140)...
WARNING: Target pattern parsing failed.
ERROR: Skipping '//sw/device/silicon_creator/rom/e2e:empty_test_slot_a_sim_dv': no such target '//sw/device/silicon_creator/rom/e2e:empty_test_slot_a_sim_dv': target 'empty_test_slot_a_sim_dv' not declared in package 'sw/device/silicon_creator/rom/e2e' defined by /nightly/current_run/opentitan/sw/device/silicon_creator/rom/e2e/BUILD
ERROR: no such target '//sw/device/silicon_creator/rom/e2e:empty_test_slot_a_sim_dv': target 'empty_test_slot_a_sim_dv' not declared in package 'sw/device/silicon_creator/rom/e2e' defined by /nightly/current_run/opentitan/sw/device/silicon_creator/rom/e2e/BUILD
ERROR: Build did NOT complete successfully
_run_cmd -> had a non-zero return code of 1.
make: *** [/nightly/current_run/opentitan/hw/dv/tools/dvsim/sim.mk:58: sw_build] Error 1
rom_e2e_boot_policy_valid_a_good_b_bad_rma 17352355004715058707196043350626086318434428765970150982571083953928023012844 None
Another command (pid=518855) is running. Waiting for it to complete on the server (server_pid=209140)...
Another command (pid=534047) is running. Waiting for it to complete on the server (server_pid=209140)...
Another command (pid=535669) is running. Waiting for it to complete on the server (server_pid=209140)...
WARNING: Target pattern parsing failed.
ERROR: Skipping '//sw/device/silicon_creator/rom/e2e:empty_test_slot_a_sim_dv': no such target '//sw/device/silicon_creator/rom/e2e:empty_test_slot_a_sim_dv': target 'empty_test_slot_a_sim_dv' not declared in package 'sw/device/silicon_creator/rom/e2e' defined by /nightly/current_run/opentitan/sw/device/silicon_creator/rom/e2e/BUILD
ERROR: no such target '//sw/device/silicon_creator/rom/e2e:empty_test_slot_a_sim_dv': target 'empty_test_slot_a_sim_dv' not declared in package 'sw/device/silicon_creator/rom/e2e' defined by /nightly/current_run/opentitan/sw/device/silicon_creator/rom/e2e/BUILD
ERROR: Build did NOT complete successfully
_run_cmd -> had a non-zero return code of 1.
make: *** [/nightly/current_run/opentitan/hw/dv/tools/dvsim/sim.mk:58: sw_build] Error 1
rom_e2e_boot_policy_valid_a_bad_b_good_test_unlocked0 33944568419515192144151640339030457184763644744721584665191642293011963162797 None
---- STDERR ----
Another command (pid=319302) is running. Waiting for it to complete on the server (server_pid=209140)...
WARNING: Target pattern parsing failed.
ERROR: Skipping '//sw/device/silicon_creator/rom/e2e:empty_test_slot_b_sim_dv': no such target '//sw/device/silicon_creator/rom/e2e:empty_test_slot_b_sim_dv': target 'empty_test_slot_b_sim_dv' not declared in package 'sw/device/silicon_creator/rom/e2e' defined by /nightly/current_run/opentitan/sw/device/silicon_creator/rom/e2e/BUILD
ERROR: no such target '//sw/device/silicon_creator/rom/e2e:empty_test_slot_b_sim_dv': target 'empty_test_slot_b_sim_dv' not declared in package 'sw/device/silicon_creator/rom/e2e' defined by /nightly/current_run/opentitan/sw/device/silicon_creator/rom/e2e/BUILD
ERROR: Build did NOT complete successfully
_run_cmd -> had a non-zero return code of 1.
make: *** [/nightly/current_run/opentitan/hw/dv/tools/dvsim/sim.mk:58: sw_build] Error 1
rom_e2e_boot_policy_valid_a_bad_b_good_dev 63202418913542101342172595630589946972443918799668031993589473833560484850003 None
---- STDERR ----
Another command (pid=516136) is running. Waiting for it to complete on the server (server_pid=209140)...
WARNING: Target pattern parsing failed.
ERROR: Skipping '//sw/device/silicon_creator/rom/e2e:empty_test_slot_b_sim_dv': no such target '//sw/device/silicon_creator/rom/e2e:empty_test_slot_b_sim_dv': target 'empty_test_slot_b_sim_dv' not declared in package 'sw/device/silicon_creator/rom/e2e' defined by /nightly/current_run/opentitan/sw/device/silicon_creator/rom/e2e/BUILD
ERROR: no such target '//sw/device/silicon_creator/rom/e2e:empty_test_slot_b_sim_dv': target 'empty_test_slot_b_sim_dv' not declared in package 'sw/device/silicon_creator/rom/e2e' defined by /nightly/current_run/opentitan/sw/device/silicon_creator/rom/e2e/BUILD
ERROR: Build did NOT complete successfully
_run_cmd -> had a non-zero return code of 1.
make: *** [/nightly/current_run/opentitan/hw/dv/tools/dvsim/sim.mk:58: sw_build] Error 1
rom_e2e_boot_policy_valid_a_bad_b_good_prod 34943934956741255462304435582378211331650026194810615778039940609278471020777 None
---- STDERR ----
Another command (pid=544154) is running. Waiting for it to complete on the server (server_pid=209140)...
WARNING: Target pattern parsing failed.
ERROR: Skipping '//sw/device/silicon_creator/rom/e2e:empty_test_slot_b_sim_dv': no such target '//sw/device/silicon_creator/rom/e2e:empty_test_slot_b_sim_dv': target 'empty_test_slot_b_sim_dv' not declared in package 'sw/device/silicon_creator/rom/e2e' defined by /nightly/current_run/opentitan/sw/device/silicon_creator/rom/e2e/BUILD
ERROR: no such target '//sw/device/silicon_creator/rom/e2e:empty_test_slot_b_sim_dv': target 'empty_test_slot_b_sim_dv' not declared in package 'sw/device/silicon_creator/rom/e2e' defined by /nightly/current_run/opentitan/sw/device/silicon_creator/rom/e2e/BUILD
ERROR: Build did NOT complete successfully
_run_cmd -> had a non-zero return code of 1.
make: *** [/nightly/current_run/opentitan/hw/dv/tools/dvsim/sim.mk:58: sw_build] Error 1
rom_e2e_boot_policy_valid_a_bad_b_good_prod_end 74659405885286757690444500577000363288960518837141252194386870858377384991423 None
---- STDERR ----
Another command (pid=531144) is running. Waiting for it to complete on the server (server_pid=209140)...
WARNING: Target pattern parsing failed.
ERROR: Skipping '//sw/device/silicon_creator/rom/e2e:empty_test_slot_b_sim_dv': no such target '//sw/device/silicon_creator/rom/e2e:empty_test_slot_b_sim_dv': target 'empty_test_slot_b_sim_dv' not declared in package 'sw/device/silicon_creator/rom/e2e' defined by /nightly/current_run/opentitan/sw/device/silicon_creator/rom/e2e/BUILD
ERROR: no such target '//sw/device/silicon_creator/rom/e2e:empty_test_slot_b_sim_dv': target 'empty_test_slot_b_sim_dv' not declared in package 'sw/device/silicon_creator/rom/e2e' defined by /nightly/current_run/opentitan/sw/device/silicon_creator/rom/e2e/BUILD
ERROR: Build did NOT complete successfully
_run_cmd -> had a non-zero return code of 1.
make: *** [/nightly/current_run/opentitan/hw/dv/tools/dvsim/sim.mk:58: sw_build] Error 1
rom_e2e_boot_policy_valid_a_bad_b_good_rma 111033312389730255171726440435721433467304791720114099549061156195455197367927 None
Another command (pid=548725) is running. Waiting for it to complete on the server (server_pid=209140)...
Another command (pid=545111) is running. Waiting for it to complete on the server (server_pid=209140)...
Another command (pid=554215) is running. Waiting for it to complete on the server (server_pid=209140)...
WARNING: Target pattern parsing failed.
ERROR: Skipping '//sw/device/silicon_creator/rom/e2e:empty_test_slot_b_sim_dv': no such target '//sw/device/silicon_creator/rom/e2e:empty_test_slot_b_sim_dv': target 'empty_test_slot_b_sim_dv' not declared in package 'sw/device/silicon_creator/rom/e2e' defined by /nightly/current_run/opentitan/sw/device/silicon_creator/rom/e2e/BUILD
ERROR: no such target '//sw/device/silicon_creator/rom/e2e:empty_test_slot_b_sim_dv': target 'empty_test_slot_b_sim_dv' not declared in package 'sw/device/silicon_creator/rom/e2e' defined by /nightly/current_run/opentitan/sw/device/silicon_creator/rom/e2e/BUILD
ERROR: Build did NOT complete successfully
_run_cmd -> had a non-zero return code of 1.
make: *** [/nightly/current_run/opentitan/hw/dv/tools/dvsim/sim.mk:58: sw_build] Error 1
rom_e2e_sigverify_always_a_bad_b_bad_test_unlocked0 43713549294110949120075593714651444003868693057942066138249375437405834233701 None
Another command (pid=495383) is running. Waiting for it to complete on the server (server_pid=209140)...
Another command (pid=495771) is running. Waiting for it to complete on the server (server_pid=209140)...
Another command (pid=496291) is running. Waiting for it to complete on the server (server_pid=209140)...
WARNING: Target pattern parsing failed.
ERROR: Skipping '//sw/device/silicon_creator/rom/e2e:otp_img_sigverify_always_test_unlocked0': no such target '//sw/device/silicon_creator/rom/e2e:otp_img_sigverify_always_test_unlocked0': target 'otp_img_sigverify_always_test_unlocked0' not declared in package 'sw/device/silicon_creator/rom/e2e' defined by /nightly/current_run/opentitan/sw/device/silicon_creator/rom/e2e/BUILD
ERROR: no such target '//sw/device/silicon_creator/rom/e2e:otp_img_sigverify_always_test_unlocked0': target 'otp_img_sigverify_always_test_unlocked0' not declared in package 'sw/device/silicon_creator/rom/e2e' defined by /nightly/current_run/opentitan/sw/device/silicon_creator/rom/e2e/BUILD
ERROR: Build did NOT complete successfully
_run_cmd -> had a non-zero return code of 1.
make: *** [/nightly/current_run/opentitan/hw/dv/tools/dvsim/sim.mk:58: sw_build] Error 1
rom_e2e_sigverify_always_a_bad_b_bad_dev 44366560341678410218525685883868395958092383916122724193944238273078241115898 None
---- STDERR ----
Another command (pid=591752) is running. Waiting for it to complete on the server (server_pid=209140)...
WARNING: Target pattern parsing failed.
ERROR: Skipping '//sw/device/silicon_creator/rom/e2e:otp_img_sigverify_always_dev': no such target '//sw/device/silicon_creator/rom/e2e:otp_img_sigverify_always_dev': target 'otp_img_sigverify_always_dev' not declared in package 'sw/device/silicon_creator/rom/e2e' defined by /nightly/current_run/opentitan/sw/device/silicon_creator/rom/e2e/BUILD
ERROR: no such target '//sw/device/silicon_creator/rom/e2e:otp_img_sigverify_always_dev': target 'otp_img_sigverify_always_dev' not declared in package 'sw/device/silicon_creator/rom/e2e' defined by /nightly/current_run/opentitan/sw/device/silicon_creator/rom/e2e/BUILD
ERROR: Build did NOT complete successfully
_run_cmd -> had a non-zero return code of 1.
make: *** [/nightly/current_run/opentitan/hw/dv/tools/dvsim/sim.mk:58: sw_build] Error 1
rom_e2e_sigverify_always_a_bad_b_bad_prod 445493700748488097494000138460304469848351721727425518432013629975086960474 None
Another command (pid=597037) is running. Waiting for it to complete on the server (server_pid=209140)...
Another command (pid=603221) is running. Waiting for it to complete on the server (server_pid=209140)...
Another command (pid=588262) is running. Waiting for it to complete on the server (server_pid=209140)...
WARNING: Target pattern parsing failed.
ERROR: Skipping '//sw/device/silicon_creator/rom/e2e:otp_img_sigverify_always_prod': no such target '//sw/device/silicon_creator/rom/e2e:otp_img_sigverify_always_prod': target 'otp_img_sigverify_always_prod' not declared in package 'sw/device/silicon_creator/rom/e2e' defined by /nightly/current_run/opentitan/sw/device/silicon_creator/rom/e2e/BUILD
ERROR: no such target '//sw/device/silicon_creator/rom/e2e:otp_img_sigverify_always_prod': target 'otp_img_sigverify_always_prod' not declared in package 'sw/device/silicon_creator/rom/e2e' defined by /nightly/current_run/opentitan/sw/device/silicon_creator/rom/e2e/BUILD
ERROR: Build did NOT complete successfully
_run_cmd -> had a non-zero return code of 1.
make: *** [/nightly/current_run/opentitan/hw/dv/tools/dvsim/sim.mk:58: sw_build] Error 1
rom_e2e_sigverify_always_a_bad_b_bad_prod_end 103087236968526254832706283334467260101774806548784647922545801943987483204901 None
Another command (pid=595540) is running. Waiting for it to complete on the server (server_pid=209140)...
Another command (pid=597037) is running. Waiting for it to complete on the server (server_pid=209140)...
Another command (pid=576849) is running. Waiting for it to complete on the server (server_pid=209140)...
WARNING: Target pattern parsing failed.
ERROR: Skipping '//sw/device/silicon_creator/rom/e2e:otp_img_sigverify_always_prod_end': no such target '//sw/device/silicon_creator/rom/e2e:otp_img_sigverify_always_prod_end': target 'otp_img_sigverify_always_prod_end' not declared in package 'sw/device/silicon_creator/rom/e2e' defined by /nightly/current_run/opentitan/sw/device/silicon_creator/rom/e2e/BUILD
ERROR: no such target '//sw/device/silicon_creator/rom/e2e:otp_img_sigverify_always_prod_end': target 'otp_img_sigverify_always_prod_end' not declared in package 'sw/device/silicon_creator/rom/e2e' defined by /nightly/current_run/opentitan/sw/device/silicon_creator/rom/e2e/BUILD
ERROR: Build did NOT complete successfully
_run_cmd -> had a non-zero return code of 1.
make: *** [/nightly/current_run/opentitan/hw/dv/tools/dvsim/sim.mk:58: sw_build] Error 1
rom_e2e_sigverify_always_a_bad_b_bad_rma 3315254883005874402816590194966710903209822903120515722780829682799581291644 None
Another command (pid=616632) is running. Waiting for it to complete on the server (server_pid=209140)...
Another command (pid=628113) is running. Waiting for it to complete on the server (server_pid=209140)...
Another command (pid=620762) is running. Waiting for it to complete on the server (server_pid=209140)...
WARNING: Target pattern parsing failed.
ERROR: Skipping '//sw/device/silicon_creator/rom/e2e:otp_img_sigverify_always_rma': no such target '//sw/device/silicon_creator/rom/e2e:otp_img_sigverify_always_rma': target 'otp_img_sigverify_always_rma' not declared in package 'sw/device/silicon_creator/rom/e2e' defined by /nightly/current_run/opentitan/sw/device/silicon_creator/rom/e2e/BUILD
ERROR: no such target '//sw/device/silicon_creator/rom/e2e:otp_img_sigverify_always_rma': target 'otp_img_sigverify_always_rma' not declared in package 'sw/device/silicon_creator/rom/e2e' defined by /nightly/current_run/opentitan/sw/device/silicon_creator/rom/e2e/BUILD
ERROR: Build did NOT complete successfully
_run_cmd -> had a non-zero return code of 1.
make: *** [/nightly/current_run/opentitan/hw/dv/tools/dvsim/sim.mk:58: sw_build] Error 1
rom_e2e_sigverify_always_a_bad_b_nothing_test_unlocked0 38555189498415687922631678273944376074022037886929525883717061391166587924968 None
---- STDERR ----
Another command (pid=402993) is running. Waiting for it to complete on the server (server_pid=209140)...
Another command (pid=398039) is running. Waiting for it to complete on the server (server_pid=209140)...
WARNING: Target pattern parsing failed.
ERROR: Skipping '//sw/device/silicon_creator/rom/e2e:otp_img_sigverify_always_test_unlocked0': no such target '//sw/device/silicon_creator/rom/e2e:otp_img_sigverify_always_test_unlocked0': target 'otp_img_sigverify_always_test_unlocked0' not declared in package 'sw/device/silicon_creator/rom/e2e' defined by /nightly/current_run/opentitan/sw/device/silicon_creator/rom/e2e/BUILD
ERROR: no such target '//sw/device/silicon_creator/rom/e2e:otp_img_sigverify_always_test_unlocked0': target 'otp_img_sigverify_always_test_unlocked0' not declared in package 'sw/device/silicon_creator/rom/e2e' defined by /nightly/current_run/opentitan/sw/device/silicon_creator/rom/e2e/BUILD
ERROR: Build did NOT complete successfully
_run_cmd -> had a non-zero return code of 1.
make: *** [/nightly/current_run/opentitan/hw/dv/tools/dvsim/sim.mk:58: sw_build] Error 1
rom_e2e_sigverify_always_a_bad_b_nothing_dev 63331507585016417745754295158159609240928154560639832647397680654445091608032 None
---- STDERR ----
Another command (pid=582205) is running. Waiting for it to complete on the server (server_pid=209140)...
WARNING: Target pattern parsing failed.
ERROR: Skipping '//sw/device/silicon_creator/rom/e2e:otp_img_sigverify_always_dev': no such target '//sw/device/silicon_creator/rom/e2e:otp_img_sigverify_always_dev': target 'otp_img_sigverify_always_dev' not declared in package 'sw/device/silicon_creator/rom/e2e' defined by /nightly/current_run/opentitan/sw/device/silicon_creator/rom/e2e/BUILD
ERROR: no such target '//sw/device/silicon_creator/rom/e2e:otp_img_sigverify_always_dev': target 'otp_img_sigverify_always_dev' not declared in package 'sw/device/silicon_creator/rom/e2e' defined by /nightly/current_run/opentitan/sw/device/silicon_creator/rom/e2e/BUILD
ERROR: Build did NOT complete successfully
_run_cmd -> had a non-zero return code of 1.
make: *** [/nightly/current_run/opentitan/hw/dv/tools/dvsim/sim.mk:58: sw_build] Error 1
rom_e2e_sigverify_always_a_bad_b_nothing_prod 111419674252229771045782836679234394002578581973505852305421690965218470598542 None
Another command (pid=572308) is running. Waiting for it to complete on the server (server_pid=209140)...
Another command (pid=568540) is running. Waiting for it to complete on the server (server_pid=209140)...
Another command (pid=578207) is running. Waiting for it to complete on the server (server_pid=209140)...
WARNING: Target pattern parsing failed.
ERROR: Skipping '//sw/device/silicon_creator/rom/e2e:otp_img_sigverify_always_prod': no such target '//sw/device/silicon_creator/rom/e2e:otp_img_sigverify_always_prod': target 'otp_img_sigverify_always_prod' not declared in package 'sw/device/silicon_creator/rom/e2e' defined by /nightly/current_run/opentitan/sw/device/silicon_creator/rom/e2e/BUILD
ERROR: no such target '//sw/device/silicon_creator/rom/e2e:otp_img_sigverify_always_prod': target 'otp_img_sigverify_always_prod' not declared in package 'sw/device/silicon_creator/rom/e2e' defined by /nightly/current_run/opentitan/sw/device/silicon_creator/rom/e2e/BUILD
ERROR: Build did NOT complete successfully
_run_cmd -> had a non-zero return code of 1.
make: *** [/nightly/current_run/opentitan/hw/dv/tools/dvsim/sim.mk:58: sw_build] Error 1
rom_e2e_sigverify_always_a_bad_b_nothing_prod_end 80006687756910752647818157249708063452762459343673488977246601568306110157273 None
Another command (pid=585787) is running. Waiting for it to complete on the server (server_pid=209140)...
Another command (pid=597037) is running. Waiting for it to complete on the server (server_pid=209140)...
Another command (pid=603221) is running. Waiting for it to complete on the server (server_pid=209140)...
WARNING: Target pattern parsing failed.
ERROR: Skipping '//sw/device/silicon_creator/rom/e2e:otp_img_sigverify_always_prod_end': no such target '//sw/device/silicon_creator/rom/e2e:otp_img_sigverify_always_prod_end': target 'otp_img_sigverify_always_prod_end' not declared in package 'sw/device/silicon_creator/rom/e2e' defined by /nightly/current_run/opentitan/sw/device/silicon_creator/rom/e2e/BUILD
ERROR: no such target '//sw/device/silicon_creator/rom/e2e:otp_img_sigverify_always_prod_end': target 'otp_img_sigverify_always_prod_end' not declared in package 'sw/device/silicon_creator/rom/e2e' defined by /nightly/current_run/opentitan/sw/device/silicon_creator/rom/e2e/BUILD
ERROR: Build did NOT complete successfully
_run_cmd -> had a non-zero return code of 1.
make: *** [/nightly/current_run/opentitan/hw/dv/tools/dvsim/sim.mk:58: sw_build] Error 1
rom_e2e_sigverify_always_a_bad_b_nothing_rma 18472509036985445654179160938141474958629453502228598531576690697832111887289 None
Another command (pid=585787) is running. Waiting for it to complete on the server (server_pid=209140)...
Another command (pid=595540) is running. Waiting for it to complete on the server (server_pid=209140)...
Another command (pid=597037) is running. Waiting for it to complete on the server (server_pid=209140)...
WARNING: Target pattern parsing failed.
ERROR: Skipping '//sw/device/silicon_creator/rom/e2e:otp_img_sigverify_always_rma': no such target '//sw/device/silicon_creator/rom/e2e:otp_img_sigverify_always_rma': target 'otp_img_sigverify_always_rma' not declared in package 'sw/device/silicon_creator/rom/e2e' defined by /nightly/current_run/opentitan/sw/device/silicon_creator/rom/e2e/BUILD
ERROR: no such target '//sw/device/silicon_creator/rom/e2e:otp_img_sigverify_always_rma': target 'otp_img_sigverify_always_rma' not declared in package 'sw/device/silicon_creator/rom/e2e' defined by /nightly/current_run/opentitan/sw/device/silicon_creator/rom/e2e/BUILD
ERROR: Build did NOT complete successfully
_run_cmd -> had a non-zero return code of 1.
make: *** [/nightly/current_run/opentitan/hw/dv/tools/dvsim/sim.mk:58: sw_build] Error 1
rom_e2e_sigverify_always_a_nothing_b_bad_test_unlocked0 31857626948226851566887898463877297728633942302914081054855935735118893456483 None
Another command (pid=487382) is running. Waiting for it to complete on the server (server_pid=209140)...
Another command (pid=380032) is running. Waiting for it to complete on the server (server_pid=209140)...
Another command (pid=485403) is running. Waiting for it to complete on the server (server_pid=209140)...
WARNING: Target pattern parsing failed.
ERROR: Skipping '//sw/device/silicon_creator/rom/e2e:otp_img_sigverify_always_test_unlocked0': no such target '//sw/device/silicon_creator/rom/e2e:otp_img_sigverify_always_test_unlocked0': target 'otp_img_sigverify_always_test_unlocked0' not declared in package 'sw/device/silicon_creator/rom/e2e' defined by /nightly/current_run/opentitan/sw/device/silicon_creator/rom/e2e/BUILD
ERROR: no such target '//sw/device/silicon_creator/rom/e2e:otp_img_sigverify_always_test_unlocked0': target 'otp_img_sigverify_always_test_unlocked0' not declared in package 'sw/device/silicon_creator/rom/e2e' defined by /nightly/current_run/opentitan/sw/device/silicon_creator/rom/e2e/BUILD
ERROR: Build did NOT complete successfully
_run_cmd -> had a non-zero return code of 1.
make: *** [/nightly/current_run/opentitan/hw/dv/tools/dvsim/sim.mk:58: sw_build] Error 1
rom_e2e_sigverify_always_a_nothing_b_bad_dev 77213970198617298622664788062232399305175719974061896931353626390349614443303 None
---- STDERR ----
Another command (pid=601017) is running. Waiting for it to complete on the server (server_pid=209140)...
WARNING: Target pattern parsing failed.
ERROR: Skipping '//sw/device/silicon_creator/rom/e2e:otp_img_sigverify_always_dev': no such target '//sw/device/silicon_creator/rom/e2e:otp_img_sigverify_always_dev': target 'otp_img_sigverify_always_dev' not declared in package 'sw/device/silicon_creator/rom/e2e' defined by /nightly/current_run/opentitan/sw/device/silicon_creator/rom/e2e/BUILD
ERROR: no such target '//sw/device/silicon_creator/rom/e2e:otp_img_sigverify_always_dev': target 'otp_img_sigverify_always_dev' not declared in package 'sw/device/silicon_creator/rom/e2e' defined by /nightly/current_run/opentitan/sw/device/silicon_creator/rom/e2e/BUILD
ERROR: Build did NOT complete successfully
_run_cmd -> had a non-zero return code of 1.
make: *** [/nightly/current_run/opentitan/hw/dv/tools/dvsim/sim.mk:58: sw_build] Error 1
rom_e2e_sigverify_always_a_nothing_b_bad_prod 66579643580897774289308964957395460613330651418744860421002589231698535203402 None
Another command (pid=605980) is running. Waiting for it to complete on the server (server_pid=209140)...
Another command (pid=610277) is running. Waiting for it to complete on the server (server_pid=209140)...
Another command (pid=608508) is running. Waiting for it to complete on the server (server_pid=209140)...
WARNING: Target pattern parsing failed.
ERROR: Skipping '//sw/device/silicon_creator/rom/e2e:otp_img_sigverify_always_prod': no such target '//sw/device/silicon_creator/rom/e2e:otp_img_sigverify_always_prod': target 'otp_img_sigverify_always_prod' not declared in package 'sw/device/silicon_creator/rom/e2e' defined by /nightly/current_run/opentitan/sw/device/silicon_creator/rom/e2e/BUILD
ERROR: no such target '//sw/device/silicon_creator/rom/e2e:otp_img_sigverify_always_prod': target 'otp_img_sigverify_always_prod' not declared in package 'sw/device/silicon_creator/rom/e2e' defined by /nightly/current_run/opentitan/sw/device/silicon_creator/rom/e2e/BUILD
ERROR: Build did NOT complete successfully
_run_cmd -> had a non-zero return code of 1.
make: *** [/nightly/current_run/opentitan/hw/dv/tools/dvsim/sim.mk:58: sw_build] Error 1
rom_e2e_sigverify_always_a_nothing_b_bad_prod_end 85067670694708034252556827679498441136012108970598507107659222074512229890274 None
Another command (pid=612784) is running. Waiting for it to complete on the server (server_pid=209140)...
Another command (pid=610454) is running. Waiting for it to complete on the server (server_pid=209140)...
Another command (pid=614252) is running. Waiting for it to complete on the server (server_pid=209140)...
WARNING: Target pattern parsing failed.
ERROR: Skipping '//sw/device/silicon_creator/rom/e2e:otp_img_sigverify_always_prod_end': no such target '//sw/device/silicon_creator/rom/e2e:otp_img_sigverify_always_prod_end': target 'otp_img_sigverify_always_prod_end' not declared in package 'sw/device/silicon_creator/rom/e2e' defined by /nightly/current_run/opentitan/sw/device/silicon_creator/rom/e2e/BUILD
ERROR: no such target '//sw/device/silicon_creator/rom/e2e:otp_img_sigverify_always_prod_end': target 'otp_img_sigverify_always_prod_end' not declared in package 'sw/device/silicon_creator/rom/e2e' defined by /nightly/current_run/opentitan/sw/device/silicon_creator/rom/e2e/BUILD
ERROR: Build did NOT complete successfully
_run_cmd -> had a non-zero return code of 1.
make: *** [/nightly/current_run/opentitan/hw/dv/tools/dvsim/sim.mk:58: sw_build] Error 1
rom_e2e_sigverify_always_a_nothing_b_bad_rma 34774996144210733029399228133661740869101879538215139831620209881484403538617 None
Another command (pid=611663) is running. Waiting for it to complete on the server (server_pid=209140)...
Another command (pid=608508) is running. Waiting for it to complete on the server (server_pid=209140)...
Another command (pid=610214) is running. Waiting for it to complete on the server (server_pid=209140)...
WARNING: Target pattern parsing failed.
ERROR: Skipping '//sw/device/silicon_creator/rom/e2e:otp_img_sigverify_always_rma': no such target '//sw/device/silicon_creator/rom/e2e:otp_img_sigverify_always_rma': target 'otp_img_sigverify_always_rma' not declared in package 'sw/device/silicon_creator/rom/e2e' defined by /nightly/current_run/opentitan/sw/device/silicon_creator/rom/e2e/BUILD
ERROR: no such target '//sw/device/silicon_creator/rom/e2e:otp_img_sigverify_always_rma': target 'otp_img_sigverify_always_rma' not declared in package 'sw/device/silicon_creator/rom/e2e' defined by /nightly/current_run/opentitan/sw/device/silicon_creator/rom/e2e/BUILD
ERROR: Build did NOT complete successfully
_run_cmd -> had a non-zero return code of 1.
make: *** [/nightly/current_run/opentitan/hw/dv/tools/dvsim/sim.mk:58: sw_build] Error 1
rom_e2e_asm_init_test_unlocked0 11677221516897667100545456308922410336626900855122761121357445001478243333249 None
Another command (pid=428308) is running. Waiting for it to complete on the server (server_pid=209140)...
Another command (pid=391135) is running. Waiting for it to complete on the server (server_pid=209140)...
Another command (pid=387882) is running. Waiting for it to complete on the server (server_pid=209140)...
WARNING: Target pattern parsing failed.
ERROR: Skipping '//sw/device/silicon_creator/rom/e2e:empty_test_slot_a_sim_dv': no such target '//sw/device/silicon_creator/rom/e2e:empty_test_slot_a_sim_dv': target 'empty_test_slot_a_sim_dv' not declared in package 'sw/device/silicon_creator/rom/e2e' defined by /nightly/current_run/opentitan/sw/device/silicon_creator/rom/e2e/BUILD
ERROR: no such target '//sw/device/silicon_creator/rom/e2e:empty_test_slot_a_sim_dv': target 'empty_test_slot_a_sim_dv' not declared in package 'sw/device/silicon_creator/rom/e2e' defined by /nightly/current_run/opentitan/sw/device/silicon_creator/rom/e2e/BUILD
ERROR: Build did NOT complete successfully
_run_cmd -> had a non-zero return code of 1.
make: *** [/nightly/current_run/opentitan/hw/dv/tools/dvsim/sim.mk:58: sw_build] Error 1
rom_e2e_asm_init_dev 62740477331188343557112355135193823864974717935924985477896585707676193677877 None
---- STDERR ----
Another command (pid=510916) is running. Waiting for it to complete on the server (server_pid=209140)...
WARNING: Target pattern parsing failed.
ERROR: Skipping '//sw/device/silicon_creator/rom/e2e:empty_test_slot_a_sim_dv': no such target '//sw/device/silicon_creator/rom/e2e:empty_test_slot_a_sim_dv': target 'empty_test_slot_a_sim_dv' not declared in package 'sw/device/silicon_creator/rom/e2e' defined by /nightly/current_run/opentitan/sw/device/silicon_creator/rom/e2e/BUILD
ERROR: no such target '//sw/device/silicon_creator/rom/e2e:empty_test_slot_a_sim_dv': target 'empty_test_slot_a_sim_dv' not declared in package 'sw/device/silicon_creator/rom/e2e' defined by /nightly/current_run/opentitan/sw/device/silicon_creator/rom/e2e/BUILD
ERROR: Build did NOT complete successfully
_run_cmd -> had a non-zero return code of 1.
make: *** [/nightly/current_run/opentitan/hw/dv/tools/dvsim/sim.mk:58: sw_build] Error 1
rom_e2e_asm_init_prod 14171858833351789478951696728475759265857795315194733219833089382518878935526 None
Another command (pid=545067) is running. Waiting for it to complete on the server (server_pid=209140)...
Another command (pid=534573) is running. Waiting for it to complete on the server (server_pid=209140)...
Another command (pid=542632) is running. Waiting for it to complete on the server (server_pid=209140)...
WARNING: Target pattern parsing failed.
ERROR: Skipping '//sw/device/silicon_creator/rom/e2e:empty_test_slot_a_sim_dv': no such target '//sw/device/silicon_creator/rom/e2e:empty_test_slot_a_sim_dv': target 'empty_test_slot_a_sim_dv' not declared in package 'sw/device/silicon_creator/rom/e2e' defined by /nightly/current_run/opentitan/sw/device/silicon_creator/rom/e2e/BUILD
ERROR: no such target '//sw/device/silicon_creator/rom/e2e:empty_test_slot_a_sim_dv': target 'empty_test_slot_a_sim_dv' not declared in package 'sw/device/silicon_creator/rom/e2e' defined by /nightly/current_run/opentitan/sw/device/silicon_creator/rom/e2e/BUILD
ERROR: Build did NOT complete successfully
_run_cmd -> had a non-zero return code of 1.
make: *** [/nightly/current_run/opentitan/hw/dv/tools/dvsim/sim.mk:58: sw_build] Error 1
rom_e2e_asm_init_prod_end 22997635056625713925358373181129284630904937756880998397409375986601719677061 None
---- STDERR ----
Another command (pid=522716) is running. Waiting for it to complete on the server (server_pid=209140)...
Another command (pid=504020) is running. Waiting for it to complete on the server (server_pid=209140)...
WARNING: Target pattern parsing failed.
ERROR: Skipping '//sw/device/silicon_creator/rom/e2e:empty_test_slot_a_sim_dv': no such target '//sw/device/silicon_creator/rom/e2e:empty_test_slot_a_sim_dv': target 'empty_test_slot_a_sim_dv' not declared in package 'sw/device/silicon_creator/rom/e2e' defined by /nightly/current_run/opentitan/sw/device/silicon_creator/rom/e2e/BUILD
ERROR: no such target '//sw/device/silicon_creator/rom/e2e:empty_test_slot_a_sim_dv': target 'empty_test_slot_a_sim_dv' not declared in package 'sw/device/silicon_creator/rom/e2e' defined by /nightly/current_run/opentitan/sw/device/silicon_creator/rom/e2e/BUILD
ERROR: Build did NOT complete successfully
_run_cmd -> had a non-zero return code of 1.
make: *** [/nightly/current_run/opentitan/hw/dv/tools/dvsim/sim.mk:58: sw_build] Error 1
rom_e2e_asm_init_rma 82956161066484983149497932229055649769172560842574993043562666537833542517523 None
Another command (pid=504020) is running. Waiting for it to complete on the server (server_pid=209140)...
Another command (pid=525111) is running. Waiting for it to complete on the server (server_pid=209140)...
Another command (pid=338086) is running. Waiting for it to complete on the server (server_pid=209140)...
WARNING: Target pattern parsing failed.
ERROR: Skipping '//sw/device/silicon_creator/rom/e2e:empty_test_slot_a_sim_dv': no such target '//sw/device/silicon_creator/rom/e2e:empty_test_slot_a_sim_dv': target 'empty_test_slot_a_sim_dv' not declared in package 'sw/device/silicon_creator/rom/e2e' defined by /nightly/current_run/opentitan/sw/device/silicon_creator/rom/e2e/BUILD
ERROR: no such target '//sw/device/silicon_creator/rom/e2e:empty_test_slot_a_sim_dv': target 'empty_test_slot_a_sim_dv' not declared in package 'sw/device/silicon_creator/rom/e2e' defined by /nightly/current_run/opentitan/sw/device/silicon_creator/rom/e2e/BUILD
ERROR: Build did NOT complete successfully
_run_cmd -> had a non-zero return code of 1.
make: *** [/nightly/current_run/opentitan/hw/dv/tools/dvsim/sim.mk:58: sw_build] Error 1
rom_e2e_jtag_debug_test_unlocked0 87390059451893697435823961320601708291334133499411192486960121252993926508780 None
Another command (pid=605980) is running. Waiting for it to complete on the server (server_pid=209140)...
Another command (pid=610277) is running. Waiting for it to complete on the server (server_pid=209140)...
Another command (pid=600130) is running. Waiting for it to complete on the server (server_pid=209140)...
WARNING: Target pattern parsing failed.
ERROR: Skipping '//sw/device/silicon_creator/rom/e2e:img_test_unlocked0_exec_disabled': no such target '//sw/device/silicon_creator/rom/e2e:img_test_unlocked0_exec_disabled': target 'img_test_unlocked0_exec_disabled' not declared in package 'sw/device/silicon_creator/rom/e2e' defined by /nightly/current_run/opentitan/sw/device/silicon_creator/rom/e2e/BUILD
ERROR: no such target '//sw/device/silicon_creator/rom/e2e:img_test_unlocked0_exec_disabled': target 'img_test_unlocked0_exec_disabled' not declared in package 'sw/device/silicon_creator/rom/e2e' defined by /nightly/current_run/opentitan/sw/device/silicon_creator/rom/e2e/BUILD
ERROR: Build did NOT complete successfully
_run_cmd -> had a non-zero return code of 1.
make: *** [/nightly/current_run/opentitan/hw/dv/tools/dvsim/sim.mk:58: sw_build] Error 1
rom_e2e_jtag_debug_dev 5760933062957340493244521878265282058314237903694480874943709075088190193634 None
Another command (pid=578325) is running. Waiting for it to complete on the server (server_pid=209140)...
Another command (pid=577743) is running. Waiting for it to complete on the server (server_pid=209140)...
Another command (pid=582205) is running. Waiting for it to complete on the server (server_pid=209140)...
WARNING: Target pattern parsing failed.
ERROR: Skipping '//sw/device/silicon_creator/rom/e2e:img_dev_exec_disabled': no such target '//sw/device/silicon_creator/rom/e2e:img_dev_exec_disabled': target 'img_dev_exec_disabled' not declared in package 'sw/device/silicon_creator/rom/e2e' defined by /nightly/current_run/opentitan/sw/device/silicon_creator/rom/e2e/BUILD
ERROR: no such target '//sw/device/silicon_creator/rom/e2e:img_dev_exec_disabled': target 'img_dev_exec_disabled' not declared in package 'sw/device/silicon_creator/rom/e2e' defined by /nightly/current_run/opentitan/sw/device/silicon_creator/rom/e2e/BUILD
ERROR: Build did NOT complete successfully
_run_cmd -> had a non-zero return code of 1.
make: *** [/nightly/current_run/opentitan/hw/dv/tools/dvsim/sim.mk:58: sw_build] Error 1
rom_e2e_jtag_debug_rma 30031207228304034940893351391146820847564195660862673055807986207807583914697 None
Another command (pid=578576) is running. Waiting for it to complete on the server (server_pid=209140)...
Another command (pid=578325) is running. Waiting for it to complete on the server (server_pid=209140)...
Another command (pid=577743) is running. Waiting for it to complete on the server (server_pid=209140)...
WARNING: Target pattern parsing failed.
ERROR: Skipping '//sw/device/silicon_creator/rom/e2e:img_rma_exec_disabled': no such target '//sw/device/silicon_creator/rom/e2e:img_rma_exec_disabled': target 'img_rma_exec_disabled' not declared in package 'sw/device/silicon_creator/rom/e2e' defined by /nightly/current_run/opentitan/sw/device/silicon_creator/rom/e2e/BUILD
ERROR: no such target '//sw/device/silicon_creator/rom/e2e:img_rma_exec_disabled': target 'img_rma_exec_disabled' not declared in package 'sw/device/silicon_creator/rom/e2e' defined by /nightly/current_run/opentitan/sw/device/silicon_creator/rom/e2e/BUILD
ERROR: Build did NOT complete successfully
_run_cmd -> had a non-zero return code of 1.
make: *** [/nightly/current_run/opentitan/hw/dv/tools/dvsim/sim.mk:58: sw_build] Error 1
rom_e2e_jtag_inject_test_unlocked0 92581846225845451160121518557303480362257260642921467021321319381212020734007 None
Another command (pid=504020) is running. Waiting for it to complete on the server (server_pid=209140)...
Another command (pid=499433) is running. Waiting for it to complete on the server (server_pid=209140)...
Another command (pid=503100) is running. Waiting for it to complete on the server (server_pid=209140)...
WARNING: Target pattern parsing failed.
ERROR: Skipping '//sw/device/silicon_creator/rom/e2e:img_dev_exec_disabled': no such target '//sw/device/silicon_creator/rom/e2e:img_dev_exec_disabled': target 'img_dev_exec_disabled' not declared in package 'sw/device/silicon_creator/rom/e2e' defined by /nightly/current_run/opentitan/sw/device/silicon_creator/rom/e2e/BUILD
ERROR: no such target '//sw/device/silicon_creator/rom/e2e:img_dev_exec_disabled': target 'img_dev_exec_disabled' not declared in package 'sw/device/silicon_creator/rom/e2e' defined by /nightly/current_run/opentitan/sw/device/silicon_creator/rom/e2e/BUILD
ERROR: Build did NOT complete successfully
_run_cmd -> had a non-zero return code of 1.
make: *** [/nightly/current_run/opentitan/hw/dv/tools/dvsim/sim.mk:58: sw_build] Error 1
rom_e2e_jtag_inject_dev 103511151491670200904820148240137410898200186695347153256556354036705641199921 None
Another command (pid=528325) is running. Waiting for it to complete on the server (server_pid=209140)...
Another command (pid=523739) is running. Waiting for it to complete on the server (server_pid=209140)...
Another command (pid=482262) is running. Waiting for it to complete on the server (server_pid=209140)...
WARNING: Target pattern parsing failed.
ERROR: Skipping '//sw/device/silicon_creator/rom/e2e:img_dev_exec_disabled': no such target '//sw/device/silicon_creator/rom/e2e:img_dev_exec_disabled': target 'img_dev_exec_disabled' not declared in package 'sw/device/silicon_creator/rom/e2e' defined by /nightly/current_run/opentitan/sw/device/silicon_creator/rom/e2e/BUILD
ERROR: no such target '//sw/device/silicon_creator/rom/e2e:img_dev_exec_disabled': target 'img_dev_exec_disabled' not declared in package 'sw/device/silicon_creator/rom/e2e' defined by /nightly/current_run/opentitan/sw/device/silicon_creator/rom/e2e/BUILD
ERROR: Build did NOT complete successfully
_run_cmd -> had a non-zero return code of 1.
make: *** [/nightly/current_run/opentitan/hw/dv/tools/dvsim/sim.mk:58: sw_build] Error 1
rom_e2e_jtag_inject_rma 66341132275175407840893945037348666656289211196182117991492418042772724339789 None
Another command (pid=499745) is running. Waiting for it to complete on the server (server_pid=209140)...
Another command (pid=501418) is running. Waiting for it to complete on the server (server_pid=209140)...
Another command (pid=502728) is running. Waiting for it to complete on the server (server_pid=209140)...
WARNING: Target pattern parsing failed.
ERROR: Skipping '//sw/device/silicon_creator/rom/e2e:img_dev_exec_disabled': no such target '//sw/device/silicon_creator/rom/e2e:img_dev_exec_disabled': target 'img_dev_exec_disabled' not declared in package 'sw/device/silicon_creator/rom/e2e' defined by /nightly/current_run/opentitan/sw/device/silicon_creator/rom/e2e/BUILD
ERROR: no such target '//sw/device/silicon_creator/rom/e2e:img_dev_exec_disabled': target 'img_dev_exec_disabled' not declared in package 'sw/device/silicon_creator/rom/e2e' defined by /nightly/current_run/opentitan/sw/device/silicon_creator/rom/e2e/BUILD
ERROR: Build did NOT complete successfully
_run_cmd -> had a non-zero return code of 1.
make: *** [/nightly/current_run/opentitan/hw/dv/tools/dvsim/sim.mk:58: sw_build] Error 1
rom_e2e_static_critical 34632801412588002330655808228967562113750479209761641939290266664755770073196 None
---- STDERR ----
Another command (pid=626917) is running. Waiting for it to complete on the server (server_pid=209140)...
Another command (pid=631749) is running. Waiting for it to complete on the server (server_pid=209140)...
WARNING: Target pattern parsing failed.
ERROR: Skipping '//sw/device/silicon_creator/rom:rom_with_fake_keys_sim_dv': no such target '//sw/device/silicon_creator/rom:rom_with_fake_keys_sim_dv': target 'rom_with_fake_keys_sim_dv' not declared in package 'sw/device/silicon_creator/rom' defined by /nightly/current_run/opentitan/sw/device/silicon_creator/rom/BUILD
ERROR: no such target '//sw/device/silicon_creator/rom:rom_with_fake_keys_sim_dv': target 'rom_with_fake_keys_sim_dv' not declared in package 'sw/device/silicon_creator/rom' defined by /nightly/current_run/opentitan/sw/device/silicon_creator/rom/BUILD
ERROR: Build did NOT complete successfully
_run_cmd -> had a non-zero return code of 1.
make: *** [/nightly/current_run/opentitan/hw/dv/tools/dvsim/sim.mk:58: sw_build] Error 1
rom_e2e_keymgr_dpe_init_rom_ext_meas 99220736952002119698843767257132744791640524018036001513950713629954011876718 None
Another command (pid=569008) is running. Waiting for it to complete on the server (server_pid=209140)...
Another command (pid=570055) is running. Waiting for it to complete on the server (server_pid=209140)...
Another command (pid=565420) is running. Waiting for it to complete on the server (server_pid=209140)...
WARNING: Target pattern parsing failed.
ERROR: Skipping '//sw/device/silicon_creator/rom/e2e:rom_e2e_keymgr_dpe_init_test_sim_dv': no such target '//sw/device/silicon_creator/rom/e2e:rom_e2e_keymgr_dpe_init_test_sim_dv': target 'rom_e2e_keymgr_dpe_init_test_sim_dv' not declared in package 'sw/device/silicon_creator/rom/e2e' defined by /nightly/current_run/opentitan/sw/device/silicon_creator/rom/e2e/BUILD
ERROR: no such target '//sw/device/silicon_creator/rom/e2e:rom_e2e_keymgr_dpe_init_test_sim_dv': target 'rom_e2e_keymgr_dpe_init_test_sim_dv' not declared in package 'sw/device/silicon_creator/rom/e2e' defined by /nightly/current_run/opentitan/sw/device/silicon_creator/rom/e2e/BUILD
ERROR: Build did NOT complete successfully
_run_cmd -> had a non-zero return code of 1.
make: *** [/nightly/current_run/opentitan/hw/dv/tools/dvsim/sim.mk:58: sw_build] Error 1
rom_e2e_keymgr_dpe_init_rom_ext_no_meas 81792962703842959603074204641044326891968963944828224607794100918258425064391 None
Another command (pid=576794) is running. Waiting for it to complete on the server (server_pid=209140)...
Another command (pid=578576) is running. Waiting for it to complete on the server (server_pid=209140)...
Another command (pid=578325) is running. Waiting for it to complete on the server (server_pid=209140)...
WARNING: Target pattern parsing failed.
ERROR: Skipping '//sw/device/silicon_creator/rom/e2e:rom_e2e_keymgr_dpe_init_test_sim_dv': no such target '//sw/device/silicon_creator/rom/e2e:rom_e2e_keymgr_dpe_init_test_sim_dv': target 'rom_e2e_keymgr_dpe_init_test_sim_dv' not declared in package 'sw/device/silicon_creator/rom/e2e' defined by /nightly/current_run/opentitan/sw/device/silicon_creator/rom/e2e/BUILD
ERROR: no such target '//sw/device/silicon_creator/rom/e2e:rom_e2e_keymgr_dpe_init_test_sim_dv': target 'rom_e2e_keymgr_dpe_init_test_sim_dv' not declared in package 'sw/device/silicon_creator/rom/e2e' defined by /nightly/current_run/opentitan/sw/device/silicon_creator/rom/e2e/BUILD
ERROR: Build did NOT complete successfully
_run_cmd -> had a non-zero return code of 1.
make: *** [/nightly/current_run/opentitan/hw/dv/tools/dvsim/sim.mk:58: sw_build] Error 1
rom_e2e_keymgr_dpe_init_rom_ext_invalid_meas 110304590386324158139821074228137775855196843874664818285231165416061674618003 None
Another command (pid=578325) is running. Waiting for it to complete on the server (server_pid=209140)...
Another command (pid=572394) is running. Waiting for it to complete on the server (server_pid=209140)...
Another command (pid=572989) is running. Waiting for it to complete on the server (server_pid=209140)...
WARNING: Target pattern parsing failed.
ERROR: Skipping '//sw/device/silicon_creator/rom/e2e:rom_e2e_keymgr_dpe_init_test_sim_dv': no such target '//sw/device/silicon_creator/rom/e2e:rom_e2e_keymgr_dpe_init_test_sim_dv': target 'rom_e2e_keymgr_dpe_init_test_sim_dv' not declared in package 'sw/device/silicon_creator/rom/e2e' defined by /nightly/current_run/opentitan/sw/device/silicon_creator/rom/e2e/BUILD
ERROR: no such target '//sw/device/silicon_creator/rom/e2e:rom_e2e_keymgr_dpe_init_test_sim_dv': target 'rom_e2e_keymgr_dpe_init_test_sim_dv' not declared in package 'sw/device/silicon_creator/rom/e2e' defined by /nightly/current_run/opentitan/sw/device/silicon_creator/rom/e2e/BUILD
ERROR: Build did NOT complete successfully
_run_cmd -> had a non-zero return code of 1.
make: *** [/nightly/current_run/opentitan/hw/dv/tools/dvsim/sim.mk:58: sw_build] Error 1
rom_e2e_sigverify_mod_exp_test_unlocked0_otbn 29667794185671624605314680832448693838412978585021319046602738934240047339258 None
---- STDERR ----
Another command (pid=319242) is running. Waiting for it to complete on the server (server_pid=209140)...
WARNING: Target pattern parsing failed.
ERROR: Skipping '//sw/device/silicon_creator/rom/e2e:empty_test_sigverify_mod_exp_sim_dv': no such target '//sw/device/silicon_creator/rom/e2e:empty_test_sigverify_mod_exp_sim_dv': target 'empty_test_sigverify_mod_exp_sim_dv' not declared in package 'sw/device/silicon_creator/rom/e2e' defined by /nightly/current_run/opentitan/sw/device/silicon_creator/rom/e2e/BUILD
ERROR: no such target '//sw/device/silicon_creator/rom/e2e:empty_test_sigverify_mod_exp_sim_dv': target 'empty_test_sigverify_mod_exp_sim_dv' not declared in package 'sw/device/silicon_creator/rom/e2e' defined by /nightly/current_run/opentitan/sw/device/silicon_creator/rom/e2e/BUILD
ERROR: Build did NOT complete successfully
_run_cmd -> had a non-zero return code of 1.
make: *** [/nightly/current_run/opentitan/hw/dv/tools/dvsim/sim.mk:58: sw_build] Error 1
rom_e2e_sigverify_mod_exp_test_unlocked0_sw 64139101153696713779676918725135772098465510284115883284309537425550440340574 None
Another command (pid=319242) is running. Waiting for it to complete on the server (server_pid=209140)...
Another command (pid=356731) is running. Waiting for it to complete on the server (server_pid=209140)...
Another command (pid=327000) is running. Waiting for it to complete on the server (server_pid=209140)...
WARNING: Target pattern parsing failed.
ERROR: Skipping '//sw/device/silicon_creator/rom/e2e:empty_test_sigverify_mod_exp_sim_dv': no such target '//sw/device/silicon_creator/rom/e2e:empty_test_sigverify_mod_exp_sim_dv': target 'empty_test_sigverify_mod_exp_sim_dv' not declared in package 'sw/device/silicon_creator/rom/e2e' defined by /nightly/current_run/opentitan/sw/device/silicon_creator/rom/e2e/BUILD
ERROR: no such target '//sw/device/silicon_creator/rom/e2e:empty_test_sigverify_mod_exp_sim_dv': target 'empty_test_sigverify_mod_exp_sim_dv' not declared in package 'sw/device/silicon_creator/rom/e2e' defined by /nightly/current_run/opentitan/sw/device/silicon_creator/rom/e2e/BUILD
ERROR: Build did NOT complete successfully
_run_cmd -> had a non-zero return code of 1.
make: *** [/nightly/current_run/opentitan/hw/dv/tools/dvsim/sim.mk:58: sw_build] Error 1
rom_e2e_sigverify_mod_exp_dev_otbn 5989777416519349495395467459187631587866960468849540940205810387151837151134 None
Another command (pid=610277) is running. Waiting for it to complete on the server (server_pid=209140)...
Another command (pid=611663) is running. Waiting for it to complete on the server (server_pid=209140)...
Another command (pid=608508) is running. Waiting for it to complete on the server (server_pid=209140)...
WARNING: Target pattern parsing failed.
ERROR: Skipping '//sw/device/silicon_creator/rom/e2e:empty_test_sigverify_mod_exp_sim_dv': no such target '//sw/device/silicon_creator/rom/e2e:empty_test_sigverify_mod_exp_sim_dv': target 'empty_test_sigverify_mod_exp_sim_dv' not declared in package 'sw/device/silicon_creator/rom/e2e' defined by /nightly/current_run/opentitan/sw/device/silicon_creator/rom/e2e/BUILD
ERROR: no such target '//sw/device/silicon_creator/rom/e2e:empty_test_sigverify_mod_exp_sim_dv': target 'empty_test_sigverify_mod_exp_sim_dv' not declared in package 'sw/device/silicon_creator/rom/e2e' defined by /nightly/current_run/opentitan/sw/device/silicon_creator/rom/e2e/BUILD
ERROR: Build did NOT complete successfully
_run_cmd -> had a non-zero return code of 1.
make: *** [/nightly/current_run/opentitan/hw/dv/tools/dvsim/sim.mk:58: sw_build] Error 1
rom_e2e_sigverify_mod_exp_dev_sw 44646016216420498208101577504502015397583560617502304113830402166961212948158 None
Another command (pid=628113) is running. Waiting for it to complete on the server (server_pid=209140)...
Another command (pid=620762) is running. Waiting for it to complete on the server (server_pid=209140)...
Another command (pid=613534) is running. Waiting for it to complete on the server (server_pid=209140)...
WARNING: Target pattern parsing failed.
ERROR: Skipping '//sw/device/silicon_creator/rom/e2e:empty_test_sigverify_mod_exp_sim_dv': no such target '//sw/device/silicon_creator/rom/e2e:empty_test_sigverify_mod_exp_sim_dv': target 'empty_test_sigverify_mod_exp_sim_dv' not declared in package 'sw/device/silicon_creator/rom/e2e' defined by /nightly/current_run/opentitan/sw/device/silicon_creator/rom/e2e/BUILD
ERROR: no such target '//sw/device/silicon_creator/rom/e2e:empty_test_sigverify_mod_exp_sim_dv': target 'empty_test_sigverify_mod_exp_sim_dv' not declared in package 'sw/device/silicon_creator/rom/e2e' defined by /nightly/current_run/opentitan/sw/device/silicon_creator/rom/e2e/BUILD
ERROR: Build did NOT complete successfully
_run_cmd -> had a non-zero return code of 1.
make: *** [/nightly/current_run/opentitan/hw/dv/tools/dvsim/sim.mk:58: sw_build] Error 1
rom_e2e_sigverify_mod_exp_prod_otbn 110995677500579218000892856446724731238337521929905825663481093523248029151945 None
Another command (pid=622404) is running. Waiting for it to complete on the server (server_pid=209140)...
Another command (pid=626816) is running. Waiting for it to complete on the server (server_pid=209140)...
Another command (pid=617455) is running. Waiting for it to complete on the server (server_pid=209140)...
WARNING: Target pattern parsing failed.
ERROR: Skipping '//sw/device/silicon_creator/rom/e2e:empty_test_sigverify_mod_exp_sim_dv': no such target '//sw/device/silicon_creator/rom/e2e:empty_test_sigverify_mod_exp_sim_dv': target 'empty_test_sigverify_mod_exp_sim_dv' not declared in package 'sw/device/silicon_creator/rom/e2e' defined by /nightly/current_run/opentitan/sw/device/silicon_creator/rom/e2e/BUILD
ERROR: no such target '//sw/device/silicon_creator/rom/e2e:empty_test_sigverify_mod_exp_sim_dv': target 'empty_test_sigverify_mod_exp_sim_dv' not declared in package 'sw/device/silicon_creator/rom/e2e' defined by /nightly/current_run/opentitan/sw/device/silicon_creator/rom/e2e/BUILD
ERROR: Build did NOT complete successfully
_run_cmd -> had a non-zero return code of 1.
make: *** [/nightly/current_run/opentitan/hw/dv/tools/dvsim/sim.mk:58: sw_build] Error 1
rom_e2e_sigverify_mod_exp_prod_sw 48169388836908326176937476302156455769420621758056588430711014292475405099144 None
Another command (pid=612215) is running. Waiting for it to complete on the server (server_pid=209140)...
Another command (pid=631749) is running. Waiting for it to complete on the server (server_pid=209140)...
Another command (pid=635507) is running. Waiting for it to complete on the server (server_pid=209140)...
WARNING: Target pattern parsing failed.
ERROR: Skipping '//sw/device/silicon_creator/rom/e2e:empty_test_sigverify_mod_exp_sim_dv': no such target '//sw/device/silicon_creator/rom/e2e:empty_test_sigverify_mod_exp_sim_dv': target 'empty_test_sigverify_mod_exp_sim_dv' not declared in package 'sw/device/silicon_creator/rom/e2e' defined by /nightly/current_run/opentitan/sw/device/silicon_creator/rom/e2e/BUILD
ERROR: no such target '//sw/device/silicon_creator/rom/e2e:empty_test_sigverify_mod_exp_sim_dv': target 'empty_test_sigverify_mod_exp_sim_dv' not declared in package 'sw/device/silicon_creator/rom/e2e' defined by /nightly/current_run/opentitan/sw/device/silicon_creator/rom/e2e/BUILD
ERROR: Build did NOT complete successfully
_run_cmd -> had a non-zero return code of 1.
make: *** [/nightly/current_run/opentitan/hw/dv/tools/dvsim/sim.mk:58: sw_build] Error 1
rom_e2e_sigverify_mod_exp_prod_end_otbn 11638006259754498799899981461196199032799184930042535280301294486855274902212 None
---- STDERR ----
Another command (pid=611663) is running. Waiting for it to complete on the server (server_pid=209140)...
WARNING: Target pattern parsing failed.
ERROR: Skipping '//sw/device/silicon_creator/rom/e2e:empty_test_sigverify_mod_exp_sim_dv': no such target '//sw/device/silicon_creator/rom/e2e:empty_test_sigverify_mod_exp_sim_dv': target 'empty_test_sigverify_mod_exp_sim_dv' not declared in package 'sw/device/silicon_creator/rom/e2e' defined by /nightly/current_run/opentitan/sw/device/silicon_creator/rom/e2e/BUILD
ERROR: no such target '//sw/device/silicon_creator/rom/e2e:empty_test_sigverify_mod_exp_sim_dv': target 'empty_test_sigverify_mod_exp_sim_dv' not declared in package 'sw/device/silicon_creator/rom/e2e' defined by /nightly/current_run/opentitan/sw/device/silicon_creator/rom/e2e/BUILD
ERROR: Build did NOT complete successfully
_run_cmd -> had a non-zero return code of 1.
make: *** [/nightly/current_run/opentitan/hw/dv/tools/dvsim/sim.mk:58: sw_build] Error 1
rom_e2e_sigverify_mod_exp_prod_end_sw 13743179389205621437197734869799507782399572710524697252151902765573389321687 None
Another command (pid=581403) is running. Waiting for it to complete on the server (server_pid=209140)...
Another command (pid=619827) is running. Waiting for it to complete on the server (server_pid=209140)...
Another command (pid=622404) is running. Waiting for it to complete on the server (server_pid=209140)...
WARNING: Target pattern parsing failed.
ERROR: Skipping '//sw/device/silicon_creator/rom/e2e:empty_test_sigverify_mod_exp_sim_dv': no such target '//sw/device/silicon_creator/rom/e2e:empty_test_sigverify_mod_exp_sim_dv': target 'empty_test_sigverify_mod_exp_sim_dv' not declared in package 'sw/device/silicon_creator/rom/e2e' defined by /nightly/current_run/opentitan/sw/device/silicon_creator/rom/e2e/BUILD
ERROR: no such target '//sw/device/silicon_creator/rom/e2e:empty_test_sigverify_mod_exp_sim_dv': target 'empty_test_sigverify_mod_exp_sim_dv' not declared in package 'sw/device/silicon_creator/rom/e2e' defined by /nightly/current_run/opentitan/sw/device/silicon_creator/rom/e2e/BUILD
ERROR: Build did NOT complete successfully
_run_cmd -> had a non-zero return code of 1.
make: *** [/nightly/current_run/opentitan/hw/dv/tools/dvsim/sim.mk:58: sw_build] Error 1
rom_e2e_sigverify_mod_exp_rma_otbn 27454872742864824269773405463631972792816327059540315693642097635601979243132 None
Another command (pid=617455) is running. Waiting for it to complete on the server (server_pid=209140)...
Another command (pid=628113) is running. Waiting for it to complete on the server (server_pid=209140)...
Another command (pid=620762) is running. Waiting for it to complete on the server (server_pid=209140)...
WARNING: Target pattern parsing failed.
ERROR: Skipping '//sw/device/silicon_creator/rom/e2e:empty_test_sigverify_mod_exp_sim_dv': no such target '//sw/device/silicon_creator/rom/e2e:empty_test_sigverify_mod_exp_sim_dv': target 'empty_test_sigverify_mod_exp_sim_dv' not declared in package 'sw/device/silicon_creator/rom/e2e' defined by /nightly/current_run/opentitan/sw/device/silicon_creator/rom/e2e/BUILD
ERROR: no such target '//sw/device/silicon_creator/rom/e2e:empty_test_sigverify_mod_exp_sim_dv': target 'empty_test_sigverify_mod_exp_sim_dv' not declared in package 'sw/device/silicon_creator/rom/e2e' defined by /nightly/current_run/opentitan/sw/device/silicon_creator/rom/e2e/BUILD
ERROR: Build did NOT complete successfully
_run_cmd -> had a non-zero return code of 1.
make: *** [/nightly/current_run/opentitan/hw/dv/tools/dvsim/sim.mk:58: sw_build] Error 1
rom_e2e_sigverify_mod_exp_rma_sw 3879796880648275927727800674622914844310982432056026401731279387615312184557 None
---- STDERR ----
Another command (pid=622404) is running. Waiting for it to complete on the server (server_pid=209140)...
WARNING: Target pattern parsing failed.
ERROR: Skipping '//sw/device/silicon_creator/rom/e2e:empty_test_sigverify_mod_exp_sim_dv': no such target '//sw/device/silicon_creator/rom/e2e:empty_test_sigverify_mod_exp_sim_dv': target 'empty_test_sigverify_mod_exp_sim_dv' not declared in package 'sw/device/silicon_creator/rom/e2e' defined by /nightly/current_run/opentitan/sw/device/silicon_creator/rom/e2e/BUILD
ERROR: no such target '//sw/device/silicon_creator/rom/e2e:empty_test_sigverify_mod_exp_sim_dv': target 'empty_test_sigverify_mod_exp_sim_dv' not declared in package 'sw/device/silicon_creator/rom/e2e' defined by /nightly/current_run/opentitan/sw/device/silicon_creator/rom/e2e/BUILD
ERROR: Build did NOT complete successfully
_run_cmd -> had a non-zero return code of 1.
make: *** [/nightly/current_run/opentitan/hw/dv/tools/dvsim/sim.mk:58: sw_build] Error 1
rom_volatile_raw_unlock 62280102519310754524961934582985185308395763320226175244592789498269150853082 None
Another command (pid=502298) is running. Waiting for it to complete on the server (server_pid=209140)...
Another command (pid=500694) is running. Waiting for it to complete on the server (server_pid=209140)...
Another command (pid=499745) is running. Waiting for it to complete on the server (server_pid=209140)...
WARNING: Target pattern parsing failed.
ERROR: Skipping '//sw/device/silicon_creator/rom/e2e:empty_test_slot_a_sim_dv': no such target '//sw/device/silicon_creator/rom/e2e:empty_test_slot_a_sim_dv': target 'empty_test_slot_a_sim_dv' not declared in package 'sw/device/silicon_creator/rom/e2e' defined by /nightly/current_run/opentitan/sw/device/silicon_creator/rom/e2e/BUILD
ERROR: no such target '//sw/device/silicon_creator/rom/e2e:empty_test_slot_a_sim_dv': target 'empty_test_slot_a_sim_dv' not declared in package 'sw/device/silicon_creator/rom/e2e' defined by /nightly/current_run/opentitan/sw/device/silicon_creator/rom/e2e/BUILD
ERROR: Build did NOT complete successfully
_run_cmd -> had a non-zero return code of 1.
make: *** [/nightly/current_run/opentitan/hw/dv/tools/dvsim/sim.mk:58: sw_build] Error 1
rom_raw_unlock 96446951234729126269235010975008526784590990579339898977173835538628285651843 None
Another command (pid=381901) is running. Waiting for it to complete on the server (server_pid=209140)...
Another command (pid=385791) is running. Waiting for it to complete on the server (server_pid=209140)...
Another command (pid=387376) is running. Waiting for it to complete on the server (server_pid=209140)...
WARNING: Target pattern parsing failed.
ERROR: Skipping '//sw/device/silicon_creator/rom/e2e:empty_test_slot_a_sim_dv': no such target '//sw/device/silicon_creator/rom/e2e:empty_test_slot_a_sim_dv': target 'empty_test_slot_a_sim_dv' not declared in package 'sw/device/silicon_creator/rom/e2e' defined by /nightly/current_run/opentitan/sw/device/silicon_creator/rom/e2e/BUILD
ERROR: no such target '//sw/device/silicon_creator/rom/e2e:empty_test_slot_a_sim_dv': target 'empty_test_slot_a_sim_dv' not declared in package 'sw/device/silicon_creator/rom/e2e' defined by /nightly/current_run/opentitan/sw/device/silicon_creator/rom/e2e/BUILD
ERROR: Build did NOT complete successfully
_run_cmd -> had a non-zero return code of 1.
make: *** [/nightly/current_run/opentitan/hw/dv/tools/dvsim/sim.mk:58: sw_build] Error 1
rom_e2e_self_hash 14586545487033624588964535997973915171129457368683422902579649027555829276521 None
Another command (pid=545067) is running. Waiting for it to complete on the server (server_pid=209140)...
Another command (pid=534573) is running. Waiting for it to complete on the server (server_pid=209140)...
Another command (pid=529383) is running. Waiting for it to complete on the server (server_pid=209140)...
WARNING: Target pattern parsing failed.
ERROR: Skipping '//sw/device/silicon_creator/rom/e2e:otp_img_sigverify_mod_exp_rma_otbn': no such target '//sw/device/silicon_creator/rom/e2e:otp_img_sigverify_mod_exp_rma_otbn': target 'otp_img_sigverify_mod_exp_rma_otbn' not declared in package 'sw/device/silicon_creator/rom/e2e' defined by /nightly/current_run/opentitan/sw/device/silicon_creator/rom/e2e/BUILD
ERROR: no such target '//sw/device/silicon_creator/rom/e2e:otp_img_sigverify_mod_exp_rma_otbn': target 'otp_img_sigverify_mod_exp_rma_otbn' not declared in package 'sw/device/silicon_creator/rom/e2e' defined by /nightly/current_run/opentitan/sw/device/silicon_creator/rom/e2e/BUILD
ERROR: Build did NOT complete successfully
_run_cmd -> had a non-zero return code of 1.
make: *** [/nightly/current_run/opentitan/hw/dv/tools/dvsim/sim.mk:58: sw_build] Error 1
chip_sw_uart_smoketest_signed 103874843681015392622371309974966564314882438672704907524922322683899492050155 None
Another command (pid=558716) is running. Waiting for it to complete on the server (server_pid=209140)...
Another command (pid=559645) is running. Waiting for it to complete on the server (server_pid=209140)...
Another command (pid=561206) is running. Waiting for it to complete on the server (server_pid=209140)...
WARNING: Target pattern parsing failed.
ERROR: Skipping '//sw/device/tests:uart_smoketest_signed_sim_dv': no such target '//sw/device/tests:uart_smoketest_signed_sim_dv': target 'uart_smoketest_signed_sim_dv' not declared in package 'sw/device/tests' defined by /nightly/current_run/opentitan/sw/device/tests/BUILD
ERROR: no such target '//sw/device/tests:uart_smoketest_signed_sim_dv': target 'uart_smoketest_signed_sim_dv' not declared in package 'sw/device/tests' defined by /nightly/current_run/opentitan/sw/device/tests/BUILD
ERROR: Build did NOT complete successfully
_run_cmd -> had a non-zero return code of 1.
make: *** [/nightly/current_run/opentitan/hw/dv/tools/dvsim/sim.mk:58: sw_build] Error 1
rom_keymgr_dpe_functest 50587473776849538510001146065646975722859241774762429389435138364093957410364 None
Use --verbose_failures to see the command lines of failed build steps.
ERROR: Analysis of target '//sw/device/silicon_creator/lib/drivers:keymgr_dpe_functest_sim_dv' failed; build aborted: Target //sw/device/silicon_creator/lib/drivers:keymgr_dpe_functest_sim_dv is incompatible and cannot be built, but was explicitly requested.
Dependency chain:
//sw/device/silicon_creator/lib/drivers:keymgr_dpe_functest_sim_dv (f2055d) <-- target platform (//toolchain:opentitan_platform) didn't satisfy constraint @@platforms//:incompatible
INFO: Elapsed time: 0.382s, Critical Path: 0.03s
INFO: 1 process: 1 internal.
ERROR: Build did NOT complete successfully
_run_cmd -> had a non-zero return code of 1.
make: *** [/nightly/current_run/opentitan/hw/dv/tools/dvsim/sim.mk:58: sw_build] Error 1
UVM_FATAL @ * us: (dv_utils_pkg.sv:253) [dv_utils_pkg::sw_symbol_get_addr_size.unnamed$$_*] Check failed (ret) Failed to read line from "kJitterEnabled.dat" 10 test runs
chip_sw_otbn_ecdsa_op_irq_jitter_en 34644159610628259489595768094825426649045804493959609601676985527983431286195 319
UVM_INFO @ 10.380001 us: (uvm_report_catcher.svh:705) [UVM/REPORT/CATCHER]
--- UVM Report catcher Summary ---
chip_sw_aes_enc_jitter_en 19268443463684171597965196455011854789123276130431280907261048134212456443243 319
UVM_INFO @ 10.400001 us: (uvm_report_catcher.svh:705) [UVM/REPORT/CATCHER]
--- UVM Report catcher Summary ---
chip_sw_hmac_enc_jitter_en 66352676618723056422912695393890884755219028825738648012442360397751431871158 319
UVM_INFO @ 10.360001 us: (uvm_report_catcher.svh:705) [UVM/REPORT/CATCHER]
--- UVM Report catcher Summary ---
chip_sw_kmac_mode_kmac_jitter_en 19761675896835236721611092393327828703447027954735148521320277503147861170447 319
UVM_INFO @ 10.360001 us: (uvm_report_catcher.svh:705) [UVM/REPORT/CATCHER]
--- UVM Report catcher Summary ---
chip_sw_otbn_ecdsa_op_irq_jitter_en_reduced_freq 30346885811820969268836030287368765271931654325519517652226789878654497003526 319
UVM_INFO @ 10.380001 us: (uvm_report_catcher.svh:705) [UVM/REPORT/CATCHER]
--- UVM Report catcher Summary ---
chip_sw_aes_enc_jitter_en_reduced_freq 22508781796196515761815457767782866816301153928201529992232262892629004259393 319
UVM_INFO @ 10.140001 us: (uvm_report_catcher.svh:705) [UVM/REPORT/CATCHER]
--- UVM Report catcher Summary ---
chip_sw_hmac_enc_jitter_en_reduced_freq 73770469044270668180143276549387929417160791163945308998288185213259542931746 319
UVM_INFO @ 10.320001 us: (uvm_report_catcher.svh:705) [UVM/REPORT/CATCHER]
--- UVM Report catcher Summary ---
chip_sw_kmac_mode_kmac_jitter_en_reduced_freq 102582234608756495223659972927511074051502547605968478708530001988460875497583 319
UVM_INFO @ 10.140001 us: (uvm_report_catcher.svh:705) [UVM/REPORT/CATCHER]
--- UVM Report catcher Summary ---
chip_sw_sram_ctrl_scrambled_access_jitter_en_reduced_freq 29621560360426032639717228651608572747011308124394196669061752582571926430100 319
UVM_INFO @ 10.180001 us: (uvm_report_catcher.svh:705) [UVM/REPORT/CATCHER]
--- UVM Report catcher Summary ---
chip_sw_csrng_edn_concurrency_reduced_freq 106256642492747286704369382644889886061459295739018002257846004407444698364544 319
UVM_INFO @ 10.320001 us: (uvm_report_catcher.svh:705) [UVM/REPORT/CATCHER]
--- UVM Report catcher Summary ---
Offending '((!rstreqs[*]) && (reset_cause != HwReq))' 5 test runs
chip_sw_rstmgr_cpu_info 115427436960307777800537106872474610381336381432316205222991250247007081290602 353
UVM_ERROR @ 412.096000 us: (pwrmgr_rstreqs_sva_if.sv:55) [ASSERT FAILED] HwResetOff_A
UVM_INFO @ 412.096000 us: (uvm_report_catcher.svh:705) [UVM/REPORT/CATCHER]
--- UVM Report catcher Summary ---
chip_sw_clkmgr_off_aes_trans 64997397432203674772569521850191847878893735982716457557949423285857804996641 330
UVM_ERROR @ 185.280000 us: (pwrmgr_rstreqs_sva_if.sv:55) [ASSERT FAILED] HwResetOff_A
UVM_INFO @ 185.280000 us: (uvm_report_catcher.svh:705) [UVM/REPORT/CATCHER]
--- UVM Report catcher Summary ---
chip_sw_clkmgr_off_hmac_trans 115513987235037100380222685836621917691786622287912929562124449200693717814019 330
UVM_ERROR @ 185.280000 us: (pwrmgr_rstreqs_sva_if.sv:55) [ASSERT FAILED] HwResetOff_A
UVM_INFO @ 185.280000 us: (uvm_report_catcher.svh:705) [UVM/REPORT/CATCHER]
--- UVM Report catcher Summary ---
chip_sw_clkmgr_off_kmac_trans 94356352816681568923416376151794812614773201515468371109505251116180803922952 330
UVM_ERROR @ 185.392000 us: (pwrmgr_rstreqs_sva_if.sv:55) [ASSERT FAILED] HwResetOff_A
UVM_INFO @ 185.392000 us: (uvm_report_catcher.svh:705) [UVM/REPORT/CATCHER]
--- UVM Report catcher Summary ---
chip_sw_clkmgr_off_otbn_trans 25898531916961978253612466040084330214401243971626602775628969724148179730789 330
UVM_ERROR @ 185.360000 us: (pwrmgr_rstreqs_sva_if.sv:55) [ASSERT FAILED] HwResetOff_A
UVM_INFO @ 185.360000 us: (uvm_report_catcher.svh:705) [UVM/REPORT/CATCHER]
--- UVM Report catcher Summary ---
UVM_FATAL @ * us: (mem_bkdr_util.sv:658) [mem_bkdr_util[Otp]] file otp_ctrl_img_rma.vmem could not be opened for r mode 3 test runs
chip_csr_bit_bash 83251298725639694626587212106146595299497149564885487440208591097488288116049 143
UVM_INFO @ 0.000000 us: (uvm_report_catcher.svh:705) [UVM/REPORT/CATCHER]
--- UVM Report catcher Summary ---
chip_csr_aliasing 95333695260188617680031538370803419235375059381253143946387109584696229266027 143
UVM_INFO @ 0.000000 us: (uvm_report_catcher.svh:705) [UVM/REPORT/CATCHER]
--- UVM Report catcher Summary ---
chip_same_csr_outstanding 99808551454587025924006221062643212290501889970327164098760033403025768825495 143
UVM_INFO @ 0.000000 us: (uvm_report_catcher.svh:705) [UVM/REPORT/CATCHER]
--- UVM Report catcher Summary ---
UVM_ERROR @ * us: (jtag_riscv_driver.sv:221) [jtag_riscv_agent_pkg] Check failed sbcs_val[SbAccess32] == * (* [*] vs * [*]) expect SBA width to be * bits! 2 test runs
chip_jtag_csr_rw 37924471064360614983077544362459742089317661688489460896835833228724925399676 5963
UVM_INFO @ 131.615000 us: (uvm_report_catcher.svh:705) [UVM/REPORT/CATCHER]
--- UVM Report catcher Summary ---
chip_jtag_mem_access 34609726001447964374446965563638783779587970183081650632378443228853597050565 5963
UVM_INFO @ 132.542000 us: (uvm_report_catcher.svh:705) [UVM/REPORT/CATCHER]
--- UVM Report catcher Summary ---
UVM_FATAL @ * us: (mem_bkdr_util.sv:658) [mem_bkdr_util[Rom0]] file example_test_from_rom_rom_prog_sim_dv.*.scr.vmem could not be opened for r mode 1 test run
chip_sw_example_rom 107584356909750786106624673757828378543184273303889157245668107727222920689358 291
UVM_INFO @ 10.240001 us: (uvm_report_catcher.svh:705) [UVM/REPORT/CATCHER]
--- UVM Report catcher Summary ---
UVM_ERROR @ * us: (sw_logger_if.sv:526) [all_escalation_resets_test_sim_dv(sw/device/lib/testing/alert_handler_testutils.c:78)] CHECK-fail: word_index < dump_size 1 test run
chip_sw_all_escalation_resets 79272188059409572070402751160965850431330678661469559904809320326849675031572 359
UVM_INFO @ 943.433000 us: (uvm_report_catcher.svh:705) [UVM/REPORT/CATCHER]
--- UVM Report catcher Summary ---
UVM_FATAL @ * us: (sec_cm_pkg.sv:48) [sec_cm_pkg::find_sec_cm_if_proxy] no proxy with path *rstmgr.u_d0_spi_host*.leaf_rst_path 1 test run
chip_sw_rstmgr_rst_cnsty_escalation 3842580704945495220371881861445842213119537233749453073755471884760487455979 320
UVM_INFO @ 10.300001 us: (uvm_report_catcher.svh:705) [UVM/REPORT/CATCHER]
--- UVM Report catcher Summary ---
UVM_ERROR @ * us: (sw_logger_if.sv:526) [spi_passthrough_test_sim_dv(sw/device/tests/sim_dv/spi_passthrough_test.c:382)] CHECK-fail: irq == kDtSpiDeviceIrqUploadCmdfifoNotEmpty 1 test run
chip_sw_spi_device_pass_through_collision 25492833839152071547910696753743306964515828225169811105981395139150172658645 341
UVM_INFO @ 273.046000 us: (uvm_report_catcher.svh:705) [UVM/REPORT/CATCHER]
--- UVM Report catcher Summary ---
Offending '(!$fell(lc_ctrl_pkg::lc_tx_test_true_strict(lc_init_done_o)))' 1 test run
chip_sw_otp_ctrl_escalation 22435191368433304299697465531818385400765966882966055142934251103405896002235 335
UVM_ERROR @ 176.940000 us: (lc_ctrl.sv:884) [ASSERT FAILED] LcInitDoneSticky_A
UVM_INFO @ 176.940000 us: (uvm_report_catcher.svh:705) [UVM/REPORT/CATCHER]
--- UVM Report catcher Summary ---
UVM_ERROR @ * us: (sw_logger_if.sv:526) [rstmgr_alert_info_test_sim_dv(sw/device/lib/testing/alert_handler_testutils.c:78)] CHECK-fail: word_index < dump_size 1 test run
chip_sw_rstmgr_alert_info 34373909360860487399640274916925287101549569985890989668727232785215939080524 349
UVM_INFO @ 331.228000 us: (uvm_report_catcher.svh:705) [UVM/REPORT/CATCHER]
--- UVM Report catcher Summary ---
UVM_ERROR @ * us: (chip_sw_soc_proxy_smoke_vseq.sv:36) [chip_env_pkg::\chip_sw_soc_proxy_smoke_vseq::body ] Resets did not complete within required time! 1 test run
chip_sw_soc_proxy_smoketest 85847090979573102103902325750474053581816301251443244331555268556655010852862 328
UVM_INFO @ 156.320000 us: (uvm_report_catcher.svh:705) [UVM/REPORT/CATCHER]
--- UVM Report catcher Summary ---
UVM_ERROR @ * us: (sw_logger_if.sv:526) [soc_proxy_external_wakeup_sim_dv(sw/device/tests/soc_proxy_external_wakeup.c:50)] DIF-fail: dif_pwrmgr_get_request_sources(&pwrmgr, kDifPwrmgrReqTypeWakeup, &wakeup_req_srcs) returns * 1 test run
chip_sw_soc_proxy_external_wakeup 36997595848172668614435269897607328844601540495437334867950854274026361425406 326
UVM_INFO @ 157.913000 us: (uvm_report_catcher.svh:705) [UVM/REPORT/CATCHER]
--- UVM Report catcher Summary ---
UVM_ERROR @ * us: (sw_logger_if.sv:526) [aon_timer_irq_test_sim_dv(sw/device/tests/aon_timer_irq_test.c:139)] CHECK-fail: Timer took * usec which is not in the range * usec and * usec 1 test run
chip_sw_aon_timer_irq 89972616784170951013667120781986584413577385857862128752650496055390292057860 327
UVM_INFO @ 503.397000 us: (uvm_report_catcher.svh:705) [UVM/REPORT/CATCHER]
--- UVM Report catcher Summary ---
UVM_ERROR @ * us: (sw_logger_if.sv:526) [aon_timer_wdog_bite_reset_test_sim_dv(sw/device/tests/aon_timer_wdog_bite_reset_test.c:84)] CHECK-fail: Wdog bark irq did not rise after * microseconds 1 test run
chip_sw_aon_timer_wdog_bite_reset 55064319386687658492441367709188420562165569577962575951126055779634728026348 328
UVM_INFO @ 182.604000 us: (uvm_report_catcher.svh:705) [UVM/REPORT/CATCHER]
--- UVM Report catcher Summary ---
UVM_ERROR @ * us: (sw_logger_if.sv:526) [rv_core_ibex_nmi_irq_test_sim_dv(sw/device/tests/rv_core_ibex_nmi_irq_test.c:172)] CHECK-fail: Timed out after * usec (* CPU cycles) waiting for nmi_fired 1 test run
chip_sw_rv_core_ibex_nmi_irq 79870313573845167676757038949697626501551224908586102679437935897408189440366 329
UVM_INFO @ 269.301000 us: (uvm_report_catcher.svh:705) [UVM/REPORT/CATCHER]
--- UVM Report catcher Summary ---
UVM_ERROR @ * us: (cip_base_scoreboard.sv:689) scoreboard [scoreboard] On interface chip_soc_mbx_reg_block, item had unexpected d_error value(predicted *, but saw *). 1 test run
chip_tl_errors 105099306832705172708552981090409673798587397359854000420138032134740887257002 238
TL item was: req: (cip_tl_seq_item@31524) { a_addr: 'h1465510 a_data: 'hcd0b6119 a_mask: 'ha a_size: 'h2 a_param: 'h0 a_source: 'ha1 a_opcode: 'h1 a_user: 'h27719 d_param: 'h0 d_source: 'ha1 d_data: 'h0 d_size: 'h2 d_opcode: 'h0 d_error: 'h0 d_sink: 'h0 d_user: 'h1caa a_valid_delay: 'h0 d_valid_delay: 'h0 a_valid_len: 'h0 d_valid_len: 'h0 req_abort_after_a_valid_len: 'h0 rsp_abort_after_d_valid_len: 'h0 req_completed: 'h0 rsp_completed: 'h0 tl_intg_err_type: TlIntgErrNone max_ecc_errors: 'h3 }
Reasons for predicted error: '{"Unsupported partial write"} .
UVM_INFO @ 118.075000 us: (uvm_report_catcher.svh:705) [UVM/REPORT/CATCHER]
--- UVM Report catcher Summary ---
UVM_ERROR @ * us: (cip_base_vseq.sv:660) [chip_rv_dm_lc_disabled_vseq] Check failed masked_data == exp_data (* [*] vs * [*]) addr * read out mismatch 1 test run
chip_rv_dm_lc_disabled 45347669463629145669990653179626578454156337771196620347410735100130658021836 248
UVM_INFO @ 504.759000 us: (uvm_report_catcher.svh:705) [UVM/REPORT/CATCHER]
--- UVM Report catcher Summary ---
Error-[CNST-CIF] Constraints inconsistency failure 1 test run
chip_padctrl_attributes 70303852740894567226930372813054499685232101952268667711122890186230971378767 288
src/lowrisc_dv_dv_lib_0/dv_base_test.sv, 143
Constraints are inconsistent and cannot be solved.
Please check the inconsistent constraints being printed above and rewrite
them.
UVM_ERROR @ * us: (sw_logger_if.sv:526) [dma_abort_sim_dv(sw/device/tests/dma_abort.c:77)] CHECK-fail: Timed out after * usec (* CPU cycles) waiting for kSoftwareBarrier == * 1 test run
chip_sw_dma_abort 66619863408890974169540682762189776776006087996954343938496800103502092219001 332
UVM_INFO @ 211.731000 us: (uvm_report_catcher.svh:705) [UVM/REPORT/CATCHER]
--- UVM Report catcher Summary ---